{"text_format":"1","workbook":"xlsx","n_sheets":4,"sheets":["Bestillingsskjema","Database","kontaktinfo","Lister"],"not_rendered":{"charts":0,"images":2,"macros":1,"external_links":0,"defined_names":7,"comments":0,"pivot_tables":0},"unopened":[],"bounds":{"document_bytes":16777216,"sheet_cells":100000,"rows_first":2000,"rows_last":500,"rows_between":2000,"halvings":0,"cell_chars":16384,"cell_head_chars":4096},"cells_cut":0,"cells_raw":0,"read":"whole","date_system":"1900"}

{"sheet":"Bestillingsskjema","index":0,"n_rows":51,"n_cols":17,"rows_kept":51,"cut":false,"hidden":false,"merged":[[7,2,7,5],[9,2,9,5],[11,2,11,5],[9,7,44,10]]}
[]
[null,null,null,null,null,null,null,null,null,null,null,null,null,{"$f":"VLOOKUP(C8,Lister!$C$2:$D$6,1,FALSE)","v":"Nord RHF"}]
[]
[]
[null,null,"Bestillingsskjema for Konsulenttjenester IKT",null,null,null,null,null,null,null,null,null,null,{"$f":"VLOOKUP(C8,FINN_OMRÅDE,2,FALSE)","v":"Nord "}]
[null,null,null,null,null,null,null,null,null,null,null,null,null,{"$f":"VLOOKUP(C10,Lister!$E$2:$E$32,1,FALSE)","v":"D: Informasjonssikkerhet og ROS-analyser"}]
[]
[null,null,"Nord RHF",null,null,null,null,"Veiledning til bestillingsskjema"]
[]
[null,null,"D: Informasjonssikkerhet og ROS-analyser",null,null,null,null,"Dette bestillingsskjemaet gjelder for avtalen Konsulenttjenester IKT hvor bestillere skal avrope med minikonkurranser på alle oppdrag. \nLikelydende forespørsler om konsulent(er) skal sendes til alle avtaleleverandører innen det delområdet forespørselen gjelder. \n\nI dette bestillingsskjemaet ligger kontaktinformasjon til alle leverandørene. \nVed å bruke dette skjemaet genereres det automatisk e-post til alle avtaleleverandører for valgt region og valgt delområde. \n\nHvordan benytte bestillingsskjemaet:\n1. Velg ditt regionale helseforetak fra nedtrekksmenyen\n2. Velg delområde oppdraget faller inn under\n3. Klikk for å generere e-post til alle avtaleleverandører\n4. Legg ved Oppdragsbeskrivelsen som et vedlegg i denne e-posten\n5. Send.\n\nDersom outlook ikke åpner seg når du gjennomfører punkt 3, må du gjøre følgende:\n1. Klikk på start-knappen i windows: \n2. Velg \"Kontrollpanel\"\n3. Velg \"Standardprogrammer\"\n4. Velg \"Angi standardprogrammer\"\n5. Velg \"Outlook\" fra listen til venstre\"\n6. Klikk på \"Angi dette programmet som standard\"\n7. Klikk \"OK\"\n8. Nå skal e-posten til avtaleleverandørene genereres nå du trykker på knappen i bestillingsskjemaet."]
[]
[]
[]
[null,null,null,{"$f":"\"Avtaleleverandører i alfabetisk rekkefølge - \"&C10","v":"Avtaleleverandører i alfabetisk rekkefølge - D: Informasjonssikkerhet og ROS-analyser"},null,null,null,null,null,null,null,null,{"$f":"IF(D14>0,\"\",\"x\")","v":""}]
[]
[null,null,"Antall","Leverandør","E-post","Telefon",null,null,null,null,null,null,{"$f":"IF(D16>0,\"\",\"x\")","v":""}]
[null,null,1,{"$f":"VLOOKUP($N17,Database!$A$2:$R$3057,5,FALSE)","v":"A-2 Norge AS"},{"$f":"VLOOKUP($N17,Database!$A$2:$R$3057,6,FALSE)","v":"utlysninger@a-2.no"},{"$f":"VLOOKUP($N17,Database!$A$2:$R$3057,7,FALSE)","v":0},null,null,null,null,null,null,"",{"$f":"$N$2&$N$6&$C$17","v":"Nord RHFD: Informasjonssikkerhet og ROS-analyser1"},null,{"$f":"IF(D17>0,E17,\"\")","v":"utlysninger@a-2.no"}]
[null,null,2,{"$f":"VLOOKUP($N18,Database!$A$2:$R$3057,5,FALSE)","v":"Accenture AS "},{"$f":"VLOOKUP($N18,Database!$A$2:$R$3057,6,FALSE)","v":"rammeavtale.helse@accenture.com"},{"$f":"VLOOKUP($N18,Database!$A$2:$R$3057,7,FALSE)","v":0},null,null,null,null,null,null,"",{"$f":"$N$2&$N$6&$C$18","v":"Nord RHFD: Informasjonssikkerhet og ROS-analyser2"},null,{"$f":"IF(D18>0,E18,\"\")","v":"rammeavtale.helse@accenture.com"}]
[null,null,3,{"$f":"VLOOKUP($N19,Database!$A$2:$R$3057,5,FALSE)","v":"Systra Norge AS "},{"$f":"VLOOKUP($N19,Database!$A$2:$R$3057,6,FALSE)","v":"firmapost@systra.com"},{"$f":"VLOOKUP($N19,Database!$A$2:$R$3057,7,FALSE)","v":0},null,null,null,null,null,null,"",{"$f":"$N$2&$N$6&$C$19","v":"Nord RHFD: Informasjonssikkerhet og ROS-analyser3"},null,"firmapost@systra.com"]
[null,null,4,{"$f":"VLOOKUP($N20,Database!$A$2:$R$3057,5,FALSE)","v":"Bouvet Norge AS "},{"$f":"VLOOKUP($N20,Database!$A$2:$R$3057,6,FALSE)","v":"Sykehusinnkjop2023@bouvet.no"},{"$f":"VLOOKUP($N20,Database!$A$2:$R$3057,7,FALSE)","v":0},null,null,null,null,null,null,"",{"$f":"$N$2&$N$6&$C$20","v":"Nord RHFD: Informasjonssikkerhet og ROS-analyser4"},null,"Sykehusinnkjop2023@bouvet.no"]
[null,null,5,{"$f":"VLOOKUP($N21,Database!$A$2:$R$3057,5,FALSE)","v":"Capgemini Norge AS "},{"$f":"VLOOKUP($N21,Database!$A$2:$R$3057,6,FALSE)","v":"helsenord.no@capgemini.com"},{"$f":"VLOOKUP($N21,Database!$A$2:$R$3057,7,FALSE)","v":0},null,null,null,null,null,null,"",{"$f":"$N$2&$N$6&$C$21","v":"Nord RHFD: Informasjonssikkerhet og ROS-analyser5"},null,"helsenord.no@capgemini.com"]
[null,null,6,{"$f":"VLOOKUP($N22,Database!$A$2:$R$3057,5,FALSE)","v":"Deloitte AS "},{"$f":"VLOOKUP($N22,Database!$A$2:$R$3057,6,FALSE)","v":"noanbud@DELOITTE.no"},{"$f":"VLOOKUP($N22,Database!$A$2:$R$3057,7,FALSE)","v":0},null,null,null,null,null,null,"",{"$f":"$N$2&$N$6&$C$22","v":"Nord RHFD: Informasjonssikkerhet og ROS-analyser6"},null,"noanbud@DELOITTE.no"]
[null,null,7,{"$f":"VLOOKUP($N23,Database!$A$2:$R$3057,5,FALSE)","v":"Emagine AS "},{"$f":"VLOOKUP($N23,Database!$A$2:$R$3057,6,FALSE)","v":"sykehusinnkjop@emagine.no"},{"$f":"VLOOKUP($N23,Database!$A$2:$R$3057,7,FALSE)","v":0},null,null,null,null,null,null,"",{"$f":"$N$2&$N$6&$C$23","v":"Nord RHFD: Informasjonssikkerhet og ROS-analyser7"},null,"sykehusinnkjop@emagine.no"]
[null,null,8,{"$f":"VLOOKUP($N24,Database!$A$2:$R$3057,5,FALSE)","v":"Ernst & Young AS "},{"$f":"VLOOKUP($N24,Database!$A$2:$R$3057,6,FALSE)","v":"offentlige.anskaffelser@no.ey.com"},{"$f":"VLOOKUP($N24,Database!$A$2:$R$3057,7,FALSE)","v":0},null,null,null,null,null,null,"",{"$f":"$N$2&$N$6&$C$24","v":"Nord RHFD: Informasjonssikkerhet og ROS-analyser8"},null,"offentlige.anskaffelser@no.ey.com"]
[null,null,9,{"$f":"VLOOKUP($N25,Database!$A$2:$R$3057,5,FALSE)","v":"Ework Group Norway AS "},{"$f":"VLOOKUP($N25,Database!$A$2:$R$3057,6,FALSE)","v":"sykehusinnkjop@eworkgroup.com  "},{"$f":"VLOOKUP($N25,Database!$A$2:$R$3057,7,FALSE)","v":0},null,null,null,null,null,null,"",{"$f":"$N$2&$N$6&$C$25","v":"Nord RHFD: Informasjonssikkerhet og ROS-analyser9"},null,"sykehusinnkjop@eworkgroup.com  "]
[null,null,10,{"$f":"VLOOKUP($N26,Database!$A$2:$R$3057,5,FALSE)","v":"Experis AS "},{"$f":"VLOOKUP($N26,Database!$A$2:$R$3057,6,FALSE)","v":"sykehusinnkjop@no.experis.com"},{"$f":"VLOOKUP($N26,Database!$A$2:$R$3057,7,FALSE)","v":0},null,null,null,null,null,null,"",{"$f":"$N$2&$N$6&$C$26","v":"Nord RHFD: Informasjonssikkerhet og ROS-analyser10"},null,"sykehusinnkjop@no.experis.com"]
[null,null,11,{"$f":"VLOOKUP($N27,Database!$A$2:$R$3057,5,FALSE)","v":"IT Consult AS "},{"$f":"VLOOKUP($N27,Database!$A$2:$R$3057,6,FALSE)","v":"firmapost@itc.no"},{"$f":"VLOOKUP($N27,Database!$A$2:$R$3057,7,FALSE)","v":0},null,null,null,null,null,null,"",{"$f":"$N$2&$N$6&$C$27","v":"Nord RHFD: Informasjonssikkerhet og ROS-analyser11"},null,"firmapost@itc.no"]
[null,null,12,{"$f":"VLOOKUP($N28,Database!$A$2:$R$3057,5,FALSE)","v":"KPMG AS "},{"$f":"VLOOKUP($N28,Database!$A$2:$R$3057,6,FALSE)","v":"helse@kpmg.no"},{"$f":"VLOOKUP($N28,Database!$A$2:$R$3057,7,FALSE)","v":0},null,null,null,null,null,null,"",{"$f":"$N$2&$N$6&$C$28","v":"Nord RHFD: Informasjonssikkerhet og ROS-analyser12"},null,"helse@kpmg.no"]
[null,null,13,{"$f":"VLOOKUP($N29,Database!$A$2:$R$3057,5,FALSE)","v":"PricewaterhouseCoopers AS "},{"$f":"VLOOKUP($N29,Database!$A$2:$R$3057,6,FALSE)","v":"no_resepsjon.oslo@pwc.com"},{"$f":"VLOOKUP($N29,Database!$A$2:$R$3057,7,FALSE)","v":0},null,null,null,null,null,null,"",{"$f":"$N$2&$N$6&$C$29","v":"Nord RHFD: Informasjonssikkerhet og ROS-analyser13"},null,"no_resepsjon.oslo@pwc.com"]
[null,null,14,{"$f":"VLOOKUP($N30,Database!$A$2:$R$3057,5,FALSE)","v":"Sopra Steria AS "},{"$f":"VLOOKUP($N30,Database!$A$2:$R$3057,6,FALSE)","v":"helse@soprasteria.com"},{"$f":"VLOOKUP($N30,Database!$A$2:$R$3057,7,FALSE)","v":0},null,null,null,null,null,null,"",{"$f":"$N$2&$N$6&$C$30","v":"Nord RHFD: Informasjonssikkerhet og ROS-analyser14"},null,"helse@soprasteria.com"]
[null,null,15,{"$f":"VLOOKUP($N31,Database!$A$2:$R$3057,5,FALSE)","v":"Advisense AS"},{"$f":"VLOOKUP($N31,Database!$A$2:$R$3057,6,FALSE)","v":"offentlig@transcendentgroup.com "},{"$f":"VLOOKUP($N31,Database!$A$2:$R$3057,7,FALSE)","v":0},null,null,null,null,null,null,"",{"$f":"$N$2&$N$6&$C$31","v":"Nord RHFD: Informasjonssikkerhet og ROS-analyser15"},null,"offentlig@transcendentgroup.com "]
[null,null,16,{"$f":"VLOOKUP($N32,Database!$A$2:$R$3057,5,FALSE)","v":0},{"$f":"VLOOKUP($N32,Database!$A$2:$R$3057,6,FALSE)","v":""},{"$f":"VLOOKUP($N32,Database!$A$2:$R$3057,7,FALSE)","v":0},null,null,null,null,null,null,"x",{"$f":"$N$2&$N$6&$C$32","v":"Nord RHFD: Informasjonssikkerhet og ROS-analyser16"},null,""]
[null,null,17,{"$f":"VLOOKUP($N33,Database!$A$2:$R$3057,5,FALSE)","v":0},{"$f":"VLOOKUP($N33,Database!$A$2:$R$3057,6,FALSE)","v":""},{"$f":"VLOOKUP($N33,Database!$A$2:$R$3057,7,FALSE)","v":0},null,null,null,null,null,null,"x",{"$f":"$N$2&$N$6&$C$33","v":"Nord RHFD: Informasjonssikkerhet og ROS-analyser17"},null,""]
[null,null,18,{"$f":"VLOOKUP($N34,Database!$A$2:$R$3057,5,FALSE)","v":0},{"$f":"VLOOKUP($N34,Database!$A$2:$R$3057,6,FALSE)","v":""},{"$f":"VLOOKUP($N34,Database!$A$2:$R$3057,7,FALSE)","v":0},null,null,null,null,null,null,"x",{"$f":"$N$2&$N$6&$C$34","v":"Nord RHFD: Informasjonssikkerhet og ROS-analyser18"},null,""]
[null,null,19,{"$f":"VLOOKUP($N35,Database!$A$2:$R$3057,5,FALSE)","v":0},{"$f":"VLOOKUP($N35,Database!$A$2:$R$3057,6,FALSE)","v":""},{"$f":"VLOOKUP($N35,Database!$A$2:$R$3057,7,FALSE)","v":0},null,null,null,null,null,null,"x",{"$f":"$N$2&$N$6&$C$35","v":"Nord RHFD: Informasjonssikkerhet og ROS-analyser19"},null,""]
[null,null,20,{"$f":"VLOOKUP($N36,Database!$A$2:$R$3057,5,FALSE)","v":0},{"$f":"VLOOKUP($N36,Database!$A$2:$R$3057,6,FALSE)","v":""},{"$f":"VLOOKUP($N36,Database!$A$2:$R$3057,7,FALSE)","v":0},null,null,null,null,null,null,"x",{"$f":"$N$2&$N$6&$C$36","v":"Nord RHFD: Informasjonssikkerhet og ROS-analyser20"},null,""]
[null,null,21,{"$f":"VLOOKUP($N37,Database!$A$2:$R$3057,5,FALSE)","v":0},{"$f":"VLOOKUP($N37,Database!$A$2:$R$3057,6,FALSE)","v":""},{"$f":"VLOOKUP($N37,Database!$A$2:$R$3057,7,FALSE)","v":0},null,null,null,null,null,null,"x",{"$f":"$N$2&$N$6&$C$37","v":"Nord RHFD: Informasjonssikkerhet og ROS-analyser21"},null,""]
[null,null,22,{"$f":"VLOOKUP($N38,Database!$A$2:$R$3057,5,FALSE)","v":0},{"$f":"VLOOKUP($N38,Database!$A$2:$R$3057,6,FALSE)","v":""},{"$f":"VLOOKUP($N38,Database!$A$2:$R$3057,7,FALSE)","v":0},null,null,null,null,null,null,"x",{"$f":"$N$2&$N$6&$C$38","v":"Nord RHFD: Informasjonssikkerhet og ROS-analyser22"},null,""]
[null,null,23,{"$f":"VLOOKUP($N39,Database!$A$2:$R$3057,5,FALSE)","v":0},{"$f":"VLOOKUP($N39,Database!$A$2:$R$3057,6,FALSE)","v":""},{"$f":"VLOOKUP($N39,Database!$A$2:$R$3057,7,FALSE)","v":0},null,null,null,null,null,null,"x",{"$f":"$N$2&$N$6&$C$39","v":"Nord RHFD: Informasjonssikkerhet og ROS-analyser23"},null,""]
[null,null,24,{"$f":"VLOOKUP($N40,Database!$A$2:$R$3057,5,FALSE)","v":0},{"$f":"VLOOKUP($N40,Database!$A$2:$R$3057,6,FALSE)","v":""},{"$f":"VLOOKUP($N40,Database!$A$2:$R$3057,7,FALSE)","v":0},null,null,null,null,null,null,"x",{"$f":"$N$2&$N$6&$C$40","v":"Nord RHFD: Informasjonssikkerhet og ROS-analyser24"},null,""]
{"$rows_left_out":12}
{"sheet":"Database","index":1,"n_rows":3057,"n_cols":18,"rows_kept":3057,"cut":false,"hidden":true,"merged":[]}
["Kode","Område","Delområde","Rangering","Leverandør","E-post","Telefon","Kolonne3","Kolonne4","Kolonne5","Kolonne6","Kolonne7","Kolonne8","Kolonne9","Kolonne10","Kolonne11","Kolonne12","Kolonne13"]
[{"$f":"Database!$B2&Database!$C2&Database!$D2","v":"Nord RHFA: Program og Prosjektgjennomføring1"},"Nord RHF","A: Program og Prosjektgjennomføring",1,"A-2 Norge AS","utlysninger@a-2.no"]
[{"$f":"Database!$B3&Database!$C3&Database!$D3","v":"Nord RHFA: Program og Prosjektgjennomføring2"},"Nord RHF","A: Program og Prosjektgjennomføring",2,"Accenture AS ","rammeavtale.helse@accenture.com"]
[{"$f":"Database!$B4&Database!$C4&Database!$D4","v":"Nord RHFA: Program og Prosjektgjennomføring3"},"Nord RHF","A: Program og Prosjektgjennomføring",3,"Systra Norge AS ","firmapost@systra.com"]
[{"$f":"Database!$B5&Database!$C5&Database!$D5","v":"Nord RHFA: Program og Prosjektgjennomføring4"},"Nord RHF","A: Program og Prosjektgjennomføring",4,"Bouvet Norge AS ","Sykehusinnkjop2023@bouvet.no"]
[{"$f":"Database!$B6&Database!$C6&Database!$D6","v":"Nord RHFA: Program og Prosjektgjennomføring5"},"Nord RHF","A: Program og Prosjektgjennomføring",5,"Capgemini Norge AS ","helsenord.no@capgemini.com"]
[{"$f":"Database!$B7&Database!$C7&Database!$D7","v":"Nord RHFA: Program og Prosjektgjennomføring6"},"Nord RHF","A: Program og Prosjektgjennomføring",6,"Deloitte AS ","noanbud@DELOITTE.no"]
[{"$f":"Database!$B8&Database!$C8&Database!$D8","v":"Nord RHFA: Program og Prosjektgjennomføring7"},"Nord RHF","A: Program og Prosjektgjennomføring",7,"Dfind Consulting AS ","consulting@dfind.no"]
[{"$f":"Database!$B9&Database!$C9&Database!$D9","v":"Nord RHFA: Program og Prosjektgjennomføring8"},"Nord RHF","A: Program og Prosjektgjennomføring",8,"Digital Workforce AS ","info@digitalworkforce.com"]
[{"$f":"Database!$B10&Database!$C10&Database!$D10","v":"Nord RHFA: Program og Prosjektgjennomføring9"},"Nord RHF","A: Program og Prosjektgjennomføring",9,"Emagine AS ","sykehusinnkjop@emagine.no"]
[{"$f":"Database!$B11&Database!$C11&Database!$D11","v":"Nord RHFA: Program og Prosjektgjennomføring10"},"Nord RHF","A: Program og Prosjektgjennomføring",10,"Ernst & Young AS ","offentlige.anskaffelser@no.ey.com"]
[{"$f":"Database!$B12&Database!$C12&Database!$D12","v":"Nord RHFA: Program og Prosjektgjennomføring11"},"Nord RHF","A: Program og Prosjektgjennomføring",11,"Ework Group Norway AS ","sykehusinnkjop@eworkgroup.com  "]
[{"$f":"Database!$B13&Database!$C13&Database!$D13","v":"Nord RHFA: Program og Prosjektgjennomføring12"},"Nord RHF","A: Program og Prosjektgjennomføring",12,"Experis AS ","sykehusinnkjop@no.experis.com"]
[{"$f":"Database!$B14&Database!$C14&Database!$D14","v":"Nord RHFA: Program og Prosjektgjennomføring13"},"Nord RHF","A: Program og Prosjektgjennomføring",13,"KPMG AS ","helse@kpmg.no"]
[{"$f":"Database!$B15&Database!$C15&Database!$D15","v":"Nord RHFA: Program og Prosjektgjennomføring14"},"Nord RHF","A: Program og Prosjektgjennomføring",14,"Metier AS ","firmapost@metier.no"]
[{"$f":"Database!$B16&Database!$C16&Database!$D16","v":"Nord RHFA: Program og Prosjektgjennomføring15"},"Nord RHF","A: Program og Prosjektgjennomføring",15,"Netcompany AS ","anbud.no@netcompany.com "]
[{"$f":"Database!$B17&Database!$C17&Database!$D17","v":"Nord RHFA: Program og Prosjektgjennomføring16"},"Nord RHF","A: Program og Prosjektgjennomføring",16,"Nordlo Grenland AS","firmapost.grenland@nordlo.com"]
[{"$f":"Database!$B18&Database!$C18&Database!$D18","v":"Nord RHFA: Program og Prosjektgjennomføring17"},"Nord RHF","A: Program og Prosjektgjennomføring",17,"PricewaterhouseCoopers AS ","no_resepsjon.oslo@pwc.com"]
[{"$f":"Database!$B19&Database!$C19&Database!$D19","v":"Nord RHFA: Program og Prosjektgjennomføring18"},"Nord RHF","A: Program og Prosjektgjennomføring",18,"Solea AS (tidl Rainfall AS )","avrop@solea.no"]
[{"$f":"Database!$B20&Database!$C20&Database!$D20","v":"Nord RHFA: Program og Prosjektgjennomføring19"},"Nord RHF","A: Program og Prosjektgjennomføring",19,"Sopra Steria AS ","helse@soprasteria.com"]
[{"$f":"Database!$B21&Database!$C21&Database!$D21","v":"Nord RHFA: Program og Prosjektgjennomføring20"},"Nord RHF","A: Program og Prosjektgjennomføring",20,"The Boston Consulting Group Nordic AB ","anbud@bcg.com"]
[{"$f":"Database!$B22&Database!$C22&Database!$D22","v":"Nord RHFA: Program og Prosjektgjennomføring21"},"Nord RHF","A: Program og Prosjektgjennomføring",21,null,""]
[{"$f":"Database!$B23&Database!$C23&Database!$D23","v":"Nord RHFA: Program og Prosjektgjennomføring22"},"Nord RHF","A: Program og Prosjektgjennomføring",22,null,""]
[{"$f":"Database!$B24&Database!$C24&Database!$D24","v":"Nord RHFA: Program og Prosjektgjennomføring23"},"Nord RHF","A: Program og Prosjektgjennomføring",23,null,""]
[{"$f":"Database!$B25&Database!$C25&Database!$D25","v":"Nord RHFA: Program og Prosjektgjennomføring24"},"Nord RHF","A: Program og Prosjektgjennomføring",24,null,""]
[{"$f":"Database!$B26&Database!$C26&Database!$D26","v":"Nord RHFA: Program og Prosjektgjennomføring25"},"Nord RHF","A: Program og Prosjektgjennomføring",25,null,""]
[{"$f":"Database!$B27&Database!$C27&Database!$D27","v":"Nord RHFA: Program og Prosjektgjennomføring26"},"Nord RHF","A: Program og Prosjektgjennomføring",26,null,""]
[{"$f":"Database!$B28&Database!$C28&Database!$D28","v":"Nord RHFA: Program og Prosjektgjennomføring27"},"Nord RHF","A: Program og Prosjektgjennomføring",27,null,""]
[{"$f":"Database!$B29&Database!$C29&Database!$D29","v":"Nord RHFA: Program og Prosjektgjennomføring28"},"Nord RHF","A: Program og Prosjektgjennomføring",28,null,""]
[{"$f":"Database!$B30&Database!$C30&Database!$D30","v":"Nord RHFA: Program og Prosjektgjennomføring29"},"Nord RHF","A: Program og Prosjektgjennomføring",29,null,""]
[{"$f":"Database!$B31&Database!$C31&Database!$D31","v":"Nord RHFA: Program og Prosjektgjennomføring30"},"Nord RHF","A: Program og Prosjektgjennomføring",30,null,""]
[{"$f":"Database!$B32&Database!$C32&Database!$D32","v":"Nord RHFA: Program og Prosjektgjennomføring31"},"Nord RHF","A: Program og Prosjektgjennomføring",31,null,""]
[{"$f":"Database!$B33&Database!$C33&Database!$D33","v":"Nord RHFA: Program og Prosjektgjennomføring32"},"Nord RHF","A: Program og Prosjektgjennomføring",32,null,""]
[{"$f":"Database!$B34&Database!$C34&Database!$D34","v":"Nord RHFA: Program og Prosjektgjennomføring33"},"Nord RHF","A: Program og Prosjektgjennomføring",33,null,""]
[{"$f":"Database!$B35&Database!$C35&Database!$D35","v":"Nord RHFA: Program og Prosjektgjennomføring34"},"Nord RHF","A: Program og Prosjektgjennomføring",34,null,""]
[{"$f":"Database!$B36&Database!$C36&Database!$D36","v":""},null,null,null,null,""]
[{"$f":"Database!$B37&Database!$C37&Database!$D37","v":"Nord RHFB: Strategiplanlegging, rådgivning og innovasjon1"},"Nord RHF","B: Strategiplanlegging, rådgivning og innovasjon",1,"A-2 Norge AS","utlysninger@a-2.no"]
[{"$f":"Database!$B38&Database!$C38&Database!$D38","v":"Nord RHFB: Strategiplanlegging, rådgivning og innovasjon2"},"Nord RHF","B: Strategiplanlegging, rådgivning og innovasjon",2,"Systra Norge AS ","firmapost@systra.com"]
[{"$f":"Database!$B39&Database!$C39&Database!$D39","v":"Nord RHFB: Strategiplanlegging, rådgivning og innovasjon3"},"Nord RHF","B: Strategiplanlegging, rådgivning og innovasjon",3,"Bouvet Norge AS ","Sykehusinnkjop2023@bouvet.no"]
[{"$f":"Database!$B40&Database!$C40&Database!$D40","v":"Nord RHFB: Strategiplanlegging, rådgivning og innovasjon4"},"Nord RHF","B: Strategiplanlegging, rådgivning og innovasjon",4,"Capgemini Norge AS ","helsenord.no@capgemini.com"]
{"$rows_left_out":3018}
{"sheet":"kontaktinfo","index":2,"n_rows":537,"n_cols":4,"rows_kept":537,"cut":false,"hidden":true,"merged":[]}
["Leverandør","Delkontrakt","RHF","Generisk epost"]
["A-2 Norge AS","A. Program- og prosjektgjennomføring","Helse Nord","utlysninger@a-2.no"]
["A-2 Norge AS","A. Program- og prosjektgjennomføring","Helse Sør-Øst","utlysninger@a-2.no"]
["A-2 Norge AS","A. Program- og prosjektgjennomføring","Helse Midt-Norge","utlysninger@a-2.no"]
["A-2 Norge AS","A. Program- og prosjektgjennomføring","Helse Vest","utlysninger@a-2.no"]
["A-2 Norge AS","B. Strategiplanlegging, rådgivning og innovasjon","Helse Nord","utlysninger@a-2.no"]
["A-2 Norge AS","B. Strategiplanlegging, rådgivning og innovasjon","Helse Sør-Øst","utlysninger@a-2.no"]
["A-2 Norge AS","B. Strategiplanlegging, rådgivning og innovasjon","Helse Midt-Norge","utlysninger@a-2.no"]
["A-2 Norge AS","B. Strategiplanlegging, rådgivning og innovasjon","Helse Vest","utlysninger@a-2.no"]
["A-2 Norge AS","C. Arkitektur","Helse Nord","utlysninger@a-2.no"]
["A-2 Norge AS","C. Arkitektur","Helse Sør-Øst","utlysninger@a-2.no"]
["A-2 Norge AS","C. Arkitektur","Helse Midt-Norge","utlysninger@a-2.no"]
["A-2 Norge AS","C. Arkitektur","Helse Vest","utlysninger@a-2.no"]
["A-2 Norge AS","D. Informasjonssikkerhet og ROS-analyser","Helse Nord","utlysninger@a-2.no"]
["A-2 Norge AS","D. Informasjonssikkerhet og ROS-analyser","Helse Sør-Øst","utlysninger@a-2.no"]
["A-2 Norge AS","D. Informasjonssikkerhet og ROS-analyser","Helse Midt-Norge","utlysninger@a-2.no"]
["A-2 Norge AS","D. Informasjonssikkerhet og ROS-analyser","Helse Vest","utlysninger@a-2.no"]
["A-2 Norge AS","E. Test og release","Helse Nord","utlysninger@a-2.no"]
["A-2 Norge AS","E. Test og release","Helse Midt-Norge","utlysninger@a-2.no"]
["A-2 Norge AS","E. Test og release","Helse Vest","utlysninger@a-2.no"]
["A-2 Norge AS","F. Systemutvikling","Helse Nord","utlysninger@a-2.no"]
["A-2 Norge AS","F. Systemutvikling","Helse Midt-Norge","utlysninger@a-2.no"]
["A-2 Norge AS","F. Systemutvikling","Helse Vest","utlysninger@a-2.no"]
["A-2 Norge AS","G. Applikasjonsforvaltning, drift og forvaltning av IT-systemer og plattformer","Helse Nord","utlysninger@a-2.no"]
["A-2 Norge AS","G. Applikasjonsforvaltning, drift og forvaltning av IT-systemer og plattformer","Helse Sør-Øst","utlysninger@a-2.no"]
["A-2 Norge AS","G. Applikasjonsforvaltning, drift og forvaltning av IT-systemer og plattformer","Helse Midt-Norge","utlysninger@a-2.no"]
["A-2 Norge AS","G. Applikasjonsforvaltning, drift og forvaltning av IT-systemer og plattformer","Helse Vest","utlysninger@a-2.no"]
["A-2 Norge AS","H. Nettverk","Helse Nord","utlysninger@a-2.no"]
["A-2 Norge AS","H. Nettverk","Helse Sør-Øst","utlysninger@a-2.no"]
["A-2 Norge AS","H. Nettverk","Helse Midt-Norge","utlysninger@a-2.no"]
["A-2 Norge AS","H. Nettverk","Helse Vest","utlysninger@a-2.no"]
["A-2 Norge AS","I. Telekommunikasjon","Helse Nord","utlysninger@a-2.no"]
["A-2 Norge AS","I. Telekommunikasjon","Helse Sør-Øst","utlysninger@a-2.no"]
["A-2 Norge AS","I. Telekommunikasjon","Helse Midt-Norge","utlysninger@a-2.no"]
["A-2 Norge AS","I. Telekommunikasjon","Helse Vest","utlysninger@a-2.no"]
["A-2 Norge AS","J. Tverrfaglige team","Helse Nord","utlysninger@a-2.no"]
["A-2 Norge AS","J. Tverrfaglige team","Helse Sør-Øst","utlysninger@a-2.no"]
["A-2 Norge AS","J. Tverrfaglige team","Helse Midt-Norge","utlysninger@a-2.no"]
["A-2 Norge AS","J. Tverrfaglige team","Helse Vest","utlysninger@a-2.no"]
["Aboveit AS ","E. Test og release","Helse Nord","salg@aboveit.no "]
{"$rows_left_out":498}
{"sheet":"Lister","index":3,"n_rows":49,"n_cols":11,"rows_kept":49,"cut":false,"hidden":true,"merged":[]}
[null,null,"Område","Kolonne1","Delområde",null,null,null,null,null,"Leverandør"]
[null,null,"1 - Velg område fra rullegardinen her","Velg_omr","2 - Velg delområde fra rullegardinen her"]
[null,null,"Nord RHF","Nord ","A: Program og Prosjektgjennomføring"]
[null,null,"Midt-Norge RHF","Midt_Norge ","B: Strategiplanlegging, rådgivning og innovasjon"]
[null,null,"Vest RHF","Vest ","C: Arkitektur"]
[null,null,"Sør-Øst RHF","Sør_Øst","D: Informasjonssikkerhet og ROS-analyser"]
[null,null,null,null,"E: Test og release"]
[null,null,null,null,"F: Systemutvikling"]
[null,null,null,null,"G: Applikasjonsforvaltning, drift og forvaltning av IT-systemer og plattformer"]
[null,null,null,null,"H: Nettverk"]
[null,null,null,null,"I: Telekommunikasjon"]
[null,null,null,null,"J: Tverrfaglige team"]
[]
[]
[]
[]
[]
[]
[]
[]
[]
[]
[]
[]
[]
[]
[]
[]
[]
[]
[]
[]
[]
[]
[]
[]
[]
["Velg_omr",null,"Nord",null,"Midt_Norge","Vest","Sør_Øst"]
["2 - Velg delområde fra rullegardinen her",null,"2 - Velg delområde fra rullegardinen her",null,"2 - Velg delområde fra rullegardinen her","2 - Velg delområde fra rullegardinen her","2 - Velg delområde fra rullegardinen her"]
[null,null,"A: Program og Prosjektgjennomføring",null,"A: Program og Prosjektgjennomføring","A: Program og Prosjektgjennomføring","A: Program og Prosjektgjennomføring"]
{"$rows_left_out":9}