{"text_format":"1","workbook":"xlsx","n_sheets":4,"sheets":["Bestillingsskjema","Database","kontaktinfo","Lister"],"not_rendered":{"charts":0,"images":2,"macros":1,"external_links":0,"defined_names":7,"comments":0,"pivot_tables":0},"unopened":[],"bounds":{"document_bytes":16777216,"sheet_cells":100000,"rows_first":2000,"rows_last":500,"rows_between":2000,"halvings":0,"cell_chars":16384,"cell_head_chars":4096},"cells_cut":0,"cells_raw":0,"read":"whole","date_system":"1900"}

{"sheet":"Bestillingsskjema","index":0,"n_rows":51,"n_cols":17,"rows_kept":51,"cut":false,"hidden":false,"merged":[[7,2,7,5],[9,2,9,5],[11,2,11,5],[9,7,44,10]]}
[]
[null,null,null,null,null,null,null,null,null,null,null,null,null,{"$f":"VLOOKUP(C8,Lister!$C$2:$D$6,1,FALSE)","v":"Nord RHF"}]
[]
[]
[null,null,"Bestillingsskjema for Konsulenttjenester IKT",null,null,null,null,null,null,null,null,null,null,{"$f":"VLOOKUP(C8,FINN_OMRÅDE,2,FALSE)","v":"Nord "}]
[null,null,null,null,null,null,null,null,null,null,null,null,null,{"$f":"VLOOKUP(C10,Lister!$E$2:$E$32,1,FALSE)","v":"D: Informasjonssikkerhet og ROS-analyser"}]
[]
[null,null,"Nord RHF",null,null,null,null,"Veiledning til bestillingsskjema"]
[]
[null,null,"D: Informasjonssikkerhet og ROS-analyser",null,null,null,null,"Dette bestillingsskjemaet gjelder for avtalen Konsulenttjenester IKT hvor bestillere skal avrope med minikonkurranser på alle oppdrag. \nLikelydende forespørsler om konsulent(er) skal sendes til alle avtaleleverandører innen det delområdet forespørselen gjelder. \n\nI dette bestillingsskjemaet ligger kontaktinformasjon til alle leverandørene. \nVed å bruke dette skjemaet genereres det automatisk e-post til alle avtaleleverandører for valgt region og valgt delområde. \n\nHvordan benytte bestillingsskjemaet:\n1. Velg ditt regionale helseforetak fra nedtrekksmenyen\n2. Velg delområde oppdraget faller inn under\n3. Klikk for å generere e-post til alle avtaleleverandører\n4. Legg ved Oppdragsbeskrivelsen som et vedlegg i denne e-posten\n5. Send.\n\nDersom outlook ikke åpner seg når du gjennomfører punkt 3, må du gjøre følgende:\n1. Klikk på start-knappen i windows: \n2. Velg \"Kontrollpanel\"\n3. Velg \"Standardprogrammer\"\n4. Velg \"Angi standardprogrammer\"\n5. Velg \"Outlook\" fra listen til venstre\"\n6. Klikk på \"Angi dette programmet som standard\"\n7. Klikk \"OK\"\n8. Nå skal e-posten til avtaleleverandørene genereres nå du trykker på knappen i bestillingsskjemaet."]
[]
[]
[]
[null,null,null,{"$f":"\"Avtaleleverandører i alfabetisk rekkefølge - \"&C10","v":"Avtaleleverandører i alfabetisk rekkefølge - D: Informasjonssikkerhet og ROS-analyser"},null,null,null,null,null,null,null,null,{"$f":"IF(D14>0,\"\",\"x\")","v":""}]
[]
[null,null,"Antall","Leverandør","E-post","Telefon",null,null,null,null,null,null,{"$f":"IF(D16>0,\"\",\"x\")","v":""}]
[null,null,1,{"$f":"VLOOKUP($N17,Database!$A$2:$R$3057,5,FALSE)","v":"A-2 Norge AS"},{"$f":"VLOOKUP($N17,Database!$A$2:$R$3057,6,FALSE)","v":"utlysninger@a-2.no"},{"$f":"VLOOKUP($N17,Database!$A$2:$R$3057,7,FALSE)","v":0},null,null,null,null,null,null,"",{"$f":"$N$2&$N$6&$C$17","v":"Nord RHFD: Informasjonssikkerhet og ROS-analyser1"},null,{"$f":"IF(D17>0,E17,\"\")","v":"utlysninger@a-2.no"}]
[null,null,2,{"$f":"VLOOKUP($N18,Database!$A$2:$R$3057,5,FALSE)","v":"Accenture AS "},{"$f":"VLOOKUP($N18,Database!$A$2:$R$3057,6,FALSE)","v":"rammeavtale.helse@accenture.com"},{"$f":"VLOOKUP($N18,Database!$A$2:$R$3057,7,FALSE)","v":0},null,null,null,null,null,null,"",{"$f":"$N$2&$N$6&$C$18","v":"Nord RHFD: Informasjonssikkerhet og ROS-analyser2"},null,{"$f":"IF(D18>0,E18,\"\")","v":"rammeavtale.helse@accenture.com"}]
[null,null,3,{"$f":"VLOOKUP($N19,Database!$A$2:$R$3057,5,FALSE)","v":"Systra Norge AS "},{"$f":"VLOOKUP($N19,Database!$A$2:$R$3057,6,FALSE)","v":"firmapost@systra.com"},{"$f":"VLOOKUP($N19,Database!$A$2:$R$3057,7,FALSE)","v":0},null,null,null,null,null,null,"",{"$f":"$N$2&$N$6&$C$19","v":"Nord RHFD: Informasjonssikkerhet og ROS-analyser3"},null,"firmapost@systra.com"]
[null,null,4,{"$f":"VLOOKUP($N20,Database!$A$2:$R$3057,5,FALSE)","v":"Bouvet Norge AS "},{"$f":"VLOOKUP($N20,Database!$A$2:$R$3057,6,FALSE)","v":"Sykehusinnkjop2023@bouvet.no"},{"$f":"VLOOKUP($N20,Database!$A$2:$R$3057,7,FALSE)","v":0},null,null,null,null,null,null,"",{"$f":"$N$2&$N$6&$C$20","v":"Nord RHFD: Informasjonssikkerhet og ROS-analyser4"},null,"Sykehusinnkjop2023@bouvet.no"]
[null,null,5,{"$f":"VLOOKUP($N21,Database!$A$2:$R$3057,5,FALSE)","v":"Capgemini Norge AS "},{"$f":"VLOOKUP($N21,Database!$A$2:$R$3057,6,FALSE)","v":"helsenord.no@capgemini.com"},{"$f":"VLOOKUP($N21,Database!$A$2:$R$3057,7,FALSE)","v":0},null,null,null,null,null,null,"",{"$f":"$N$2&$N$6&$C$21","v":"Nord RHFD: Informasjonssikkerhet og ROS-analyser5"},null,"helsenord.no@capgemini.com"]
[null,null,6,{"$f":"VLOOKUP($N22,Database!$A$2:$R$3057,5,FALSE)","v":"Deloitte AS "},{"$f":"VLOOKUP($N22,Database!$A$2:$R$3057,6,FALSE)","v":"noanbud@DELOITTE.no"},{"$f":"VLOOKUP($N22,Database!$A$2:$R$3057,7,FALSE)","v":0},null,null,null,null,null,null,"",{"$f":"$N$2&$N$6&$C$22","v":"Nord RHFD: Informasjonssikkerhet og ROS-analyser6"},null,"noanbud@DELOITTE.no"]
[null,null,7,{"$f":"VLOOKUP($N23,Database!$A$2:$R$3057,5,FALSE)","v":"Emagine AS "},{"$f":"VLOOKUP($N23,Database!$A$2:$R$3057,6,FALSE)","v":"sykehusinnkjop@emagine.no"},{"$f":"VLOOKUP($N23,Database!$A$2:$R$3057,7,FALSE)","v":0},null,null,null,null,null,null,"",{"$f":"$N$2&$N$6&$C$23","v":"Nord RHFD: Informasjonssikkerhet og ROS-analyser7"},null,"sykehusinnkjop@emagine.no"]
[null,null,8,{"$f":"VLOOKUP($N24,Database!$A$2:$R$3057,5,FALSE)","v":"Ernst & Young AS "},{"$f":"VLOOKUP($N24,Database!$A$2:$R$3057,6,FALSE)","v":"offentlige.anskaffelser@no.ey.com"},{"$f":"VLOOKUP($N24,Database!$A$2:$R$3057,7,FALSE)","v":0},null,null,null,null,null,null,"",{"$f":"$N$2&$N$6&$C$24","v":"Nord RHFD: Informasjonssikkerhet og ROS-analyser8"},null,"offentlige.anskaffelser@no.ey.com"]
[null,null,9,{"$f":"VLOOKUP($N25,Database!$A$2:$R$3057,5,FALSE)","v":"Ework Group Norway AS "},{"$f":"VLOOKUP($N25,Database!$A$2:$R$3057,6,FALSE)","v":"sykehusinnkjop@eworkgroup.com  "},{"$f":"VLOOKUP($N25,Database!$A$2:$R$3057,7,FALSE)","v":0},null,null,null,null,null,null,"",{"$f":"$N$2&$N$6&$C$25","v":"Nord RHFD: Informasjonssikkerhet og ROS-analyser9"},null,"sykehusinnkjop@eworkgroup.com  "]
[null,null,10,{"$f":"VLOOKUP($N26,Database!$A$2:$R$3057,5,FALSE)","v":"Experis AS "},{"$f":"VLOOKUP($N26,Database!$A$2:$R$3057,6,FALSE)","v":"sykehusinnkjop@no.experis.com"},{"$f":"VLOOKUP($N26,Database!$A$2:$R$3057,7,FALSE)","v":0},null,null,null,null,null,null,"",{"$f":"$N$2&$N$6&$C$26","v":"Nord RHFD: Informasjonssikkerhet og ROS-analyser10"},null,"sykehusinnkjop@no.experis.com"]
[null,null,11,{"$f":"VLOOKUP($N27,Database!$A$2:$R$3057,5,FALSE)","v":"IT Consult AS "},{"$f":"VLOOKUP($N27,Database!$A$2:$R$3057,6,FALSE)","v":"firmapost@itc.no"},{"$f":"VLOOKUP($N27,Database!$A$2:$R$3057,7,FALSE)","v":0},null,null,null,null,null,null,"",{"$f":"$N$2&$N$6&$C$27","v":"Nord RHFD: Informasjonssikkerhet og ROS-analyser11"},null,"firmapost@itc.no"]
[null,null,12,{"$f":"VLOOKUP($N28,Database!$A$2:$R$3057,5,FALSE)","v":"KPMG AS "},{"$f":"VLOOKUP($N28,Database!$A$2:$R$3057,6,FALSE)","v":"helse@kpmg.no"},{"$f":"VLOOKUP($N28,Database!$A$2:$R$3057,7,FALSE)","v":0},null,null,null,null,null,null,"",{"$f":"$N$2&$N$6&$C$28","v":"Nord RHFD: Informasjonssikkerhet og ROS-analyser12"},null,"helse@kpmg.no"]
[null,null,13,{"$f":"VLOOKUP($N29,Database!$A$2:$R$3057,5,FALSE)","v":"PricewaterhouseCoopers AS "},{"$f":"VLOOKUP($N29,Database!$A$2:$R$3057,6,FALSE)","v":"no_resepsjon.oslo@pwc.com"},{"$f":"VLOOKUP($N29,Database!$A$2:$R$3057,7,FALSE)","v":0},null,null,null,null,null,null,"",{"$f":"$N$2&$N$6&$C$29","v":"Nord RHFD: Informasjonssikkerhet og ROS-analyser13"},null,"no_resepsjon.oslo@pwc.com"]
[null,null,14,{"$f":"VLOOKUP($N30,Database!$A$2:$R$3057,5,FALSE)","v":"Sopra Steria AS "},{"$f":"VLOOKUP($N30,Database!$A$2:$R$3057,6,FALSE)","v":"helse@soprasteria.com"},{"$f":"VLOOKUP($N30,Database!$A$2:$R$3057,7,FALSE)","v":0},null,null,null,null,null,null,"",{"$f":"$N$2&$N$6&$C$30","v":"Nord RHFD: Informasjonssikkerhet og ROS-analyser14"},null,"helse@soprasteria.com"]
[null,null,15,{"$f":"VLOOKUP($N31,Database!$A$2:$R$3057,5,FALSE)","v":"Advisense AS"},{"$f":"VLOOKUP($N31,Database!$A$2:$R$3057,6,FALSE)","v":"offentlig@transcendentgroup.com "},{"$f":"VLOOKUP($N31,Database!$A$2:$R$3057,7,FALSE)","v":0},null,null,null,null,null,null,"",{"$f":"$N$2&$N$6&$C$31","v":"Nord RHFD: Informasjonssikkerhet og ROS-analyser15"},null,"offentlig@transcendentgroup.com "]
[null,null,16,{"$f":"VLOOKUP($N32,Database!$A$2:$R$3057,5,FALSE)","v":0},{"$f":"VLOOKUP($N32,Database!$A$2:$R$3057,6,FALSE)","v":""},{"$f":"VLOOKUP($N32,Database!$A$2:$R$3057,7,FALSE)","v":0},null,null,null,null,null,null,"x",{"$f":"$N$2&$N$6&$C$32","v":"Nord RHFD: Informasjonssikkerhet og ROS-analyser16"},null,""]
[null,null,17,{"$f":"VLOOKUP($N33,Database!$A$2:$R$3057,5,FALSE)","v":0},{"$f":"VLOOKUP($N33,Database!$A$2:$R$3057,6,FALSE)","v":""},{"$f":"VLOOKUP($N33,Database!$A$2:$R$3057,7,FALSE)","v":0},null,null,null,null,null,null,"x",{"$f":"$N$2&$N$6&$C$33","v":"Nord RHFD: Informasjonssikkerhet og ROS-analyser17"},null,""]
[null,null,18,{"$f":"VLOOKUP($N34,Database!$A$2:$R$3057,5,FALSE)","v":0},{"$f":"VLOOKUP($N34,Database!$A$2:$R$3057,6,FALSE)","v":""},{"$f":"VLOOKUP($N34,Database!$A$2:$R$3057,7,FALSE)","v":0},null,null,null,null,null,null,"x",{"$f":"$N$2&$N$6&$C$34","v":"Nord RHFD: Informasjonssikkerhet og ROS-analyser18"},null,""]
[null,null,19,{"$f":"VLOOKUP($N35,Database!$A$2:$R$3057,5,FALSE)","v":0},{"$f":"VLOOKUP($N35,Database!$A$2:$R$3057,6,FALSE)","v":""},{"$f":"VLOOKUP($N35,Database!$A$2:$R$3057,7,FALSE)","v":0},null,null,null,null,null,null,"x",{"$f":"$N$2&$N$6&$C$35","v":"Nord RHFD: Informasjonssikkerhet og ROS-analyser19"},null,""]
[null,null,20,{"$f":"VLOOKUP($N36,Database!$A$2:$R$3057,5,FALSE)","v":0},{"$f":"VLOOKUP($N36,Database!$A$2:$R$3057,6,FALSE)","v":""},{"$f":"VLOOKUP($N36,Database!$A$2:$R$3057,7,FALSE)","v":0},null,null,null,null,null,null,"x",{"$f":"$N$2&$N$6&$C$36","v":"Nord RHFD: Informasjonssikkerhet og ROS-analyser20"},null,""]
[null,null,21,{"$f":"VLOOKUP($N37,Database!$A$2:$R$3057,5,FALSE)","v":0},{"$f":"VLOOKUP($N37,Database!$A$2:$R$3057,6,FALSE)","v":""},{"$f":"VLOOKUP($N37,Database!$A$2:$R$3057,7,FALSE)","v":0},null,null,null,null,null,null,"x",{"$f":"$N$2&$N$6&$C$37","v":"Nord RHFD: Informasjonssikkerhet og ROS-analyser21"},null,""]
[null,null,22,{"$f":"VLOOKUP($N38,Database!$A$2:$R$3057,5,FALSE)","v":0},{"$f":"VLOOKUP($N38,Database!$A$2:$R$3057,6,FALSE)","v":""},{"$f":"VLOOKUP($N38,Database!$A$2:$R$3057,7,FALSE)","v":0},null,null,null,null,null,null,"x",{"$f":"$N$2&$N$6&$C$38","v":"Nord RHFD: Informasjonssikkerhet og ROS-analyser22"},null,""]
[null,null,23,{"$f":"VLOOKUP($N39,Database!$A$2:$R$3057,5,FALSE)","v":0},{"$f":"VLOOKUP($N39,Database!$A$2:$R$3057,6,FALSE)","v":""},{"$f":"VLOOKUP($N39,Database!$A$2:$R$3057,7,FALSE)","v":0},null,null,null,null,null,null,"x",{"$f":"$N$2&$N$6&$C$39","v":"Nord RHFD: Informasjonssikkerhet og ROS-analyser23"},null,""]
[null,null,24,{"$f":"VLOOKUP($N40,Database!$A$2:$R$3057,5,FALSE)","v":0},{"$f":"VLOOKUP($N40,Database!$A$2:$R$3057,6,FALSE)","v":""},{"$f":"VLOOKUP($N40,Database!$A$2:$R$3057,7,FALSE)","v":0},null,null,null,null,null,null,"x",{"$f":"$N$2&$N$6&$C$40","v":"Nord RHFD: Informasjonssikkerhet og ROS-analyser24"},null,""]
[null,null,25,{"$f":"VLOOKUP($N41,Database!$A$2:$R$3057,5,FALSE)","v":0},{"$f":"VLOOKUP($N41,Database!$A$2:$R$3057,6,FALSE)","v":""},{"$f":"VLOOKUP($N41,Database!$A$2:$R$3057,7,FALSE)","v":0},null,null,null,null,null,null,"x",{"$f":"$N$2&$N$6&$C$41","v":"Nord RHFD: Informasjonssikkerhet og ROS-analyser25"},null,""]
[null,null,26,{"$f":"VLOOKUP($N42,Database!$A$2:$R$3057,5,FALSE)","v":0},{"$f":"VLOOKUP($N42,Database!$A$2:$R$3057,6,FALSE)","v":""},{"$f":"VLOOKUP($N42,Database!$A$2:$R$3057,7,FALSE)","v":0},null,null,null,null,null,null,"x",{"$f":"$N$2&$N$6&$C$42","v":"Nord RHFD: Informasjonssikkerhet og ROS-analyser26"},null,""]
[null,null,27,{"$f":"VLOOKUP($N43,Database!$A$2:$R$3057,5,FALSE)","v":0},{"$f":"VLOOKUP($N43,Database!$A$2:$R$3057,6,FALSE)","v":""},{"$f":"VLOOKUP($N43,Database!$A$2:$R$3057,7,FALSE)","v":0},null,null,null,null,null,null,"x",{"$f":"$N$2&$N$6&$C$43","v":"Nord RHFD: Informasjonssikkerhet og ROS-analyser27"},null,""]
[null,null,28,{"$f":"VLOOKUP($N44,Database!$A$2:$R$3057,5,FALSE)","v":0},{"$f":"VLOOKUP($N44,Database!$A$2:$R$3057,6,FALSE)","v":""},{"$f":"VLOOKUP($N44,Database!$A$2:$R$3057,7,FALSE)","v":0},null,null,null,null,null,null,"x",{"$f":"$N$2&$N$6&$C$44","v":"Nord RHFD: Informasjonssikkerhet og ROS-analyser28"},null,""]
[null,null,29,{"$f":"VLOOKUP($N45,Database!$A$2:$R$3057,5,FALSE)","v":0},{"$f":"VLOOKUP($N45,Database!$A$2:$R$3057,6,FALSE)","v":""},{"$f":"VLOOKUP($N45,Database!$A$2:$R$3057,7,FALSE)","v":0},null,null,null,null,null,null,"x",{"$f":"$N$2&$N$6&$C$45","v":"Nord RHFD: Informasjonssikkerhet og ROS-analyser29"},null,""]
[null,null,30,{"$f":"VLOOKUP($N46,Database!$A$2:$R$3057,5,FALSE)","v":0},{"$f":"VLOOKUP($N46,Database!$A$2:$R$3057,6,FALSE)","v":""},{"$f":"VLOOKUP($N46,Database!$A$2:$R$3057,7,FALSE)","v":0},null,null,null,null,null,null,"x",{"$f":"$N$2&$N$6&$C$46","v":"Nord RHFD: Informasjonssikkerhet og ROS-analyser30"},null,""]
[null,null,31,{"$f":"VLOOKUP($N47,Database!$A$2:$R$3057,5,FALSE)","v":0},{"$f":"VLOOKUP($N47,Database!$A$2:$R$3057,6,FALSE)","v":""},{"$f":"VLOOKUP($N47,Database!$A$2:$R$3057,7,FALSE)","v":0},null,null,null,null,null,null,{"$f":"IF(D47>0,\"\",\"x\")","v":"x"},{"$f":"$N$2&$N$6&$C$47","v":"Nord RHFD: Informasjonssikkerhet og ROS-analyser31"},null,""]
[null,null,32,{"$f":"VLOOKUP($N48,Database!$A$2:$R$3057,5,FALSE)","v":0},{"$f":"VLOOKUP($N48,Database!$A$2:$R$3057,6,FALSE)","v":""},{"$f":"VLOOKUP($N48,Database!$A$2:$R$3057,7,FALSE)","v":0},null,null,null,null,null,null,{"$f":"IF(D48>0,\"\",\"x\")","v":"x"},{"$f":"$N$2&$N$6&$C$48","v":"Nord RHFD: Informasjonssikkerhet og ROS-analyser32"},null,""]
[null,null,33,{"$f":"VLOOKUP($N49,Database!$A$2:$R$3057,5,FALSE)","v":0},{"$f":"VLOOKUP($N49,Database!$A$2:$R$3057,6,FALSE)","v":""},{"$f":"VLOOKUP($N49,Database!$A$2:$R$3057,7,FALSE)","v":0},null,null,null,null,null,null,{"$f":"IF(D49>0,\"\",\"x\")","v":"x"},{"$f":"$N$2&$N$6&$C$49","v":"Nord RHFD: Informasjonssikkerhet og ROS-analyser33"},null,""]
[null,null,34,{"$f":"VLOOKUP($N50,Database!$A$2:$R$3057,5,FALSE)","v":0},{"$f":"VLOOKUP($N50,Database!$A$2:$R$3057,6,FALSE)","v":""},{"$f":"VLOOKUP($N50,Database!$A$2:$R$3057,7,FALSE)","v":0},null,null,null,null,null,null,{"$f":"IF(D50>0,\"\",\"x\")","v":"x"},{"$f":"$N$2&$N$6&$C$50","v":"Nord RHFD: Informasjonssikkerhet og ROS-analyser34"},null,""]
[null,null,null,null,null,null,null,null,null,null,null,null,null,null,null,null,{"$f":"P17&\";\"&P18&\";\"&P19&\";\"&P20&\";\"&P21&\";\"&P22&\";\"&P23&\";\"&P24&\";\"&P25&\";\"&P26&\";\"&P27&\";\"&P28&\";\"&P29&\";\"&P30&\";\"&P31&\";\"&P32&\";\"&P33&\";\"&P34&\";\"&P35&\";\"&P36&\";\"&P37&\";\"&P38&\";\"&P39&\";\"&P40&\";\"&P41&\";\"&P42&\";\"&P43&\";\"&P44&\";\"&P45&\";\"&P46&\";\"&P47&\";\"&P48&\";\"&P49&\";\"&P50","v":"utlysninger@a-2.no;rammeavtale.helse@accenture.com;firmapost@systra.com;Sykehusinnkjop2023@bouvet.no;helsenord.no@capgemini.com;noanbud@DELOITTE.no;sykehusinnkjop@emagine.no;offentlige.anskaffelser@no.ey.com;sykehusinnkjop@eworkgroup.com  ;sykehusinnkjop@no.experis.com;firmapost@itc.no;helse@kpmg.no;no_resepsjon.oslo@pwc.com;helse@soprasteria.com;offentlig@transcendentgroup.com ;;;;;;;;;;;;;;;;;;;"}]

{"sheet":"Database","index":1,"n_rows":3057,"n_cols":18,"rows_kept":3057,"cut":false,"hidden":true,"merged":[]}
["Kode","Område","Delområde","Rangering","Leverandør","E-post","Telefon","Kolonne3","Kolonne4","Kolonne5","Kolonne6","Kolonne7","Kolonne8","Kolonne9","Kolonne10","Kolonne11","Kolonne12","Kolonne13"]
[{"$f":"Database!$B2&Database!$C2&Database!$D2","v":"Nord RHFA: Program og Prosjektgjennomføring1"},"Nord RHF","A: Program og Prosjektgjennomføring",1,"A-2 Norge AS","utlysninger@a-2.no"]
[{"$f":"Database!$B3&Database!$C3&Database!$D3","v":"Nord RHFA: Program og Prosjektgjennomføring2"},"Nord RHF","A: Program og Prosjektgjennomføring",2,"Accenture AS ","rammeavtale.helse@accenture.com"]
[{"$f":"Database!$B4&Database!$C4&Database!$D4","v":"Nord RHFA: Program og Prosjektgjennomføring3"},"Nord RHF","A: Program og Prosjektgjennomføring",3,"Systra Norge AS ","firmapost@systra.com"]
[{"$f":"Database!$B5&Database!$C5&Database!$D5","v":"Nord RHFA: Program og Prosjektgjennomføring4"},"Nord RHF","A: Program og Prosjektgjennomføring",4,"Bouvet Norge AS ","Sykehusinnkjop2023@bouvet.no"]
[{"$f":"Database!$B6&Database!$C6&Database!$D6","v":"Nord RHFA: Program og Prosjektgjennomføring5"},"Nord RHF","A: Program og Prosjektgjennomføring",5,"Capgemini Norge AS ","helsenord.no@capgemini.com"]
[{"$f":"Database!$B7&Database!$C7&Database!$D7","v":"Nord RHFA: Program og Prosjektgjennomføring6"},"Nord RHF","A: Program og Prosjektgjennomføring",6,"Deloitte AS ","noanbud@DELOITTE.no"]
[{"$f":"Database!$B8&Database!$C8&Database!$D8","v":"Nord RHFA: Program og Prosjektgjennomføring7"},"Nord RHF","A: Program og Prosjektgjennomføring",7,"Dfind Consulting AS ","consulting@dfind.no"]
[{"$f":"Database!$B9&Database!$C9&Database!$D9","v":"Nord RHFA: Program og Prosjektgjennomføring8"},"Nord RHF","A: Program og Prosjektgjennomføring",8,"Digital Workforce AS ","info@digitalworkforce.com"]
[{"$f":"Database!$B10&Database!$C10&Database!$D10","v":"Nord RHFA: Program og Prosjektgjennomføring9"},"Nord RHF","A: Program og Prosjektgjennomføring",9,"Emagine AS ","sykehusinnkjop@emagine.no"]
[{"$f":"Database!$B11&Database!$C11&Database!$D11","v":"Nord RHFA: Program og Prosjektgjennomføring10"},"Nord RHF","A: Program og Prosjektgjennomføring",10,"Ernst & Young AS ","offentlige.anskaffelser@no.ey.com"]
[{"$f":"Database!$B12&Database!$C12&Database!$D12","v":"Nord RHFA: Program og Prosjektgjennomføring11"},"Nord RHF","A: Program og Prosjektgjennomføring",11,"Ework Group Norway AS ","sykehusinnkjop@eworkgroup.com  "]
[{"$f":"Database!$B13&Database!$C13&Database!$D13","v":"Nord RHFA: Program og Prosjektgjennomføring12"},"Nord RHF","A: Program og Prosjektgjennomføring",12,"Experis AS ","sykehusinnkjop@no.experis.com"]
[{"$f":"Database!$B14&Database!$C14&Database!$D14","v":"Nord RHFA: Program og Prosjektgjennomføring13"},"Nord RHF","A: Program og Prosjektgjennomføring",13,"KPMG AS ","helse@kpmg.no"]
[{"$f":"Database!$B15&Database!$C15&Database!$D15","v":"Nord RHFA: Program og Prosjektgjennomføring14"},"Nord RHF","A: Program og Prosjektgjennomføring",14,"Metier AS ","firmapost@metier.no"]
[{"$f":"Database!$B16&Database!$C16&Database!$D16","v":"Nord RHFA: Program og Prosjektgjennomføring15"},"Nord RHF","A: Program og Prosjektgjennomføring",15,"Netcompany AS ","anbud.no@netcompany.com "]
[{"$f":"Database!$B17&Database!$C17&Database!$D17","v":"Nord RHFA: Program og Prosjektgjennomføring16"},"Nord RHF","A: Program og Prosjektgjennomføring",16,"Nordlo Grenland AS","firmapost.grenland@nordlo.com"]
[{"$f":"Database!$B18&Database!$C18&Database!$D18","v":"Nord RHFA: Program og Prosjektgjennomføring17"},"Nord RHF","A: Program og Prosjektgjennomføring",17,"PricewaterhouseCoopers AS ","no_resepsjon.oslo@pwc.com"]
[{"$f":"Database!$B19&Database!$C19&Database!$D19","v":"Nord RHFA: Program og Prosjektgjennomføring18"},"Nord RHF","A: Program og Prosjektgjennomføring",18,"Solea AS (tidl Rainfall AS )","avrop@solea.no"]
[{"$f":"Database!$B20&Database!$C20&Database!$D20","v":"Nord RHFA: Program og Prosjektgjennomføring19"},"Nord RHF","A: Program og Prosjektgjennomføring",19,"Sopra Steria AS ","helse@soprasteria.com"]
[{"$f":"Database!$B21&Database!$C21&Database!$D21","v":"Nord RHFA: Program og Prosjektgjennomføring20"},"Nord RHF","A: Program og Prosjektgjennomføring",20,"The Boston Consulting Group Nordic AB ","anbud@bcg.com"]
[{"$f":"Database!$B22&Database!$C22&Database!$D22","v":"Nord RHFA: Program og Prosjektgjennomføring21"},"Nord RHF","A: Program og Prosjektgjennomføring",21,null,""]
[{"$f":"Database!$B23&Database!$C23&Database!$D23","v":"Nord RHFA: Program og Prosjektgjennomføring22"},"Nord RHF","A: Program og Prosjektgjennomføring",22,null,""]
[{"$f":"Database!$B24&Database!$C24&Database!$D24","v":"Nord RHFA: Program og Prosjektgjennomføring23"},"Nord RHF","A: Program og Prosjektgjennomføring",23,null,""]
[{"$f":"Database!$B25&Database!$C25&Database!$D25","v":"Nord RHFA: Program og Prosjektgjennomføring24"},"Nord RHF","A: Program og Prosjektgjennomføring",24,null,""]
[{"$f":"Database!$B26&Database!$C26&Database!$D26","v":"Nord RHFA: Program og Prosjektgjennomføring25"},"Nord RHF","A: Program og Prosjektgjennomføring",25,null,""]
[{"$f":"Database!$B27&Database!$C27&Database!$D27","v":"Nord RHFA: Program og Prosjektgjennomføring26"},"Nord RHF","A: Program og Prosjektgjennomføring",26,null,""]
[{"$f":"Database!$B28&Database!$C28&Database!$D28","v":"Nord RHFA: Program og Prosjektgjennomføring27"},"Nord RHF","A: Program og Prosjektgjennomføring",27,null,""]
[{"$f":"Database!$B29&Database!$C29&Database!$D29","v":"Nord RHFA: Program og Prosjektgjennomføring28"},"Nord RHF","A: Program og Prosjektgjennomføring",28,null,""]
[{"$f":"Database!$B30&Database!$C30&Database!$D30","v":"Nord RHFA: Program og Prosjektgjennomføring29"},"Nord RHF","A: Program og Prosjektgjennomføring",29,null,""]
[{"$f":"Database!$B31&Database!$C31&Database!$D31","v":"Nord RHFA: Program og Prosjektgjennomføring30"},"Nord RHF","A: Program og Prosjektgjennomføring",30,null,""]
[{"$f":"Database!$B32&Database!$C32&Database!$D32","v":"Nord RHFA: Program og Prosjektgjennomføring31"},"Nord RHF","A: Program og Prosjektgjennomføring",31,null,""]
[{"$f":"Database!$B33&Database!$C33&Database!$D33","v":"Nord RHFA: Program og Prosjektgjennomføring32"},"Nord RHF","A: Program og Prosjektgjennomføring",32,null,""]
[{"$f":"Database!$B34&Database!$C34&Database!$D34","v":"Nord RHFA: Program og Prosjektgjennomføring33"},"Nord RHF","A: Program og Prosjektgjennomføring",33,null,""]
[{"$f":"Database!$B35&Database!$C35&Database!$D35","v":"Nord RHFA: Program og Prosjektgjennomføring34"},"Nord RHF","A: Program og Prosjektgjennomføring",34,null,""]
[{"$f":"Database!$B36&Database!$C36&Database!$D36","v":""},null,null,null,null,""]
[{"$f":"Database!$B37&Database!$C37&Database!$D37","v":"Nord RHFB: Strategiplanlegging, rådgivning og innovasjon1"},"Nord RHF","B: Strategiplanlegging, rådgivning og innovasjon",1,"A-2 Norge AS","utlysninger@a-2.no"]
[{"$f":"Database!$B38&Database!$C38&Database!$D38","v":"Nord RHFB: Strategiplanlegging, rådgivning og innovasjon2"},"Nord RHF","B: Strategiplanlegging, rådgivning og innovasjon",2,"Systra Norge AS ","firmapost@systra.com"]
[{"$f":"Database!$B39&Database!$C39&Database!$D39","v":"Nord RHFB: Strategiplanlegging, rådgivning og innovasjon3"},"Nord RHF","B: Strategiplanlegging, rådgivning og innovasjon",3,"Bouvet Norge AS ","Sykehusinnkjop2023@bouvet.no"]
[{"$f":"Database!$B40&Database!$C40&Database!$D40","v":"Nord RHFB: Strategiplanlegging, rådgivning og innovasjon4"},"Nord RHF","B: Strategiplanlegging, rådgivning og innovasjon",4,"Capgemini Norge AS ","helsenord.no@capgemini.com"]
[{"$f":"Database!$B41&Database!$C41&Database!$D41","v":"Nord RHFB: Strategiplanlegging, rådgivning og innovasjon5"},"Nord RHF","B: Strategiplanlegging, rådgivning og innovasjon",5,"Deloitte AS ","noanbud@DELOITTE.no"]
[{"$f":"Database!$B42&Database!$C42&Database!$D42","v":"Nord RHFB: Strategiplanlegging, rådgivning og innovasjon6"},"Nord RHF","B: Strategiplanlegging, rådgivning og innovasjon",6,"Emagine AS ","sykehusinnkjop@emagine.no"]
[{"$f":"Database!$B43&Database!$C43&Database!$D43","v":"Nord RHFB: Strategiplanlegging, rådgivning og innovasjon7"},"Nord RHF","B: Strategiplanlegging, rådgivning og innovasjon",7,"Ernst & Young AS ","offentlige.anskaffelser@no.ey.com"]
[{"$f":"Database!$B44&Database!$C44&Database!$D44","v":"Nord RHFB: Strategiplanlegging, rådgivning og innovasjon8"},"Nord RHF","B: Strategiplanlegging, rådgivning og innovasjon",8,"Ework Group Norway AS ","sykehusinnkjop@eworkgroup.com  "]
[{"$f":"Database!$B45&Database!$C45&Database!$D45","v":"Nord RHFB: Strategiplanlegging, rådgivning og innovasjon9"},"Nord RHF","B: Strategiplanlegging, rådgivning og innovasjon",9,"Experis AS ","sykehusinnkjop@no.experis.com"]
[{"$f":"Database!$B46&Database!$C46&Database!$D46","v":"Nord RHFB: Strategiplanlegging, rådgivning og innovasjon10"},"Nord RHF","B: Strategiplanlegging, rådgivning og innovasjon",10,"KPMG AS ","helse@kpmg.no"]
[{"$f":"Database!$B47&Database!$C47&Database!$D47","v":"Nord RHFB: Strategiplanlegging, rådgivning og innovasjon11"},"Nord RHF","B: Strategiplanlegging, rådgivning og innovasjon",11,"Metier AS ","firmapost@metier.no"]
[{"$f":"Database!$B48&Database!$C48&Database!$D48","v":"Nord RHFB: Strategiplanlegging, rådgivning og innovasjon12"},"Nord RHF","B: Strategiplanlegging, rådgivning og innovasjon",12,"PricewaterhouseCoopers AS ","no_resepsjon.oslo@pwc.com"]
[{"$f":"Database!$B49&Database!$C49&Database!$D49","v":"Nord RHFB: Strategiplanlegging, rådgivning og innovasjon13"},"Nord RHF","B: Strategiplanlegging, rådgivning og innovasjon",13,"Sopra Steria AS ","helse@soprasteria.com"]
[{"$f":"Database!$B50&Database!$C50&Database!$D50","v":"Nord RHFB: Strategiplanlegging, rådgivning og innovasjon14"},"Nord RHF","B: Strategiplanlegging, rådgivning og innovasjon",14,"The Boston Consulting Group Nordic AB ","anbud@bcg.com"]
[{"$f":"Database!$B51&Database!$C51&Database!$D51","v":"Nord RHFB: Strategiplanlegging, rådgivning og innovasjon15"},"Nord RHF","B: Strategiplanlegging, rådgivning og innovasjon",15,"Advisense AS","offentlig@transcendentgroup.com "]
[{"$f":"Database!$B52&Database!$C52&Database!$D52","v":"Nord RHFB: Strategiplanlegging, rådgivning og innovasjon16"},"Nord RHF","B: Strategiplanlegging, rådgivning og innovasjon",16,null,""]
[{"$f":"Database!$B53&Database!$C53&Database!$D53","v":"Nord RHFB: Strategiplanlegging, rådgivning og innovasjon17"},"Nord RHF","B: Strategiplanlegging, rådgivning og innovasjon",17,null,""]
[{"$f":"Database!$B54&Database!$C54&Database!$D54","v":"Nord RHFB: Strategiplanlegging, rådgivning og innovasjon18"},"Nord RHF","B: Strategiplanlegging, rådgivning og innovasjon",18,null,""]
[{"$f":"Database!$B55&Database!$C55&Database!$D55","v":"Nord RHFB: Strategiplanlegging, rådgivning og innovasjon19"},"Nord RHF","B: Strategiplanlegging, rådgivning og innovasjon",19,null,""]
[{"$f":"Database!$B56&Database!$C56&Database!$D56","v":"Nord RHFB: Strategiplanlegging, rådgivning og innovasjon20"},"Nord RHF","B: Strategiplanlegging, rådgivning og innovasjon",20,null,""]
[{"$f":"Database!$B57&Database!$C57&Database!$D57","v":"Nord RHFB: Strategiplanlegging, rådgivning og innovasjon21"},"Nord RHF","B: Strategiplanlegging, rådgivning og innovasjon",21,null,""]
[{"$f":"Database!$B58&Database!$C58&Database!$D58","v":"Nord RHFB: Strategiplanlegging, rådgivning og innovasjon22"},"Nord RHF","B: Strategiplanlegging, rådgivning og innovasjon",22,null,""]
[{"$f":"Database!$B59&Database!$C59&Database!$D59","v":"Nord RHFB: Strategiplanlegging, rådgivning og innovasjon23"},"Nord RHF","B: Strategiplanlegging, rådgivning og innovasjon",23,null,""]
[{"$f":"Database!$B60&Database!$C60&Database!$D60","v":"Nord RHFB: Strategiplanlegging, rådgivning og innovasjon24"},"Nord RHF","B: Strategiplanlegging, rådgivning og innovasjon",24,null,""]
[{"$f":"Database!$B61&Database!$C61&Database!$D61","v":"Nord RHFB: Strategiplanlegging, rådgivning og innovasjon25"},"Nord RHF","B: Strategiplanlegging, rådgivning og innovasjon",25,null,""]
[{"$f":"Database!$B62&Database!$C62&Database!$D62","v":"Nord RHFB: Strategiplanlegging, rådgivning og innovasjon26"},"Nord RHF","B: Strategiplanlegging, rådgivning og innovasjon",26,null,""]
[{"$f":"Database!$B63&Database!$C63&Database!$D63","v":"Nord RHFB: Strategiplanlegging, rådgivning og innovasjon27"},"Nord RHF","B: Strategiplanlegging, rådgivning og innovasjon",27,null,""]
[{"$f":"Database!$B64&Database!$C64&Database!$D64","v":"Nord RHFB: Strategiplanlegging, rådgivning og innovasjon28"},"Nord RHF","B: Strategiplanlegging, rådgivning og innovasjon",28,null,""]
[{"$f":"Database!$B65&Database!$C65&Database!$D65","v":"Nord RHFB: Strategiplanlegging, rådgivning og innovasjon29"},"Nord RHF","B: Strategiplanlegging, rådgivning og innovasjon",29,null,""]
[{"$f":"Database!$B66&Database!$C66&Database!$D66","v":"Nord RHFB: Strategiplanlegging, rådgivning og innovasjon30"},"Nord RHF","B: Strategiplanlegging, rådgivning og innovasjon",30,null,""]
[{"$f":"Database!$B67&Database!$C67&Database!$D67","v":"Nord RHFB: Strategiplanlegging, rådgivning og innovasjon31"},"Nord RHF","B: Strategiplanlegging, rådgivning og innovasjon",31,null,""]
[{"$f":"Database!$B68&Database!$C68&Database!$D68","v":"Nord RHFB: Strategiplanlegging, rådgivning og innovasjon32"},"Nord RHF","B: Strategiplanlegging, rådgivning og innovasjon",32,null,""]
[{"$f":"Database!$B69&Database!$C69&Database!$D69","v":"Nord RHFB: Strategiplanlegging, rådgivning og innovasjon33"},"Nord RHF","B: Strategiplanlegging, rådgivning og innovasjon",33,null,""]
[{"$f":"Database!$B70&Database!$C70&Database!$D70","v":"Nord RHFB: Strategiplanlegging, rådgivning og innovasjon34"},"Nord RHF","B: Strategiplanlegging, rådgivning og innovasjon",34,null,""]
[{"$f":"Database!$B71&Database!$C71&Database!$D71","v":""},null,null,null,null,""]
[{"$f":"Database!$B72&Database!$C72&Database!$D72","v":"Nord RHFC: Arkitektur1"},"Nord RHF","C: Arkitektur",1,"A-2 Norge AS","utlysninger@a-2.no"]
[{"$f":"Database!$B73&Database!$C73&Database!$D73","v":"Nord RHFC: Arkitektur2"},"Nord RHF","C: Arkitektur",2,"Systra Norge AS ","firmapost@systra.com"]
[{"$f":"Database!$B74&Database!$C74&Database!$D74","v":"Nord RHFC: Arkitektur3"},"Nord RHF","C: Arkitektur",3,"Bouvet Norge AS ","Sykehusinnkjop2023@bouvet.no"]
[{"$f":"Database!$B75&Database!$C75&Database!$D75","v":"Nord RHFC: Arkitektur4"},"Nord RHF","C: Arkitektur",4,"Capgemini Norge AS ","helsenord.no@capgemini.com"]
[{"$f":"Database!$B76&Database!$C76&Database!$D76","v":"Nord RHFC: Arkitektur5"},"Nord RHF","C: Arkitektur",5,"Deloitte AS ","noanbud@DELOITTE.no"]
[{"$f":"Database!$B77&Database!$C77&Database!$D77","v":"Nord RHFC: Arkitektur6"},"Nord RHF","C: Arkitektur",6,"Emagine AS ","sykehusinnkjop@emagine.no"]
[{"$f":"Database!$B78&Database!$C78&Database!$D78","v":"Nord RHFC: Arkitektur7"},"Nord RHF","C: Arkitektur",7,"Ernst & Young AS ","offentlige.anskaffelser@no.ey.com"]
[{"$f":"Database!$B79&Database!$C79&Database!$D79","v":"Nord RHFC: Arkitektur8"},"Nord RHF","C: Arkitektur",8,"Ework Group Norway AS ","sykehusinnkjop@eworkgroup.com  "]
[{"$f":"Database!$B80&Database!$C80&Database!$D80","v":"Nord RHFC: Arkitektur9"},"Nord RHF","C: Arkitektur",9,"Experis AS ","sykehusinnkjop@no.experis.com"]
[{"$f":"Database!$B81&Database!$C81&Database!$D81","v":"Nord RHFC: Arkitektur10"},"Nord RHF","C: Arkitektur",10,"IT Consult AS ","firmapost@itc.no"]
[{"$f":"Database!$B82&Database!$C82&Database!$D82","v":"Nord RHFC: Arkitektur11"},"Nord RHF","C: Arkitektur",11,"KPMG AS ","helse@kpmg.no"]
[{"$f":"Database!$B83&Database!$C83&Database!$D83","v":"Nord RHFC: Arkitektur12"},"Nord RHF","C: Arkitektur",12,"Netcompany AS ","anbud.no@netcompany.com "]
[{"$f":"Database!$B84&Database!$C84&Database!$D84","v":"Nord RHFC: Arkitektur13"},"Nord RHF","C: Arkitektur",13,"PricewaterhouseCoopers AS ","no_resepsjon.oslo@pwc.com"]
[{"$f":"Database!$B85&Database!$C85&Database!$D85","v":"Nord RHFC: Arkitektur14"},"Nord RHF","C: Arkitektur",14,"Sopra Steria AS ","helse@soprasteria.com"]
[{"$f":"Database!$B86&Database!$C86&Database!$D86","v":"Nord RHFC: Arkitektur15"},"Nord RHF","C: Arkitektur",15,"The Boston Consulting Group Nordic AB ","anbud@bcg.com"]
[{"$f":"Database!$B87&Database!$C87&Database!$D87","v":"Nord RHFC: Arkitektur16"},"Nord RHF","C: Arkitektur",16,null,""]
[{"$f":"Database!$B88&Database!$C88&Database!$D88","v":"Nord RHFC: Arkitektur17"},"Nord RHF","C: Arkitektur",17,null,""]
[{"$f":"Database!$B89&Database!$C89&Database!$D89","v":"Nord RHFC: Arkitektur18"},"Nord RHF","C: Arkitektur",18,null,""]
[{"$f":"Database!$B90&Database!$C90&Database!$D90","v":"Nord RHFC: Arkitektur19"},"Nord RHF","C: Arkitektur",19,null,""]
[{"$f":"Database!$B91&Database!$C91&Database!$D91","v":"Nord RHFC: Arkitektur20"},"Nord RHF","C: Arkitektur",20,null,""]
[{"$f":"Database!$B92&Database!$C92&Database!$D92","v":"Nord RHFC: Arkitektur21"},"Nord RHF","C: Arkitektur",21,null,""]
[{"$f":"Database!$B93&Database!$C93&Database!$D93","v":"Nord RHFC: Arkitektur22"},"Nord RHF","C: Arkitektur",22,null,""]
[{"$f":"Database!$B94&Database!$C94&Database!$D94","v":"Nord RHFC: Arkitektur23"},"Nord RHF","C: Arkitektur",23,null,""]
[{"$f":"Database!$B95&Database!$C95&Database!$D95","v":"Nord RHFC: Arkitektur24"},"Nord RHF","C: Arkitektur",24,null,""]
[{"$f":"Database!$B96&Database!$C96&Database!$D96","v":"Nord RHFC: Arkitektur25"},"Nord RHF","C: Arkitektur",25,null,""]
[{"$f":"Database!$B97&Database!$C97&Database!$D97","v":"Nord RHFC: Arkitektur26"},"Nord RHF","C: Arkitektur",26,null,""]
[{"$f":"Database!$B98&Database!$C98&Database!$D98","v":"Nord RHFC: Arkitektur27"},"Nord RHF","C: Arkitektur",27,null,""]
[{"$f":"Database!$B99&Database!$C99&Database!$D99","v":"Nord RHFC: Arkitektur28"},"Nord RHF","C: Arkitektur",28,null,""]
[{"$f":"Database!$B100&Database!$C100&Database!$D100","v":"Nord RHFC: Arkitektur29"},"Nord RHF","C: Arkitektur",29,null,""]
[{"$f":"Database!$B101&Database!$C101&Database!$D101","v":"Nord RHFC: Arkitektur30"},"Nord RHF","C: Arkitektur",30,null,""]
[{"$f":"Database!$B102&Database!$C102&Database!$D102","v":"Nord RHFC: Arkitektur31"},"Nord RHF","C: Arkitektur",31,null,""]
[{"$f":"Database!$B103&Database!$C103&Database!$D103","v":"Nord RHFC: Arkitektur32"},"Nord RHF","C: Arkitektur",32,null,""]
[{"$f":"Database!$B104&Database!$C104&Database!$D104","v":"Nord RHFC: Arkitektur33"},"Nord RHF","C: Arkitektur",33,null,""]
[{"$f":"Database!$B105&Database!$C105&Database!$D105","v":"Nord RHFC: Arkitektur34"},"Nord RHF","C: Arkitektur",34,null,""]
[{"$f":"Database!$B106&Database!$C106&Database!$D106","v":""},null,null,null,null,""]
[{"$f":"Database!$B107&Database!$C107&Database!$D107","v":"Nord RHFD: Informasjonssikkerhet og ROS-analyser1"},"Nord RHF","D: Informasjonssikkerhet og ROS-analyser",1,"A-2 Norge AS","utlysninger@a-2.no"]
[{"$f":"Database!$B108&Database!$C108&Database!$D108","v":"Nord RHFD: Informasjonssikkerhet og ROS-analyser2"},"Nord RHF","D: Informasjonssikkerhet og ROS-analyser",2,"Accenture AS ","rammeavtale.helse@accenture.com"]
[{"$f":"Database!$B109&Database!$C109&Database!$D109","v":"Nord RHFD: Informasjonssikkerhet og ROS-analyser3"},"Nord RHF","D: Informasjonssikkerhet og ROS-analyser",3,"Systra Norge AS ","firmapost@systra.com"]
[{"$f":"Database!$B110&Database!$C110&Database!$D110","v":"Nord RHFD: Informasjonssikkerhet og ROS-analyser4"},"Nord RHF","D: Informasjonssikkerhet og ROS-analyser",4,"Bouvet Norge AS ","Sykehusinnkjop2023@bouvet.no"]
[{"$f":"Database!$B111&Database!$C111&Database!$D111","v":"Nord RHFD: Informasjonssikkerhet og ROS-analyser5"},"Nord RHF","D: Informasjonssikkerhet og ROS-analyser",5,"Capgemini Norge AS ","helsenord.no@capgemini.com"]
[{"$f":"Database!$B112&Database!$C112&Database!$D112","v":"Nord RHFD: Informasjonssikkerhet og ROS-analyser6"},"Nord RHF","D: Informasjonssikkerhet og ROS-analyser",6,"Deloitte AS ","noanbud@DELOITTE.no"]
[{"$f":"Database!$B113&Database!$C113&Database!$D113","v":"Nord RHFD: Informasjonssikkerhet og ROS-analyser7"},"Nord RHF","D: Informasjonssikkerhet og ROS-analyser",7,"Emagine AS ","sykehusinnkjop@emagine.no"]
[{"$f":"Database!$B114&Database!$C114&Database!$D114","v":"Nord RHFD: Informasjonssikkerhet og ROS-analyser8"},"Nord RHF","D: Informasjonssikkerhet og ROS-analyser",8,"Ernst & Young AS ","offentlige.anskaffelser@no.ey.com"]
[{"$f":"Database!$B115&Database!$C115&Database!$D115","v":"Nord RHFD: Informasjonssikkerhet og ROS-analyser9"},"Nord RHF","D: Informasjonssikkerhet og ROS-analyser",9,"Ework Group Norway AS ","sykehusinnkjop@eworkgroup.com  "]
[{"$f":"Database!$B116&Database!$C116&Database!$D116","v":"Nord RHFD: Informasjonssikkerhet og ROS-analyser10"},"Nord RHF","D: Informasjonssikkerhet og ROS-analyser",10,"Experis AS ","sykehusinnkjop@no.experis.com"]
[{"$f":"Database!$B117&Database!$C117&Database!$D117","v":"Nord RHFD: Informasjonssikkerhet og ROS-analyser11"},"Nord RHF","D: Informasjonssikkerhet og ROS-analyser",11,"IT Consult AS ","firmapost@itc.no"]
[{"$f":"Database!$B118&Database!$C118&Database!$D118","v":"Nord RHFD: Informasjonssikkerhet og ROS-analyser12"},"Nord RHF","D: Informasjonssikkerhet og ROS-analyser",12,"KPMG AS ","helse@kpmg.no"]
[{"$f":"Database!$B119&Database!$C119&Database!$D119","v":"Nord RHFD: Informasjonssikkerhet og ROS-analyser13"},"Nord RHF","D: Informasjonssikkerhet og ROS-analyser",13,"PricewaterhouseCoopers AS ","no_resepsjon.oslo@pwc.com"]
[{"$f":"Database!$B120&Database!$C120&Database!$D120","v":"Nord RHFD: Informasjonssikkerhet og ROS-analyser14"},"Nord RHF","D: Informasjonssikkerhet og ROS-analyser",14,"Sopra Steria AS ","helse@soprasteria.com"]
[{"$f":"Database!$B121&Database!$C121&Database!$D121","v":"Nord RHFD: Informasjonssikkerhet og ROS-analyser15"},"Nord RHF","D: Informasjonssikkerhet og ROS-analyser",15,"Advisense AS","offentlig@transcendentgroup.com "]
[{"$f":"Database!$B122&Database!$C122&Database!$D122","v":"Nord RHFD: Informasjonssikkerhet og ROS-analyser16"},"Nord RHF","D: Informasjonssikkerhet og ROS-analyser",16,null,""]
[{"$f":"Database!$B123&Database!$C123&Database!$D123","v":"Nord RHFD: Informasjonssikkerhet og ROS-analyser17"},"Nord RHF","D: Informasjonssikkerhet og ROS-analyser",17,null,""]
[{"$f":"Database!$B124&Database!$C124&Database!$D124","v":"Nord RHFD: Informasjonssikkerhet og ROS-analyser18"},"Nord RHF","D: Informasjonssikkerhet og ROS-analyser",18,null,""]
[{"$f":"Database!$B125&Database!$C125&Database!$D125","v":"Nord RHFD: Informasjonssikkerhet og ROS-analyser19"},"Nord RHF","D: Informasjonssikkerhet og ROS-analyser",19,null,""]
[{"$f":"Database!$B126&Database!$C126&Database!$D126","v":"Nord RHFD: Informasjonssikkerhet og ROS-analyser20"},"Nord RHF","D: Informasjonssikkerhet og ROS-analyser",20,null,""]
[{"$f":"Database!$B127&Database!$C127&Database!$D127","v":"Nord RHFD: Informasjonssikkerhet og ROS-analyser21"},"Nord RHF","D: Informasjonssikkerhet og ROS-analyser",21,null,""]
[{"$f":"Database!$B128&Database!$C128&Database!$D128","v":"Nord RHFD: Informasjonssikkerhet og ROS-analyser22"},"Nord RHF","D: Informasjonssikkerhet og ROS-analyser",22,null,""]
[{"$f":"Database!$B129&Database!$C129&Database!$D129","v":"Nord RHFD: Informasjonssikkerhet og ROS-analyser23"},"Nord RHF","D: Informasjonssikkerhet og ROS-analyser",23,null,""]
[{"$f":"Database!$B130&Database!$C130&Database!$D130","v":"Nord RHFD: Informasjonssikkerhet og ROS-analyser24"},"Nord RHF","D: Informasjonssikkerhet og ROS-analyser",24,null,""]
[{"$f":"Database!$B131&Database!$C131&Database!$D131","v":"Nord RHFD: Informasjonssikkerhet og ROS-analyser25"},"Nord RHF","D: Informasjonssikkerhet og ROS-analyser",25,null,""]
[{"$f":"Database!$B132&Database!$C132&Database!$D132","v":"Nord RHFD: Informasjonssikkerhet og ROS-analyser26"},"Nord RHF","D: Informasjonssikkerhet og ROS-analyser",26,null,""]
[{"$f":"Database!$B133&Database!$C133&Database!$D133","v":"Nord RHFD: Informasjonssikkerhet og ROS-analyser27"},"Nord RHF","D: Informasjonssikkerhet og ROS-analyser",27,null,""]
[{"$f":"Database!$B134&Database!$C134&Database!$D134","v":"Nord RHFD: Informasjonssikkerhet og ROS-analyser28"},"Nord RHF","D: Informasjonssikkerhet og ROS-analyser",28,null,""]
[{"$f":"Database!$B135&Database!$C135&Database!$D135","v":"Nord RHFD: Informasjonssikkerhet og ROS-analyser29"},"Nord RHF","D: Informasjonssikkerhet og ROS-analyser",29,null,""]
[{"$f":"Database!$B136&Database!$C136&Database!$D136","v":"Nord RHFD: Informasjonssikkerhet og ROS-analyser30"},"Nord RHF","D: Informasjonssikkerhet og ROS-analyser",30,null,""]
[{"$f":"Database!$B137&Database!$C137&Database!$D137","v":"Nord RHFD: Informasjonssikkerhet og ROS-analyser31"},"Nord RHF","D: Informasjonssikkerhet og ROS-analyser",31,null,""]
[{"$f":"Database!$B138&Database!$C138&Database!$D138","v":"Nord RHFD: Informasjonssikkerhet og ROS-analyser32"},"Nord RHF","D: Informasjonssikkerhet og ROS-analyser",32,null,""]
[{"$f":"Database!$B139&Database!$C139&Database!$D139","v":"Nord RHFD: Informasjonssikkerhet og ROS-analyser33"},"Nord RHF","D: Informasjonssikkerhet og ROS-analyser",33,null,""]
[{"$f":"Database!$B140&Database!$C140&Database!$D140","v":"Nord RHFD: Informasjonssikkerhet og ROS-analyser34"},"Nord RHF","D: Informasjonssikkerhet og ROS-analyser",34,null,""]
[{"$f":"Database!$B141&Database!$C141&Database!$D141","v":""},null,null,null,null,""]
[{"$f":"Database!$B142&Database!$C142&Database!$D142","v":"Nord RHFE: Test og release1"},"Nord RHF","E: Test og release",1,"A-2 Norge AS","utlysninger@a-2.no"]
[{"$f":"Database!$B143&Database!$C143&Database!$D143","v":"Nord RHFE: Test og release2"},"Nord RHF","E: Test og release",2,"Aboveit AS ","salg@aboveit.no "]
[{"$f":"Database!$B144&Database!$C144&Database!$D144","v":"Nord RHFE: Test og release3"},"Nord RHF","E: Test og release",3,"Accenture AS ","rammeavtale.helse@accenture.com"]
[{"$f":"Database!$B145&Database!$C145&Database!$D145","v":"Nord RHFE: Test og release4"},"Nord RHF","E: Test og release",4,"Systra Norge AS ","firmapost@systra.com"]
[{"$f":"Database!$B146&Database!$C146&Database!$D146","v":"Nord RHFE: Test og release5"},"Nord RHF","E: Test og release",5,"Bouvet Norge AS ","Sykehusinnkjop2023@bouvet.no"]
[{"$f":"Database!$B147&Database!$C147&Database!$D147","v":"Nord RHFE: Test og release6"},"Nord RHF","E: Test og release",6,"Capgemini Norge AS ","helsenord.no@capgemini.com"]
[{"$f":"Database!$B148&Database!$C148&Database!$D148","v":"Nord RHFE: Test og release7"},"Nord RHF","E: Test og release",7,"Deloitte AS ","noanbud@DELOITTE.no"]
[{"$f":"Database!$B149&Database!$C149&Database!$D149","v":"Nord RHFE: Test og release8"},"Nord RHF","E: Test og release",8,"Emagine AS ","sykehusinnkjop@emagine.no"]
[{"$f":"Database!$B150&Database!$C150&Database!$D150","v":"Nord RHFE: Test og release9"},"Nord RHF","E: Test og release",9,"Ernst & Young AS ","offentlige.anskaffelser@no.ey.com"]
[{"$f":"Database!$B151&Database!$C151&Database!$D151","v":"Nord RHFE: Test og release10"},"Nord RHF","E: Test og release",10,"Ework Group Norway AS ","sykehusinnkjop@eworkgroup.com  "]
[{"$f":"Database!$B152&Database!$C152&Database!$D152","v":"Nord RHFE: Test og release11"},"Nord RHF","E: Test og release",11,"Experis AS ","sykehusinnkjop@no.experis.com"]
[{"$f":"Database!$B153&Database!$C153&Database!$D153","v":"Nord RHFE: Test og release12"},"Nord RHF","E: Test og release",12,"IT Consult AS ","firmapost@itc.no"]
[{"$f":"Database!$B154&Database!$C154&Database!$D154","v":"Nord RHFE: Test og release13"},"Nord RHF","E: Test og release",13,"Netcompany AS ","anbud.no@netcompany.com "]
[{"$f":"Database!$B155&Database!$C155&Database!$D155","v":"Nord RHFE: Test og release14"},"Nord RHF","E: Test og release",14,"SOCO Norge AS ","post@soco.no"]
[{"$f":"Database!$B156&Database!$C156&Database!$D156","v":"Nord RHFE: Test og release15"},"Nord RHF","E: Test og release",15,"Sopra Steria AS ","helse@soprasteria.com"]
[{"$f":"Database!$B157&Database!$C157&Database!$D157","v":"Nord RHFE: Test og release16"},"Nord RHF","E: Test og release",16,null,""]
[{"$f":"Database!$B158&Database!$C158&Database!$D158","v":"Nord RHFE: Test og release17"},"Nord RHF","E: Test og release",17,null,""]
[{"$f":"Database!$B159&Database!$C159&Database!$D159","v":"Nord RHFE: Test og release18"},"Nord RHF","E: Test og release",18,null,""]
[{"$f":"Database!$B160&Database!$C160&Database!$D160","v":"Nord RHFE: Test og release19"},"Nord RHF","E: Test og release",19,null,""]
[{"$f":"Database!$B161&Database!$C161&Database!$D161","v":"Nord RHFE: Test og release20"},"Nord RHF","E: Test og release",20,null,""]
[{"$f":"Database!$B162&Database!$C162&Database!$D162","v":"Nord RHFE: Test og release21"},"Nord RHF","E: Test og release",21,null,""]
[{"$f":"Database!$B163&Database!$C163&Database!$D163","v":"Nord RHFE: Test og release22"},"Nord RHF","E: Test og release",22,null,""]
[{"$f":"Database!$B164&Database!$C164&Database!$D164","v":"Nord RHFE: Test og release23"},"Nord RHF","E: Test og release",23,null,""]
[{"$f":"Database!$B165&Database!$C165&Database!$D165","v":"Nord RHFE: Test og release24"},"Nord RHF","E: Test og release",24,null,""]
[{"$f":"Database!$B166&Database!$C166&Database!$D166","v":"Nord RHFE: Test og release25"},"Nord RHF","E: Test og release",25,null,""]
[{"$f":"Database!$B167&Database!$C167&Database!$D167","v":"Nord RHFE: Test og release26"},"Nord RHF","E: Test og release",26,null,""]
[{"$f":"Database!$B168&Database!$C168&Database!$D168","v":"Nord RHFE: Test og release27"},"Nord RHF","E: Test og release",27,null,""]
[{"$f":"Database!$B169&Database!$C169&Database!$D169","v":"Nord RHFE: Test og release28"},"Nord RHF","E: Test og release",28,null,""]
[{"$f":"Database!$B170&Database!$C170&Database!$D170","v":"Nord RHFE: Test og release29"},"Nord RHF","E: Test og release",29,null,""]
[{"$f":"Database!$B171&Database!$C171&Database!$D171","v":"Nord RHFE: Test og release30"},"Nord RHF","E: Test og release",30,null,""]
[{"$f":"Database!$B172&Database!$C172&Database!$D172","v":"Nord RHFE: Test og release31"},"Nord RHF","E: Test og release",31,null,""]
[{"$f":"Database!$B173&Database!$C173&Database!$D173","v":"Nord RHFE: Test og release32"},"Nord RHF","E: Test og release",32,null,""]
[{"$f":"Database!$B174&Database!$C174&Database!$D174","v":"Nord RHFE: Test og release33"},"Nord RHF","E: Test og release",33,null,""]
[{"$f":"Database!$B175&Database!$C175&Database!$D175","v":"Nord RHFE: Test og release34"},"Nord RHF","E: Test og release",34,null,""]
[{"$f":"Database!$B176&Database!$C176&Database!$D176","v":""},null,null,null,null,""]
[{"$f":"Database!$B177&Database!$C177&Database!$D177","v":"Nord RHFF: Systemutvikling1"},"Nord RHF","F: Systemutvikling",1,"A-2 Norge AS","utlysninger@a-2.no"]
[{"$f":"Database!$B178&Database!$C178&Database!$D178","v":"Nord RHFF: Systemutvikling2"},"Nord RHF","F: Systemutvikling",2,"Aboveit AS ","salg@aboveit.no "]
[{"$f":"Database!$B179&Database!$C179&Database!$D179","v":"Nord RHFF: Systemutvikling3"},"Nord RHF","F: Systemutvikling",3,"Accenture AS ","rammeavtale.helse@accenture.com"]
[{"$f":"Database!$B180&Database!$C180&Database!$D180","v":"Nord RHFF: Systemutvikling4"},"Nord RHF","F: Systemutvikling",4,"Systra Norge AS ","firmapost@systra.com"]
[{"$f":"Database!$B181&Database!$C181&Database!$D181","v":"Nord RHFF: Systemutvikling5"},"Nord RHF","F: Systemutvikling",5,"Bouvet Norge AS ","Sykehusinnkjop2023@bouvet.no"]
[{"$f":"Database!$B182&Database!$C182&Database!$D182","v":"Nord RHFF: Systemutvikling6"},"Nord RHF","F: Systemutvikling",6,"Capgemini Norge AS ","helsenord.no@capgemini.com"]
[{"$f":"Database!$B183&Database!$C183&Database!$D183","v":"Nord RHFF: Systemutvikling7"},"Nord RHF","F: Systemutvikling",7,"Dfind Consulting AS ","consulting@dfind.no"]
[{"$f":"Database!$B184&Database!$C184&Database!$D184","v":"Nord RHFF: Systemutvikling8"},"Nord RHF","F: Systemutvikling",8,"Ernst & Young AS ","offentlige.anskaffelser@no.ey.com"]
[{"$f":"Database!$B185&Database!$C185&Database!$D185","v":"Nord RHFF: Systemutvikling9"},"Nord RHF","F: Systemutvikling",9,"Ework Group Norway AS ","sykehusinnkjop@eworkgroup.com  "]
[{"$f":"Database!$B186&Database!$C186&Database!$D186","v":"Nord RHFF: Systemutvikling10"},"Nord RHF","F: Systemutvikling",10,"Experis AS ","sykehusinnkjop@no.experis.com"]
[{"$f":"Database!$B187&Database!$C187&Database!$D187","v":"Nord RHFF: Systemutvikling11"},"Nord RHF","F: Systemutvikling",11,"IT Consult AS ","firmapost@itc.no"]
[{"$f":"Database!$B188&Database!$C188&Database!$D188","v":"Nord RHFF: Systemutvikling12"},"Nord RHF","F: Systemutvikling",12,"KPMG AS ","helse@kpmg.no"]
[{"$f":"Database!$B189&Database!$C189&Database!$D189","v":"Nord RHFF: Systemutvikling13"},"Nord RHF","F: Systemutvikling",13,"Netcompany AS ","anbud.no@netcompany.com "]
[{"$f":"Database!$B190&Database!$C190&Database!$D190","v":"Nord RHFF: Systemutvikling14"},"Nord RHF","F: Systemutvikling",14,"Sopra Steria AS ","helse@soprasteria.com"]
[{"$f":"Database!$B191&Database!$C191&Database!$D191","v":"Nord RHFF: Systemutvikling15"},"Nord RHF","F: Systemutvikling",15,"Twoday Conceptos AS ","salg.conceptos@twoday.com"]
[{"$f":"Database!$B192&Database!$C192&Database!$D192","v":"Nord RHFF: Systemutvikling16"},"Nord RHF","F: Systemutvikling",16,null,""]
[{"$f":"Database!$B193&Database!$C193&Database!$D193","v":"Nord RHFF: Systemutvikling17"},"Nord RHF","F: Systemutvikling",17,null,""]
[{"$f":"Database!$B194&Database!$C194&Database!$D194","v":"Nord RHFF: Systemutvikling18"},"Nord RHF","F: Systemutvikling",18,null,""]
[{"$f":"Database!$B195&Database!$C195&Database!$D195","v":"Nord RHFF: Systemutvikling19"},"Nord RHF","F: Systemutvikling",19,null,""]
[{"$f":"Database!$B196&Database!$C196&Database!$D196","v":"Nord RHFF: Systemutvikling20"},"Nord RHF","F: Systemutvikling",20,null,""]
[{"$f":"Database!$B197&Database!$C197&Database!$D197","v":"Nord RHFF: Systemutvikling21"},"Nord RHF","F: Systemutvikling",21,null,""]
[{"$f":"Database!$B198&Database!$C198&Database!$D198","v":"Nord RHFF: Systemutvikling22"},"Nord RHF","F: Systemutvikling",22,null,""]
[{"$f":"Database!$B199&Database!$C199&Database!$D199","v":"Nord RHFF: Systemutvikling23"},"Nord RHF","F: Systemutvikling",23,null,""]
[{"$f":"Database!$B200&Database!$C200&Database!$D200","v":"Nord RHFF: Systemutvikling24"},"Nord RHF","F: Systemutvikling",24,null,""]
[{"$f":"Database!$B201&Database!$C201&Database!$D201","v":"Nord RHFF: Systemutvikling25"},"Nord RHF","F: Systemutvikling",25,null,""]
[{"$f":"Database!$B202&Database!$C202&Database!$D202","v":"Nord RHFF: Systemutvikling26"},"Nord RHF","F: Systemutvikling",26,null,""]
[{"$f":"Database!$B203&Database!$C203&Database!$D203","v":"Nord RHFF: Systemutvikling27"},"Nord RHF","F: Systemutvikling",27,null,""]
[{"$f":"Database!$B204&Database!$C204&Database!$D204","v":"Nord RHFF: Systemutvikling28"},"Nord RHF","F: Systemutvikling",28,null,""]
[{"$f":"Database!$B205&Database!$C205&Database!$D205","v":"Nord RHFF: Systemutvikling29"},"Nord RHF","F: Systemutvikling",29,null,""]
[{"$f":"Database!$B206&Database!$C206&Database!$D206","v":"Nord RHFF: Systemutvikling30"},"Nord RHF","F: Systemutvikling",30,null,""]
[{"$f":"Database!$B207&Database!$C207&Database!$D207","v":"Nord RHFF: Systemutvikling31"},"Nord RHF","F: Systemutvikling",31,null,""]
[{"$f":"Database!$B208&Database!$C208&Database!$D208","v":"Nord RHFF: Systemutvikling32"},"Nord RHF","F: Systemutvikling",32,null,""]
[{"$f":"Database!$B209&Database!$C209&Database!$D209","v":"Nord RHFF: Systemutvikling33"},"Nord RHF","F: Systemutvikling",33,null,""]
[{"$f":"Database!$B210&Database!$C210&Database!$D210","v":"Nord RHFF: Systemutvikling34"},"Nord RHF","F: Systemutvikling",34,null,""]
[{"$f":"Database!$B211&Database!$C211&Database!$D211","v":""},null,null,null,null,""]
[{"$f":"Database!$B212&Database!$C212&Database!$D212","v":"Nord RHFG: Applikasjonsforvaltning, drift og forvaltning av IT-systemer og plattformer1"},"Nord RHF","G: Applikasjonsforvaltning, drift og forvaltning av IT-systemer og plattformer",1,"A-2 Norge AS","utlysninger@a-2.no"]
[{"$f":"Database!$B213&Database!$C213&Database!$D213","v":"Nord RHFG: Applikasjonsforvaltning, drift og forvaltning av IT-systemer og plattformer2"},"Nord RHF","G: Applikasjonsforvaltning, drift og forvaltning av IT-systemer og plattformer",2,"Bouvet Norge AS ","Sykehusinnkjop2023@bouvet.no"]
[{"$f":"Database!$B214&Database!$C214&Database!$D214","v":"Nord RHFG: Applikasjonsforvaltning, drift og forvaltning av IT-systemer og plattformer3"},"Nord RHF","G: Applikasjonsforvaltning, drift og forvaltning av IT-systemer og plattformer",3,"Capgemini Norge AS ","helsenord.no@capgemini.com"]
[{"$f":"Database!$B215&Database!$C215&Database!$D215","v":"Nord RHFG: Applikasjonsforvaltning, drift og forvaltning av IT-systemer og plattformer4"},"Nord RHF","G: Applikasjonsforvaltning, drift og forvaltning av IT-systemer og plattformer",4,"CGI Norge AS ","avrop@cgi.com"]
[{"$f":"Database!$B216&Database!$C216&Database!$D216","v":"Nord RHFG: Applikasjonsforvaltning, drift og forvaltning av IT-systemer og plattformer5"},"Nord RHF","G: Applikasjonsforvaltning, drift og forvaltning av IT-systemer og plattformer",5,"Crayon AS ","firmapost@crayon.com"]
[{"$f":"Database!$B217&Database!$C217&Database!$D217","v":"Nord RHFG: Applikasjonsforvaltning, drift og forvaltning av IT-systemer og plattformer6"},"Nord RHF","G: Applikasjonsforvaltning, drift og forvaltning av IT-systemer og plattformer",6,"Emagine AS ","sykehusinnkjop@emagine.no"]
[{"$f":"Database!$B218&Database!$C218&Database!$D218","v":"Nord RHFG: Applikasjonsforvaltning, drift og forvaltning av IT-systemer og plattformer7"},"Nord RHF","G: Applikasjonsforvaltning, drift og forvaltning av IT-systemer og plattformer",7,"Ernst & Young AS ","offentlige.anskaffelser@no.ey.com"]
[{"$f":"Database!$B219&Database!$C219&Database!$D219","v":"Nord RHFG: Applikasjonsforvaltning, drift og forvaltning av IT-systemer og plattformer8"},"Nord RHF","G: Applikasjonsforvaltning, drift og forvaltning av IT-systemer og plattformer",8,"Ework Group Norway AS ","sykehusinnkjop@eworkgroup.com  "]
[{"$f":"Database!$B220&Database!$C220&Database!$D220","v":"Nord RHFG: Applikasjonsforvaltning, drift og forvaltning av IT-systemer og plattformer9"},"Nord RHF","G: Applikasjonsforvaltning, drift og forvaltning av IT-systemer og plattformer",9,"Experis AS ","sykehusinnkjop@no.experis.com"]
[{"$f":"Database!$B221&Database!$C221&Database!$D221","v":"Nord RHFG: Applikasjonsforvaltning, drift og forvaltning av IT-systemer og plattformer10"},"Nord RHF","G: Applikasjonsforvaltning, drift og forvaltning av IT-systemer og plattformer",10,"HRP AS","marked@hrpas.no"]
[{"$f":"Database!$B222&Database!$C222&Database!$D222","v":"Nord RHFG: Applikasjonsforvaltning, drift og forvaltning av IT-systemer og plattformer11"},"Nord RHF","G: Applikasjonsforvaltning, drift og forvaltning av IT-systemer og plattformer",11,"IT Consult AS ","firmapost@itc.no"]
[{"$f":"Database!$B223&Database!$C223&Database!$D223","v":"Nord RHFG: Applikasjonsforvaltning, drift og forvaltning av IT-systemer og plattformer12"},"Nord RHF","G: Applikasjonsforvaltning, drift og forvaltning av IT-systemer og plattformer",12,"Move AS","konsulentledelse@move.no"]
[{"$f":"Database!$B224&Database!$C224&Database!$D224","v":"Nord RHFG: Applikasjonsforvaltning, drift og forvaltning av IT-systemer og plattformer13"},"Nord RHF","G: Applikasjonsforvaltning, drift og forvaltning av IT-systemer og plattformer",13,"Netcompany AS ","anbud.no@netcompany.com "]
[{"$f":"Database!$B225&Database!$C225&Database!$D225","v":"Nord RHFG: Applikasjonsforvaltning, drift og forvaltning av IT-systemer og plattformer14"},"Nord RHF","G: Applikasjonsforvaltning, drift og forvaltning av IT-systemer og plattformer",14,"Nordlo Grenland AS","firmapost.grenland@nordlo.com"]
[{"$f":"Database!$B226&Database!$C226&Database!$D226","v":"Nord RHFG: Applikasjonsforvaltning, drift og forvaltning av IT-systemer og plattformer15"},"Nord RHF","G: Applikasjonsforvaltning, drift og forvaltning av IT-systemer og plattformer",15,"Proact IT Norge AS ","bestilling@proact.no "]
[{"$f":"Database!$B227&Database!$C227&Database!$D227","v":"Nord RHFG: Applikasjonsforvaltning, drift og forvaltning av IT-systemer og plattformer16"},"Nord RHF","G: Applikasjonsforvaltning, drift og forvaltning av IT-systemer og plattformer",16,"Sopra Steria AS ","helse@soprasteria.com"]
[{"$f":"Database!$B228&Database!$C228&Database!$D228","v":"Nord RHFG: Applikasjonsforvaltning, drift og forvaltning av IT-systemer og plattformer17"},"Nord RHF","G: Applikasjonsforvaltning, drift og forvaltning av IT-systemer og plattformer",17,null,""]
[{"$f":"Database!$B229&Database!$C229&Database!$D229","v":"Nord RHFG: Applikasjonsforvaltning, drift og forvaltning av IT-systemer og plattformer18"},"Nord RHF","G: Applikasjonsforvaltning, drift og forvaltning av IT-systemer og plattformer",18,null,""]
[{"$f":"Database!$B230&Database!$C230&Database!$D230","v":"Nord RHFG: Applikasjonsforvaltning, drift og forvaltning av IT-systemer og plattformer19"},"Nord RHF","G: Applikasjonsforvaltning, drift og forvaltning av IT-systemer og plattformer",19,null,""]
[{"$f":"Database!$B231&Database!$C231&Database!$D231","v":"Nord RHFG: Applikasjonsforvaltning, drift og forvaltning av IT-systemer og plattformer20"},"Nord RHF","G: Applikasjonsforvaltning, drift og forvaltning av IT-systemer og plattformer",20,null,""]
[{"$f":"Database!$B232&Database!$C232&Database!$D232","v":"Nord RHFG: Applikasjonsforvaltning, drift og forvaltning av IT-systemer og plattformer21"},"Nord RHF","G: Applikasjonsforvaltning, drift og forvaltning av IT-systemer og plattformer",21,null,""]
[{"$f":"Database!$B233&Database!$C233&Database!$D233","v":"Nord RHFG: Applikasjonsforvaltning, drift og forvaltning av IT-systemer og plattformer22"},"Nord RHF","G: Applikasjonsforvaltning, drift og forvaltning av IT-systemer og plattformer",22,null,""]
[{"$f":"Database!$B234&Database!$C234&Database!$D234","v":"Nord RHFG: Applikasjonsforvaltning, drift og forvaltning av IT-systemer og plattformer23"},"Nord RHF","G: Applikasjonsforvaltning, drift og forvaltning av IT-systemer og plattformer",23,null,""]
[{"$f":"Database!$B235&Database!$C235&Database!$D235","v":"Nord RHFG: Applikasjonsforvaltning, drift og forvaltning av IT-systemer og plattformer24"},"Nord RHF","G: Applikasjonsforvaltning, drift og forvaltning av IT-systemer og plattformer",24,null,""]
[{"$f":"Database!$B236&Database!$C236&Database!$D236","v":"Nord RHFG: Applikasjonsforvaltning, drift og forvaltning av IT-systemer og plattformer25"},"Nord RHF","G: Applikasjonsforvaltning, drift og forvaltning av IT-systemer og plattformer",25,null,""]
[{"$f":"Database!$B237&Database!$C237&Database!$D237","v":"Nord RHFG: Applikasjonsforvaltning, drift og forvaltning av IT-systemer og plattformer26"},"Nord RHF","G: Applikasjonsforvaltning, drift og forvaltning av IT-systemer og plattformer",26,null,""]
[{"$f":"Database!$B238&Database!$C238&Database!$D238","v":"Nord RHFG: Applikasjonsforvaltning, drift og forvaltning av IT-systemer og plattformer27"},"Nord RHF","G: Applikasjonsforvaltning, drift og forvaltning av IT-systemer og plattformer",27,null,""]
[{"$f":"Database!$B239&Database!$C239&Database!$D239","v":"Nord RHFG: Applikasjonsforvaltning, drift og forvaltning av IT-systemer og plattformer28"},"Nord RHF","G: Applikasjonsforvaltning, drift og forvaltning av IT-systemer og plattformer",28,null,""]
[{"$f":"Database!$B240&Database!$C240&Database!$D240","v":"Nord RHFG: Applikasjonsforvaltning, drift og forvaltning av IT-systemer og plattformer29"},"Nord RHF","G: Applikasjonsforvaltning, drift og forvaltning av IT-systemer og plattformer",29,null,""]
[{"$f":"Database!$B241&Database!$C241&Database!$D241","v":"Nord RHFG: Applikasjonsforvaltning, drift og forvaltning av IT-systemer og plattformer30"},"Nord RHF","G: Applikasjonsforvaltning, drift og forvaltning av IT-systemer og plattformer",30,null,""]
[{"$f":"Database!$B242&Database!$C242&Database!$D242","v":"Nord RHFG: Applikasjonsforvaltning, drift og forvaltning av IT-systemer og plattformer31"},"Nord RHF","G: Applikasjonsforvaltning, drift og forvaltning av IT-systemer og plattformer",31,null,""]
[{"$f":"Database!$B243&Database!$C243&Database!$D243","v":"Nord RHFG: Applikasjonsforvaltning, drift og forvaltning av IT-systemer og plattformer32"},"Nord RHF","G: Applikasjonsforvaltning, drift og forvaltning av IT-systemer og plattformer",32,null,""]
[{"$f":"Database!$B244&Database!$C244&Database!$D244","v":"Nord RHFG: Applikasjonsforvaltning, drift og forvaltning av IT-systemer og plattformer33"},"Nord RHF","G: Applikasjonsforvaltning, drift og forvaltning av IT-systemer og plattformer",33,null,""]
[{"$f":"Database!$B245&Database!$C245&Database!$D245","v":"Nord RHFG: Applikasjonsforvaltning, drift og forvaltning av IT-systemer og plattformer34"},"Nord RHF","G: Applikasjonsforvaltning, drift og forvaltning av IT-systemer og plattformer",34,null,""]
[{"$f":"Database!$B246&Database!$C246&Database!$D246","v":""},null,null,null,null,""]
[{"$f":"Database!$B247&Database!$C247&Database!$D247","v":"Nord RHFH: Nettverk1"},"Nord RHF","H: Nettverk",1,"A-2 Norge AS","utlysninger@a-2.no"]
[{"$f":"Database!$B248&Database!$C248&Database!$D248","v":"Nord RHFH: Nettverk2"},"Nord RHF","H: Nettverk",2,"Conscia Norge AS ","salg@conscia.no "]
[{"$f":"Database!$B249&Database!$C249&Database!$D249","v":"Nord RHFH: Nettverk3"},"Nord RHF","H: Nettverk",3,"Emagine AS ","sykehusinnkjop@emagine.no"]
[{"$f":"Database!$B250&Database!$C250&Database!$D250","v":"Nord RHFH: Nettverk4"},"Nord RHF","H: Nettverk",4,"Ework Group Norway AS ","sykehusinnkjop@eworkgroup.com  "]
[{"$f":"Database!$B251&Database!$C251&Database!$D251","v":"Nord RHFH: Nettverk5"},"Nord RHF","H: Nettverk",5,"Experis AS ","sykehusinnkjop@no.experis.com"]
[{"$f":"Database!$B252&Database!$C252&Database!$D252","v":"Nord RHFH: Nettverk6"},"Nord RHF","H: Nettverk",6,"HRP AS","marked@hrpas.no"]
[{"$f":"Database!$B253&Database!$C253&Database!$D253","v":"Nord RHFH: Nettverk7"},"Nord RHF","H: Nettverk",7,"IT Consult AS ","firmapost@itc.no"]
[{"$f":"Database!$B254&Database!$C254&Database!$D254","v":"Nord RHFH: Nettverk8"},"Nord RHF","H: Nettverk",8,"Move AS","konsulentledelse@move.no"]
[{"$f":"Database!$B255&Database!$C255&Database!$D255","v":"Nord RHFH: Nettverk9"},"Nord RHF","H: Nettverk",9,"NetNordic Norway AS ","salg@netnordic.no"]
[{"$f":"Database!$B256&Database!$C256&Database!$D256","v":"Nord RHFH: Nettverk10"},"Nord RHF","H: Nettverk",10,"Nordlo Grenland AS","firmapost.grenland@nordlo.com"]
[{"$f":"Database!$B257&Database!$C257&Database!$D257","v":"Nord RHFH: Nettverk11"},"Nord RHF","H: Nettverk",11,"Sopra Steria AS ","helse@soprasteria.com"]
[{"$f":"Database!$B258&Database!$C258&Database!$D258","v":"Nord RHFH: Nettverk12"},"Nord RHF","H: Nettverk",12,null,""]
[{"$f":"Database!$B259&Database!$C259&Database!$D259","v":"Nord RHFH: Nettverk13"},"Nord RHF","H: Nettverk",13,null,""]
[{"$f":"Database!$B260&Database!$C260&Database!$D260","v":"Nord RHFH: Nettverk14"},"Nord RHF","H: Nettverk",14,null,""]
[{"$f":"Database!$B261&Database!$C261&Database!$D261","v":"Nord RHFH: Nettverk15"},"Nord RHF","H: Nettverk",15,null,""]
[{"$f":"Database!$B262&Database!$C262&Database!$D262","v":"Nord RHFH: Nettverk16"},"Nord RHF","H: Nettverk",16,null,""]
[{"$f":"Database!$B263&Database!$C263&Database!$D263","v":"Nord RHFH: Nettverk17"},"Nord RHF","H: Nettverk",17,null,""]
[{"$f":"Database!$B264&Database!$C264&Database!$D264","v":"Nord RHFH: Nettverk18"},"Nord RHF","H: Nettverk",18,null,""]
[{"$f":"Database!$B265&Database!$C265&Database!$D265","v":"Nord RHFH: Nettverk19"},"Nord RHF","H: Nettverk",19,null,""]
[{"$f":"Database!$B266&Database!$C266&Database!$D266","v":"Nord RHFH: Nettverk20"},"Nord RHF","H: Nettverk",20,null,""]
[{"$f":"Database!$B267&Database!$C267&Database!$D267","v":"Nord RHFH: Nettverk21"},"Nord RHF","H: Nettverk",21,null,""]
[{"$f":"Database!$B268&Database!$C268&Database!$D268","v":"Nord RHFH: Nettverk22"},"Nord RHF","H: Nettverk",22,null,""]
[{"$f":"Database!$B269&Database!$C269&Database!$D269","v":"Nord RHFH: Nettverk23"},"Nord RHF","H: Nettverk",23,null,""]
[{"$f":"Database!$B270&Database!$C270&Database!$D270","v":"Nord RHFH: Nettverk24"},"Nord RHF","H: Nettverk",24,null,""]
[{"$f":"Database!$B271&Database!$C271&Database!$D271","v":"Nord RHFH: Nettverk25"},"Nord RHF","H: Nettverk",25,null,""]
[{"$f":"Database!$B272&Database!$C272&Database!$D272","v":"Nord RHFH: Nettverk26"},"Nord RHF","H: Nettverk",26,null,""]
[{"$f":"Database!$B273&Database!$C273&Database!$D273","v":"Nord RHFH: Nettverk27"},"Nord RHF","H: Nettverk",27,null,""]
[{"$f":"Database!$B274&Database!$C274&Database!$D274","v":"Nord RHFH: Nettverk28"},"Nord RHF","H: Nettverk",28,null,""]
[{"$f":"Database!$B275&Database!$C275&Database!$D275","v":"Nord RHFH: Nettverk29"},"Nord RHF","H: Nettverk",29,null,""]
[{"$f":"Database!$B276&Database!$C276&Database!$D276","v":"Nord RHFH: Nettverk30"},"Nord RHF","H: Nettverk",30,null,""]
[{"$f":"Database!$B277&Database!$C277&Database!$D277","v":"Nord RHFH: Nettverk31"},"Nord RHF","H: Nettverk",31,null,""]
[{"$f":"Database!$B278&Database!$C278&Database!$D278","v":"Nord RHFH: Nettverk32"},"Nord RHF","H: Nettverk",32,null,""]
[{"$f":"Database!$B279&Database!$C279&Database!$D279","v":"Nord RHFH: Nettverk33"},"Nord RHF","H: Nettverk",33,null,""]
[{"$f":"Database!$B280&Database!$C280&Database!$D280","v":"Nord RHFH: Nettverk34"},"Nord RHF","H: Nettverk",34,null,""]
[{"$f":"Database!$B281&Database!$C281&Database!$D281","v":""},null,null,null,null,""]
[{"$f":"Database!$B282&Database!$C282&Database!$D282","v":"Nord RHFI: Telekommunikasjon1"},"Nord RHF","I: Telekommunikasjon",1,"A-2 Norge AS","utlysninger@a-2.no"]
[{"$f":"Database!$B283&Database!$C283&Database!$D283","v":"Nord RHFI: Telekommunikasjon2"},"Nord RHF","I: Telekommunikasjon",2,"Experis AS ","sykehusinnkjop@no.experis.com"]
[{"$f":"Database!$B284&Database!$C284&Database!$D284","v":"Nord RHFI: Telekommunikasjon3"},"Nord RHF","I: Telekommunikasjon",3,"HRP AS","marked@hrpas.no"]
[{"$f":"Database!$B285&Database!$C285&Database!$D285","v":"Nord RHFI: Telekommunikasjon4"},"Nord RHF","I: Telekommunikasjon",4,"NetNordic Norway AS ","salg@netnordic.no"]
[{"$f":"Database!$B286&Database!$C286&Database!$D286","v":"Nord RHFI: Telekommunikasjon5"},"Nord RHF","I: Telekommunikasjon",5,null,""]
[{"$f":"Database!$B287&Database!$C287&Database!$D287","v":"Nord RHFI: Telekommunikasjon6"},"Nord RHF","I: Telekommunikasjon",6,null,""]
[{"$f":"Database!$B288&Database!$C288&Database!$D288","v":"Nord RHFI: Telekommunikasjon7"},"Nord RHF","I: Telekommunikasjon",7,null,""]
[{"$f":"Database!$B289&Database!$C289&Database!$D289","v":"Nord RHFI: Telekommunikasjon8"},"Nord RHF","I: Telekommunikasjon",8,null,""]
[{"$f":"Database!$B290&Database!$C290&Database!$D290","v":"Nord RHFI: Telekommunikasjon9"},"Nord RHF","I: Telekommunikasjon",9,null,""]
[{"$f":"Database!$B291&Database!$C291&Database!$D291","v":"Nord RHFI: Telekommunikasjon10"},"Nord RHF","I: Telekommunikasjon",10,null,""]
[{"$f":"Database!$B292&Database!$C292&Database!$D292","v":"Nord RHFI: Telekommunikasjon11"},"Nord RHF","I: Telekommunikasjon",11,null,""]
[{"$f":"Database!$B293&Database!$C293&Database!$D293","v":"Nord RHFI: Telekommunikasjon12"},"Nord RHF","I: Telekommunikasjon",12,null,""]
[{"$f":"Database!$B294&Database!$C294&Database!$D294","v":"Nord RHFI: Telekommunikasjon13"},"Nord RHF","I: Telekommunikasjon",13,null,""]
[{"$f":"Database!$B295&Database!$C295&Database!$D295","v":"Nord RHFI: Telekommunikasjon14"},"Nord RHF","I: Telekommunikasjon",14,null,""]
[{"$f":"Database!$B296&Database!$C296&Database!$D296","v":"Nord RHFI: Telekommunikasjon15"},"Nord RHF","I: Telekommunikasjon",15,null,""]
[{"$f":"Database!$B297&Database!$C297&Database!$D297","v":"Nord RHFI: Telekommunikasjon16"},"Nord RHF","I: Telekommunikasjon",16,null,""]
[{"$f":"Database!$B298&Database!$C298&Database!$D298","v":"Nord RHFI: Telekommunikasjon17"},"Nord RHF","I: Telekommunikasjon",17,null,""]
[{"$f":"Database!$B299&Database!$C299&Database!$D299","v":"Nord RHFI: Telekommunikasjon18"},"Nord RHF","I: Telekommunikasjon",18,null,""]
[{"$f":"Database!$B300&Database!$C300&Database!$D300","v":"Nord RHFI: Telekommunikasjon19"},"Nord RHF","I: Telekommunikasjon",19,null,""]
[{"$f":"Database!$B301&Database!$C301&Database!$D301","v":"Nord RHFI: Telekommunikasjon20"},"Nord RHF","I: Telekommunikasjon",20,null,""]
[{"$f":"Database!$B302&Database!$C302&Database!$D302","v":"Nord RHFI: Telekommunikasjon21"},"Nord RHF","I: Telekommunikasjon",21,null,""]
[{"$f":"Database!$B303&Database!$C303&Database!$D303","v":"Nord RHFI: Telekommunikasjon22"},"Nord RHF","I: Telekommunikasjon",22,null,""]
[{"$f":"Database!$B304&Database!$C304&Database!$D304","v":"Nord RHFI: Telekommunikasjon23"},"Nord RHF","I: Telekommunikasjon",23,null,""]
[{"$f":"Database!$B305&Database!$C305&Database!$D305","v":"Nord RHFI: Telekommunikasjon24"},"Nord RHF","I: Telekommunikasjon",24,null,""]
[{"$f":"Database!$B306&Database!$C306&Database!$D306","v":"Nord RHFI: Telekommunikasjon25"},"Nord RHF","I: Telekommunikasjon",25,null,""]
[{"$f":"Database!$B307&Database!$C307&Database!$D307","v":"Nord RHFI: Telekommunikasjon26"},"Nord RHF","I: Telekommunikasjon",26,null,""]
[{"$f":"Database!$B308&Database!$C308&Database!$D308","v":"Nord RHFI: Telekommunikasjon27"},"Nord RHF","I: Telekommunikasjon",27,null,""]
[{"$f":"Database!$B309&Database!$C309&Database!$D309","v":"Nord RHFI: Telekommunikasjon28"},"Nord RHF","I: Telekommunikasjon",28,null,""]
[{"$f":"Database!$B310&Database!$C310&Database!$D310","v":"Nord RHFI: Telekommunikasjon29"},"Nord RHF","I: Telekommunikasjon",29,null,""]
[{"$f":"Database!$B311&Database!$C311&Database!$D311","v":"Nord RHFI: Telekommunikasjon30"},"Nord RHF","I: Telekommunikasjon",30,null,""]
[{"$f":"Database!$B312&Database!$C312&Database!$D312","v":"Nord RHFI: Telekommunikasjon31"},"Nord RHF","I: Telekommunikasjon",31,null,""]
[{"$f":"Database!$B313&Database!$C313&Database!$D313","v":"Nord RHFI: Telekommunikasjon32"},"Nord RHF","I: Telekommunikasjon",32,null,""]
[{"$f":"Database!$B314&Database!$C314&Database!$D314","v":"Nord RHFI: Telekommunikasjon33"},"Nord RHF","I: Telekommunikasjon",33,null,""]
[{"$f":"Database!$B315&Database!$C315&Database!$D315","v":"Nord RHFI: Telekommunikasjon34"},"Nord RHF","I: Telekommunikasjon",34,null,""]
[{"$f":"Database!$B316&Database!$C316&Database!$D316","v":""},null,null,null,null,""]
[{"$f":"Database!$B317&Database!$C317&Database!$D317","v":"Nord RHFJ: Tverrfaglige team1"},"Nord RHF","J: Tverrfaglige team",1,"A-2 Norge AS","utlysninger@a-2.no"]
[{"$f":"Database!$B318&Database!$C318&Database!$D318","v":"Nord RHFJ: Tverrfaglige team2"},"Nord RHF","J: Tverrfaglige team",2,"Accenture AS ","rammeavtale.helse@accenture.com"]
[{"$f":"Database!$B319&Database!$C319&Database!$D319","v":"Nord RHFJ: Tverrfaglige team3"},"Nord RHF","J: Tverrfaglige team",3,"Bouvet Norge AS ","Sykehusinnkjop2023@bouvet.no"]
[{"$f":"Database!$B320&Database!$C320&Database!$D320","v":"Nord RHFJ: Tverrfaglige team4"},"Nord RHF","J: Tverrfaglige team",4,"Capgemini Norge AS ","helsenord.no@capgemini.com"]
[{"$f":"Database!$B321&Database!$C321&Database!$D321","v":"Nord RHFJ: Tverrfaglige team5"},"Nord RHF","J: Tverrfaglige team",5,"Deloitte AS ","noanbud@DELOITTE.no"]
[{"$f":"Database!$B322&Database!$C322&Database!$D322","v":"Nord RHFJ: Tverrfaglige team6"},"Nord RHF","J: Tverrfaglige team",6,"Ernst & Young AS ","offentlige.anskaffelser@no.ey.com"]
[{"$f":"Database!$B323&Database!$C323&Database!$D323","v":"Nord RHFJ: Tverrfaglige team7"},"Nord RHF","J: Tverrfaglige team",7,"Netcompany AS ","anbud.no@netcompany.com "]
[{"$f":"Database!$B324&Database!$C324&Database!$D324","v":"Nord RHFJ: Tverrfaglige team8"},"Nord RHF","J: Tverrfaglige team",8,"PricewaterhouseCoopers AS ","no_resepsjon.oslo@pwc.com"]
[{"$f":"Database!$B325&Database!$C325&Database!$D325","v":"Nord RHFJ: Tverrfaglige team9"},"Nord RHF","J: Tverrfaglige team",9,"Solea AS (tidl Rainfall AS )","avrop@solea.no"]
[{"$f":"Database!$B326&Database!$C326&Database!$D326","v":"Nord RHFJ: Tverrfaglige team10"},"Nord RHF","J: Tverrfaglige team",10,"Sopra Steria AS ","helse@soprasteria.com"]
[{"$f":"Database!$B327&Database!$C327&Database!$D327","v":"Nord RHFJ: Tverrfaglige team11"},"Nord RHF","J: Tverrfaglige team",11,null,""]
[{"$f":"Database!$B328&Database!$C328&Database!$D328","v":"Nord RHFJ: Tverrfaglige team12"},"Nord RHF","J: Tverrfaglige team",12,null,""]
[{"$f":"Database!$B329&Database!$C329&Database!$D329","v":"Nord RHFJ: Tverrfaglige team13"},"Nord RHF","J: Tverrfaglige team",13,null,""]
[{"$f":"Database!$B330&Database!$C330&Database!$D330","v":"Nord RHFJ: Tverrfaglige team14"},"Nord RHF","J: Tverrfaglige team",14,null,""]
[{"$f":"Database!$B331&Database!$C331&Database!$D331","v":"Nord RHFJ: Tverrfaglige team15"},"Nord RHF","J: Tverrfaglige team",15,null,""]
[{"$f":"Database!$B332&Database!$C332&Database!$D332","v":"Nord RHFJ: Tverrfaglige team16"},"Nord RHF","J: Tverrfaglige team",16,null,""]
[{"$f":"Database!$B333&Database!$C333&Database!$D333","v":"Nord RHFJ: Tverrfaglige team17"},"Nord RHF","J: Tverrfaglige team",17,null,""]
[{"$f":"Database!$B334&Database!$C334&Database!$D334","v":"Nord RHFJ: Tverrfaglige team18"},"Nord RHF","J: Tverrfaglige team",18,null,""]
[{"$f":"Database!$B335&Database!$C335&Database!$D335","v":"Nord RHFJ: Tverrfaglige team19"},"Nord RHF","J: Tverrfaglige team",19,null,""]
[{"$f":"Database!$B336&Database!$C336&Database!$D336","v":"Nord RHFJ: Tverrfaglige team20"},"Nord RHF","J: Tverrfaglige team",20,null,""]
[{"$f":"Database!$B337&Database!$C337&Database!$D337","v":"Nord RHFJ: Tverrfaglige team21"},"Nord RHF","J: Tverrfaglige team",21,null,""]
[{"$f":"Database!$B338&Database!$C338&Database!$D338","v":"Nord RHFJ: Tverrfaglige team22"},"Nord RHF","J: Tverrfaglige team",22,null,""]
[{"$f":"Database!$B339&Database!$C339&Database!$D339","v":"Nord RHFJ: Tverrfaglige team23"},"Nord RHF","J: Tverrfaglige team",23,null,""]
[{"$f":"Database!$B340&Database!$C340&Database!$D340","v":"Nord RHFJ: Tverrfaglige team24"},"Nord RHF","J: Tverrfaglige team",24,null,""]
[{"$f":"Database!$B341&Database!$C341&Database!$D341","v":"Nord RHFJ: Tverrfaglige team25"},"Nord RHF","J: Tverrfaglige team",25,null,""]
[{"$f":"Database!$B342&Database!$C342&Database!$D342","v":"Nord RHFJ: Tverrfaglige team26"},"Nord RHF","J: Tverrfaglige team",26,null,""]
[{"$f":"Database!$B343&Database!$C343&Database!$D343","v":"Nord RHFJ: Tverrfaglige team27"},"Nord RHF","J: Tverrfaglige team",27,null,""]
[{"$f":"Database!$B344&Database!$C344&Database!$D344","v":"Nord RHFJ: Tverrfaglige team28"},"Nord RHF","J: Tverrfaglige team",28,null,""]
[{"$f":"Database!$B345&Database!$C345&Database!$D345","v":"Nord RHFJ: Tverrfaglige team29"},"Nord RHF","J: Tverrfaglige team",29,null,""]
[{"$f":"Database!$B346&Database!$C346&Database!$D346","v":"Nord RHFJ: Tverrfaglige team30"},"Nord RHF","J: Tverrfaglige team",30,null,""]
[{"$f":"Database!$B347&Database!$C347&Database!$D347","v":"Nord RHFJ: Tverrfaglige team31"},"Nord RHF","J: Tverrfaglige team",31,null,""]
[{"$f":"Database!$B348&Database!$C348&Database!$D348","v":"Nord RHFJ: Tverrfaglige team32"},"Nord RHF","J: Tverrfaglige team",32,null,""]
[{"$f":"Database!$B349&Database!$C349&Database!$D349","v":"Nord RHFJ: Tverrfaglige team33"},"Nord RHF","J: Tverrfaglige team",33,null,""]
[{"$f":"Database!$B350&Database!$C350&Database!$D350","v":"Nord RHFJ: Tverrfaglige team34"},"Nord RHF","J: Tverrfaglige team",34,null,""]
[{"$f":"Database!$B351&Database!$C351&Database!$D351","v":""},null,null,null,null,""]
[{"$f":"Database!$B352&Database!$C352&Database!$D352","v":"Midt-Norge RHFA: Program og Prosjektgjennomføring1"},"Midt-Norge RHF","A: Program og Prosjektgjennomføring",1,"A-2 Norge AS","utlysninger@a-2.no"]
[{"$f":"Database!$B353&Database!$C353&Database!$D353","v":"Midt-Norge RHFA: Program og Prosjektgjennomføring2"},"Midt-Norge RHF","A: Program og Prosjektgjennomføring",2,"Systra Norge AS ","firmapost@systra.com"]
[{"$f":"Database!$B354&Database!$C354&Database!$D354","v":"Midt-Norge RHFA: Program og Prosjektgjennomføring3"},"Midt-Norge RHF","A: Program og Prosjektgjennomføring",3,"Bouvet Norge AS ","Sykehusinnkjop2023@bouvet.no"]
[{"$f":"Database!$B355&Database!$C355&Database!$D355","v":"Midt-Norge RHFA: Program og Prosjektgjennomføring4"},"Midt-Norge RHF","A: Program og Prosjektgjennomføring",4,"Capgemini Norge AS ","helsenord.no@capgemini.com"]
[{"$f":"Database!$B356&Database!$C356&Database!$D356","v":"Midt-Norge RHFA: Program og Prosjektgjennomføring5"},"Midt-Norge RHF","A: Program og Prosjektgjennomføring",5,"Deloitte AS ","noanbud@DELOITTE.no"]
[{"$f":"Database!$B357&Database!$C357&Database!$D357","v":"Midt-Norge RHFA: Program og Prosjektgjennomføring6"},"Midt-Norge RHF","A: Program og Prosjektgjennomføring",6,"Emagine AS ","sykehusinnkjop@emagine.no"]
[{"$f":"Database!$B358&Database!$C358&Database!$D358","v":"Midt-Norge RHFA: Program og Prosjektgjennomføring7"},"Midt-Norge RHF","A: Program og Prosjektgjennomføring",7,"Ernst & Young AS ","offentlige.anskaffelser@no.ey.com"]
[{"$f":"Database!$B359&Database!$C359&Database!$D359","v":"Midt-Norge RHFA: Program og Prosjektgjennomføring8"},"Midt-Norge RHF","A: Program og Prosjektgjennomføring",8,"Ework Group Norway AS ","sykehusinnkjop@eworkgroup.com  "]
[{"$f":"Database!$B360&Database!$C360&Database!$D360","v":"Midt-Norge RHFA: Program og Prosjektgjennomføring9"},"Midt-Norge RHF","A: Program og Prosjektgjennomføring",9,"Experis AS ","sykehusinnkjop@no.experis.com"]
[{"$f":"Database!$B361&Database!$C361&Database!$D361","v":"Midt-Norge RHFA: Program og Prosjektgjennomføring10"},"Midt-Norge RHF","A: Program og Prosjektgjennomføring",10,"KPMG AS ","helse@kpmg.no"]
[{"$f":"Database!$B362&Database!$C362&Database!$D362","v":"Midt-Norge RHFA: Program og Prosjektgjennomføring11"},"Midt-Norge RHF","A: Program og Prosjektgjennomføring",11,"Metier AS ","firmapost@metier.no"]
[{"$f":"Database!$B363&Database!$C363&Database!$D363","v":"Midt-Norge RHFA: Program og Prosjektgjennomføring12"},"Midt-Norge RHF","A: Program og Prosjektgjennomføring",12,"Netcompany AS ","anbud.no@netcompany.com "]
[{"$f":"Database!$B364&Database!$C364&Database!$D364","v":"Midt-Norge RHFA: Program og Prosjektgjennomføring13"},"Midt-Norge RHF","A: Program og Prosjektgjennomføring",13,"PricewaterhouseCoopers AS ","no_resepsjon.oslo@pwc.com"]
[{"$f":"Database!$B365&Database!$C365&Database!$D365","v":"Midt-Norge RHFA: Program og Prosjektgjennomføring14"},"Midt-Norge RHF","A: Program og Prosjektgjennomføring",14,"Sopra Steria AS ","helse@soprasteria.com"]
[{"$f":"Database!$B366&Database!$C366&Database!$D366","v":"Midt-Norge RHFA: Program og Prosjektgjennomføring15"},"Midt-Norge RHF","A: Program og Prosjektgjennomføring",15,"The Boston Consulting Group Nordic AB ","anbud@bcg.com"]
[{"$f":"Database!$B367&Database!$C367&Database!$D367","v":"Midt-Norge RHFA: Program og Prosjektgjennomføring16"},"Midt-Norge RHF","A: Program og Prosjektgjennomføring",16,null,""]
[{"$f":"Database!$B368&Database!$C368&Database!$D368","v":"Midt-Norge RHFA: Program og Prosjektgjennomføring17"},"Midt-Norge RHF","A: Program og Prosjektgjennomføring",17,null,""]
[{"$f":"Database!$B369&Database!$C369&Database!$D369","v":"Midt-Norge RHFA: Program og Prosjektgjennomføring18"},"Midt-Norge RHF","A: Program og Prosjektgjennomføring",18,null,""]
[{"$f":"Database!$B370&Database!$C370&Database!$D370","v":"Midt-Norge RHFA: Program og Prosjektgjennomføring19"},"Midt-Norge RHF","A: Program og Prosjektgjennomføring",19,null,""]
[{"$f":"Database!$B371&Database!$C371&Database!$D371","v":"Midt-Norge RHFA: Program og Prosjektgjennomføring20"},"Midt-Norge RHF","A: Program og Prosjektgjennomføring",20,null,""]
[{"$f":"Database!$B372&Database!$C372&Database!$D372","v":"Midt-Norge RHFA: Program og Prosjektgjennomføring21"},"Midt-Norge RHF","A: Program og Prosjektgjennomføring",21,null,""]
[{"$f":"Database!$B373&Database!$C373&Database!$D373","v":"Midt-Norge RHFA: Program og Prosjektgjennomføring22"},"Midt-Norge RHF","A: Program og Prosjektgjennomføring",22,null,""]
[{"$f":"Database!$B374&Database!$C374&Database!$D374","v":"Midt-Norge RHFA: Program og Prosjektgjennomføring23"},"Midt-Norge RHF","A: Program og Prosjektgjennomføring",23,null,""]
[{"$f":"Database!$B375&Database!$C375&Database!$D375","v":"Midt-Norge RHFA: Program og Prosjektgjennomføring24"},"Midt-Norge RHF","A: Program og Prosjektgjennomføring",24,null,""]
[{"$f":"Database!$B376&Database!$C376&Database!$D376","v":"Midt-Norge RHFA: Program og Prosjektgjennomføring25"},"Midt-Norge RHF","A: Program og Prosjektgjennomføring",25,null,""]
[{"$f":"Database!$B377&Database!$C377&Database!$D377","v":"Midt-Norge RHFA: Program og Prosjektgjennomføring26"},"Midt-Norge RHF","A: Program og Prosjektgjennomføring",26,null,""]
[{"$f":"Database!$B378&Database!$C378&Database!$D378","v":"Midt-Norge RHFA: Program og Prosjektgjennomføring27"},"Midt-Norge RHF","A: Program og Prosjektgjennomføring",27,null,""]
[{"$f":"Database!$B379&Database!$C379&Database!$D379","v":"Midt-Norge RHFA: Program og Prosjektgjennomføring28"},"Midt-Norge RHF","A: Program og Prosjektgjennomføring",28,null,""]
[{"$f":"Database!$B380&Database!$C380&Database!$D380","v":"Midt-Norge RHFA: Program og Prosjektgjennomføring29"},"Midt-Norge RHF","A: Program og Prosjektgjennomføring",29,null,""]
[{"$f":"Database!$B381&Database!$C381&Database!$D381","v":"Midt-Norge RHFA: Program og Prosjektgjennomføring30"},"Midt-Norge RHF","A: Program og Prosjektgjennomføring",30,null,""]
[{"$f":"Database!$B382&Database!$C382&Database!$D382","v":"Midt-Norge RHFA: Program og Prosjektgjennomføring31"},"Midt-Norge RHF","A: Program og Prosjektgjennomføring",31,null,""]
[{"$f":"Database!$B383&Database!$C383&Database!$D383","v":"Midt-Norge RHFA: Program og Prosjektgjennomføring32"},"Midt-Norge RHF","A: Program og Prosjektgjennomføring",32,null,""]
[{"$f":"Database!$B384&Database!$C384&Database!$D384","v":"Midt-Norge RHFA: Program og Prosjektgjennomføring33"},"Midt-Norge RHF","A: Program og Prosjektgjennomføring",33,null,""]
[{"$f":"Database!$B385&Database!$C385&Database!$D385","v":"Midt-Norge RHFA: Program og Prosjektgjennomføring34"},"Midt-Norge RHF","A: Program og Prosjektgjennomføring",34,null,""]
[{"$f":"Database!$B386&Database!$C386&Database!$D386","v":""},null,null,null,null,""]
[{"$f":"Database!$B387&Database!$C387&Database!$D387","v":"Midt-Norge RHFB: Strategiplanlegging, rådgivning og innovasjon1"},"Midt-Norge RHF","B: Strategiplanlegging, rådgivning og innovasjon",1,"A-2 Norge AS","utlysninger@a-2.no"]
[{"$f":"Database!$B388&Database!$C388&Database!$D388","v":"Midt-Norge RHFB: Strategiplanlegging, rådgivning og innovasjon2"},"Midt-Norge RHF","B: Strategiplanlegging, rådgivning og innovasjon",2,"Accenture AS ","rammeavtale.helse@accenture.com"]
[{"$f":"Database!$B389&Database!$C389&Database!$D389","v":"Midt-Norge RHFB: Strategiplanlegging, rådgivning og innovasjon3"},"Midt-Norge RHF","B: Strategiplanlegging, rådgivning og innovasjon",3,"Systra Norge AS ","firmapost@systra.com"]
[{"$f":"Database!$B390&Database!$C390&Database!$D390","v":"Midt-Norge RHFB: Strategiplanlegging, rådgivning og innovasjon4"},"Midt-Norge RHF","B: Strategiplanlegging, rådgivning og innovasjon",4,"Bouvet Norge AS ","Sykehusinnkjop2023@bouvet.no"]
[{"$f":"Database!$B391&Database!$C391&Database!$D391","v":"Midt-Norge RHFB: Strategiplanlegging, rådgivning og innovasjon5"},"Midt-Norge RHF","B: Strategiplanlegging, rådgivning og innovasjon",5,"Capgemini Norge AS ","helsenord.no@capgemini.com"]
[{"$f":"Database!$B392&Database!$C392&Database!$D392","v":"Midt-Norge RHFB: Strategiplanlegging, rådgivning og innovasjon6"},"Midt-Norge RHF","B: Strategiplanlegging, rådgivning og innovasjon",6,"Deloitte AS ","noanbud@DELOITTE.no"]
[{"$f":"Database!$B393&Database!$C393&Database!$D393","v":"Midt-Norge RHFB: Strategiplanlegging, rådgivning og innovasjon7"},"Midt-Norge RHF","B: Strategiplanlegging, rådgivning og innovasjon",7,"Emagine AS ","sykehusinnkjop@emagine.no"]
[{"$f":"Database!$B394&Database!$C394&Database!$D394","v":"Midt-Norge RHFB: Strategiplanlegging, rådgivning og innovasjon8"},"Midt-Norge RHF","B: Strategiplanlegging, rådgivning og innovasjon",8,"Ernst & Young AS ","offentlige.anskaffelser@no.ey.com"]
[{"$f":"Database!$B395&Database!$C395&Database!$D395","v":"Midt-Norge RHFB: Strategiplanlegging, rådgivning og innovasjon9"},"Midt-Norge RHF","B: Strategiplanlegging, rådgivning og innovasjon",9,"Ework Group Norway AS ","sykehusinnkjop@eworkgroup.com  "]
[{"$f":"Database!$B396&Database!$C396&Database!$D396","v":"Midt-Norge RHFB: Strategiplanlegging, rådgivning og innovasjon10"},"Midt-Norge RHF","B: Strategiplanlegging, rådgivning og innovasjon",10,"Experis AS ","sykehusinnkjop@no.experis.com"]
[{"$f":"Database!$B397&Database!$C397&Database!$D397","v":"Midt-Norge RHFB: Strategiplanlegging, rådgivning og innovasjon11"},"Midt-Norge RHF","B: Strategiplanlegging, rådgivning og innovasjon",11,"KPMG AS ","helse@kpmg.no"]
[{"$f":"Database!$B398&Database!$C398&Database!$D398","v":"Midt-Norge RHFB: Strategiplanlegging, rådgivning og innovasjon12"},"Midt-Norge RHF","B: Strategiplanlegging, rådgivning og innovasjon",12,"Metier AS ","firmapost@metier.no"]
[{"$f":"Database!$B399&Database!$C399&Database!$D399","v":"Midt-Norge RHFB: Strategiplanlegging, rådgivning og innovasjon13"},"Midt-Norge RHF","B: Strategiplanlegging, rådgivning og innovasjon",13,"PricewaterhouseCoopers AS ","no_resepsjon.oslo@pwc.com"]
[{"$f":"Database!$B400&Database!$C400&Database!$D400","v":"Midt-Norge RHFB: Strategiplanlegging, rådgivning og innovasjon14"},"Midt-Norge RHF","B: Strategiplanlegging, rådgivning og innovasjon",14,"Sopra Steria AS ","helse@soprasteria.com"]
[{"$f":"Database!$B401&Database!$C401&Database!$D401","v":"Midt-Norge RHFB: Strategiplanlegging, rådgivning og innovasjon15"},"Midt-Norge RHF","B: Strategiplanlegging, rådgivning og innovasjon",15,"The Boston Consulting Group Nordic AB ","anbud@bcg.com"]
[{"$f":"Database!$B402&Database!$C402&Database!$D402","v":"Midt-Norge RHFB: Strategiplanlegging, rådgivning og innovasjon16"},"Midt-Norge RHF","B: Strategiplanlegging, rådgivning og innovasjon",16,"Advisense AS","offentlig@transcendentgroup.com "]
[{"$f":"Database!$B403&Database!$C403&Database!$D403","v":"Midt-Norge RHFB: Strategiplanlegging, rådgivning og innovasjon17"},"Midt-Norge RHF","B: Strategiplanlegging, rådgivning og innovasjon",17,null,""]
[{"$f":"Database!$B404&Database!$C404&Database!$D404","v":"Midt-Norge RHFB: Strategiplanlegging, rådgivning og innovasjon18"},"Midt-Norge RHF","B: Strategiplanlegging, rådgivning og innovasjon",18,null,""]
[{"$f":"Database!$B405&Database!$C405&Database!$D405","v":"Midt-Norge RHFB: Strategiplanlegging, rådgivning og innovasjon19"},"Midt-Norge RHF","B: Strategiplanlegging, rådgivning og innovasjon",19,null,""]
[{"$f":"Database!$B406&Database!$C406&Database!$D406","v":"Midt-Norge RHFB: Strategiplanlegging, rådgivning og innovasjon20"},"Midt-Norge RHF","B: Strategiplanlegging, rådgivning og innovasjon",20,null,""]
[{"$f":"Database!$B407&Database!$C407&Database!$D407","v":"Midt-Norge RHFB: Strategiplanlegging, rådgivning og innovasjon21"},"Midt-Norge RHF","B: Strategiplanlegging, rådgivning og innovasjon",21,null,""]
[{"$f":"Database!$B408&Database!$C408&Database!$D408","v":"Midt-Norge RHFB: Strategiplanlegging, rådgivning og innovasjon22"},"Midt-Norge RHF","B: Strategiplanlegging, rådgivning og innovasjon",22,null,""]
[{"$f":"Database!$B409&Database!$C409&Database!$D409","v":"Midt-Norge RHFB: Strategiplanlegging, rådgivning og innovasjon23"},"Midt-Norge RHF","B: Strategiplanlegging, rådgivning og innovasjon",23,null,""]
[{"$f":"Database!$B410&Database!$C410&Database!$D410","v":"Midt-Norge RHFB: Strategiplanlegging, rådgivning og innovasjon24"},"Midt-Norge RHF","B: Strategiplanlegging, rådgivning og innovasjon",24,null,""]
[{"$f":"Database!$B411&Database!$C411&Database!$D411","v":"Midt-Norge RHFB: Strategiplanlegging, rådgivning og innovasjon25"},"Midt-Norge RHF","B: Strategiplanlegging, rådgivning og innovasjon",25,null,""]
[{"$f":"Database!$B412&Database!$C412&Database!$D412","v":"Midt-Norge RHFB: Strategiplanlegging, rådgivning og innovasjon26"},"Midt-Norge RHF","B: Strategiplanlegging, rådgivning og innovasjon",26,null,""]
[{"$f":"Database!$B413&Database!$C413&Database!$D413","v":"Midt-Norge RHFB: Strategiplanlegging, rådgivning og innovasjon27"},"Midt-Norge RHF","B: Strategiplanlegging, rådgivning og innovasjon",27,null,""]
[{"$f":"Database!$B414&Database!$C414&Database!$D414","v":"Midt-Norge RHFB: Strategiplanlegging, rådgivning og innovasjon28"},"Midt-Norge RHF","B: Strategiplanlegging, rådgivning og innovasjon",28,null,""]
[{"$f":"Database!$B415&Database!$C415&Database!$D415","v":"Midt-Norge RHFB: Strategiplanlegging, rådgivning og innovasjon29"},"Midt-Norge RHF","B: Strategiplanlegging, rådgivning og innovasjon",29,null,""]
[{"$f":"Database!$B416&Database!$C416&Database!$D416","v":"Midt-Norge RHFB: Strategiplanlegging, rådgivning og innovasjon30"},"Midt-Norge RHF","B: Strategiplanlegging, rådgivning og innovasjon",30,null,""]
[{"$f":"Database!$B417&Database!$C417&Database!$D417","v":"Midt-Norge RHFB: Strategiplanlegging, rådgivning og innovasjon31"},"Midt-Norge RHF","B: Strategiplanlegging, rådgivning og innovasjon",31,null,""]
[{"$f":"Database!$B418&Database!$C418&Database!$D418","v":"Midt-Norge RHFB: Strategiplanlegging, rådgivning og innovasjon32"},"Midt-Norge RHF","B: Strategiplanlegging, rådgivning og innovasjon",32,null,""]
[{"$f":"Database!$B419&Database!$C419&Database!$D419","v":"Midt-Norge RHFB: Strategiplanlegging, rådgivning og innovasjon33"},"Midt-Norge RHF","B: Strategiplanlegging, rådgivning og innovasjon",33,null,""]
[{"$f":"Database!$B420&Database!$C420&Database!$D420","v":"Midt-Norge RHFB: Strategiplanlegging, rådgivning og innovasjon34"},"Midt-Norge RHF","B: Strategiplanlegging, rådgivning og innovasjon",34,null,""]
[{"$f":"Database!$B421&Database!$C421&Database!$D421","v":""},null,null,null,null,""]
[{"$f":"Database!$B422&Database!$C422&Database!$D422","v":"Midt-Norge RHFC: Arkitektur1"},"Midt-Norge RHF","C: Arkitektur",1,"A-2 Norge AS","utlysninger@a-2.no"]
[{"$f":"Database!$B423&Database!$C423&Database!$D423","v":"Midt-Norge RHFC: Arkitektur2"},"Midt-Norge RHF","C: Arkitektur",2,"Accenture AS ","rammeavtale.helse@accenture.com"]
[{"$f":"Database!$B424&Database!$C424&Database!$D424","v":"Midt-Norge RHFC: Arkitektur3"},"Midt-Norge RHF","C: Arkitektur",3,"Systra Norge AS ","firmapost@systra.com"]
[{"$f":"Database!$B425&Database!$C425&Database!$D425","v":"Midt-Norge RHFC: Arkitektur4"},"Midt-Norge RHF","C: Arkitektur",4,"Bouvet Norge AS ","Sykehusinnkjop2023@bouvet.no"]
[{"$f":"Database!$B426&Database!$C426&Database!$D426","v":"Midt-Norge RHFC: Arkitektur5"},"Midt-Norge RHF","C: Arkitektur",5,"Capgemini Norge AS ","helsenord.no@capgemini.com"]
[{"$f":"Database!$B427&Database!$C427&Database!$D427","v":"Midt-Norge RHFC: Arkitektur6"},"Midt-Norge RHF","C: Arkitektur",6,"Deloitte AS ","noanbud@DELOITTE.no"]
[{"$f":"Database!$B428&Database!$C428&Database!$D428","v":"Midt-Norge RHFC: Arkitektur7"},"Midt-Norge RHF","C: Arkitektur",7,"Emagine AS ","sykehusinnkjop@emagine.no"]
[{"$f":"Database!$B429&Database!$C429&Database!$D429","v":"Midt-Norge RHFC: Arkitektur8"},"Midt-Norge RHF","C: Arkitektur",8,"Ernst & Young AS ","offentlige.anskaffelser@no.ey.com"]
[{"$f":"Database!$B430&Database!$C430&Database!$D430","v":"Midt-Norge RHFC: Arkitektur9"},"Midt-Norge RHF","C: Arkitektur",9,"Ework Group Norway AS ","sykehusinnkjop@eworkgroup.com  "]
[{"$f":"Database!$B431&Database!$C431&Database!$D431","v":"Midt-Norge RHFC: Arkitektur10"},"Midt-Norge RHF","C: Arkitektur",10,"Experis AS ","sykehusinnkjop@no.experis.com"]
[{"$f":"Database!$B432&Database!$C432&Database!$D432","v":"Midt-Norge RHFC: Arkitektur11"},"Midt-Norge RHF","C: Arkitektur",11,"IT Consult AS ","firmapost@itc.no"]
[{"$f":"Database!$B433&Database!$C433&Database!$D433","v":"Midt-Norge RHFC: Arkitektur12"},"Midt-Norge RHF","C: Arkitektur",12,"KPMG AS ","helse@kpmg.no"]
[{"$f":"Database!$B434&Database!$C434&Database!$D434","v":"Midt-Norge RHFC: Arkitektur13"},"Midt-Norge RHF","C: Arkitektur",13,"Netcompany AS ","anbud.no@netcompany.com "]
[{"$f":"Database!$B435&Database!$C435&Database!$D435","v":"Midt-Norge RHFC: Arkitektur14"},"Midt-Norge RHF","C: Arkitektur",14,"PricewaterhouseCoopers AS ","no_resepsjon.oslo@pwc.com"]
[{"$f":"Database!$B436&Database!$C436&Database!$D436","v":"Midt-Norge RHFC: Arkitektur15"},"Midt-Norge RHF","C: Arkitektur",15,"Sopra Steria AS ","helse@soprasteria.com"]
[{"$f":"Database!$B437&Database!$C437&Database!$D437","v":"Midt-Norge RHFC: Arkitektur16"},"Midt-Norge RHF","C: Arkitektur",16,"The Boston Consulting Group Nordic AB ","anbud@bcg.com"]
[{"$f":"Database!$B438&Database!$C438&Database!$D438","v":"Midt-Norge RHFC: Arkitektur17"},"Midt-Norge RHF","C: Arkitektur",17,null,""]
[{"$f":"Database!$B439&Database!$C439&Database!$D439","v":"Midt-Norge RHFC: Arkitektur18"},"Midt-Norge RHF","C: Arkitektur",18,null,""]
[{"$f":"Database!$B440&Database!$C440&Database!$D440","v":"Midt-Norge RHFC: Arkitektur19"},"Midt-Norge RHF","C: Arkitektur",19,null,""]
[{"$f":"Database!$B441&Database!$C441&Database!$D441","v":"Midt-Norge RHFC: Arkitektur20"},"Midt-Norge RHF","C: Arkitektur",20,null,""]
[{"$f":"Database!$B442&Database!$C442&Database!$D442","v":"Midt-Norge RHFC: Arkitektur21"},"Midt-Norge RHF","C: Arkitektur",21,null,""]
[{"$f":"Database!$B443&Database!$C443&Database!$D443","v":"Midt-Norge RHFC: Arkitektur22"},"Midt-Norge RHF","C: Arkitektur",22,null,""]
[{"$f":"Database!$B444&Database!$C444&Database!$D444","v":"Midt-Norge RHFC: Arkitektur23"},"Midt-Norge RHF","C: Arkitektur",23,null,""]
[{"$f":"Database!$B445&Database!$C445&Database!$D445","v":"Midt-Norge RHFC: Arkitektur24"},"Midt-Norge RHF","C: Arkitektur",24,null,""]
[{"$f":"Database!$B446&Database!$C446&Database!$D446","v":"Midt-Norge RHFC: Arkitektur25"},"Midt-Norge RHF","C: Arkitektur",25,null,""]
[{"$f":"Database!$B447&Database!$C447&Database!$D447","v":"Midt-Norge RHFC: Arkitektur26"},"Midt-Norge RHF","C: Arkitektur",26,null,""]
[{"$f":"Database!$B448&Database!$C448&Database!$D448","v":"Midt-Norge RHFC: Arkitektur27"},"Midt-Norge RHF","C: Arkitektur",27,null,""]
[{"$f":"Database!$B449&Database!$C449&Database!$D449","v":"Midt-Norge RHFC: Arkitektur28"},"Midt-Norge RHF","C: Arkitektur",28,null,""]
[{"$f":"Database!$B450&Database!$C450&Database!$D450","v":"Midt-Norge RHFC: Arkitektur29"},"Midt-Norge RHF","C: Arkitektur",29,null,""]
[{"$f":"Database!$B451&Database!$C451&Database!$D451","v":"Midt-Norge RHFC: Arkitektur30"},"Midt-Norge RHF","C: Arkitektur",30,null,""]
[{"$f":"Database!$B452&Database!$C452&Database!$D452","v":"Midt-Norge RHFC: Arkitektur31"},"Midt-Norge RHF","C: Arkitektur",31,null,""]
[{"$f":"Database!$B453&Database!$C453&Database!$D453","v":"Midt-Norge RHFC: Arkitektur32"},"Midt-Norge RHF","C: Arkitektur",32,null,""]
[{"$f":"Database!$B454&Database!$C454&Database!$D454","v":"Midt-Norge RHFC: Arkitektur33"},"Midt-Norge RHF","C: Arkitektur",33,null,""]
[{"$f":"Database!$B455&Database!$C455&Database!$D455","v":"Midt-Norge RHFC: Arkitektur34"},"Midt-Norge RHF","C: Arkitektur",34,null,""]
[{"$f":"Database!$B456&Database!$C456&Database!$D456","v":""},null,null,null,null,""]
[{"$f":"Database!$B457&Database!$C457&Database!$D457","v":"Midt-Norge RHFD: Informasjonssikkerhet og ROS-analyser1"},"Midt-Norge RHF","D: Informasjonssikkerhet og ROS-analyser",1,"A-2 Norge AS","utlysninger@a-2.no"]
[{"$f":"Database!$B458&Database!$C458&Database!$D458","v":"Midt-Norge RHFD: Informasjonssikkerhet og ROS-analyser2"},"Midt-Norge RHF","D: Informasjonssikkerhet og ROS-analyser",2,"Accenture AS ","rammeavtale.helse@accenture.com"]
[{"$f":"Database!$B459&Database!$C459&Database!$D459","v":"Midt-Norge RHFD: Informasjonssikkerhet og ROS-analyser3"},"Midt-Norge RHF","D: Informasjonssikkerhet og ROS-analyser",3,"Systra Norge AS ","firmapost@systra.com"]
[{"$f":"Database!$B460&Database!$C460&Database!$D460","v":"Midt-Norge RHFD: Informasjonssikkerhet og ROS-analyser4"},"Midt-Norge RHF","D: Informasjonssikkerhet og ROS-analyser",4,"Bouvet Norge AS ","Sykehusinnkjop2023@bouvet.no"]
[{"$f":"Database!$B461&Database!$C461&Database!$D461","v":"Midt-Norge RHFD: Informasjonssikkerhet og ROS-analyser5"},"Midt-Norge RHF","D: Informasjonssikkerhet og ROS-analyser",5,"Capgemini Norge AS ","helsenord.no@capgemini.com"]
[{"$f":"Database!$B462&Database!$C462&Database!$D462","v":"Midt-Norge RHFD: Informasjonssikkerhet og ROS-analyser6"},"Midt-Norge RHF","D: Informasjonssikkerhet og ROS-analyser",6,"Deloitte AS ","noanbud@DELOITTE.no"]
[{"$f":"Database!$B463&Database!$C463&Database!$D463","v":"Midt-Norge RHFD: Informasjonssikkerhet og ROS-analyser7"},"Midt-Norge RHF","D: Informasjonssikkerhet og ROS-analyser",7,"Emagine AS ","sykehusinnkjop@emagine.no"]
[{"$f":"Database!$B464&Database!$C464&Database!$D464","v":"Midt-Norge RHFD: Informasjonssikkerhet og ROS-analyser8"},"Midt-Norge RHF","D: Informasjonssikkerhet og ROS-analyser",8,"Ernst & Young AS ","offentlige.anskaffelser@no.ey.com"]
[{"$f":"Database!$B465&Database!$C465&Database!$D465","v":"Midt-Norge RHFD: Informasjonssikkerhet og ROS-analyser9"},"Midt-Norge RHF","D: Informasjonssikkerhet og ROS-analyser",9,"Ework Group Norway AS ","sykehusinnkjop@eworkgroup.com  "]
[{"$f":"Database!$B466&Database!$C466&Database!$D466","v":"Midt-Norge RHFD: Informasjonssikkerhet og ROS-analyser10"},"Midt-Norge RHF","D: Informasjonssikkerhet og ROS-analyser",10,"Experis AS ","sykehusinnkjop@no.experis.com"]
[{"$f":"Database!$B467&Database!$C467&Database!$D467","v":"Midt-Norge RHFD: Informasjonssikkerhet og ROS-analyser11"},"Midt-Norge RHF","D: Informasjonssikkerhet og ROS-analyser",11,"IT Consult AS ","firmapost@itc.no"]
[{"$f":"Database!$B468&Database!$C468&Database!$D468","v":"Midt-Norge RHFD: Informasjonssikkerhet og ROS-analyser12"},"Midt-Norge RHF","D: Informasjonssikkerhet og ROS-analyser",12,"KPMG AS ","helse@kpmg.no"]
[{"$f":"Database!$B469&Database!$C469&Database!$D469","v":"Midt-Norge RHFD: Informasjonssikkerhet og ROS-analyser13"},"Midt-Norge RHF","D: Informasjonssikkerhet og ROS-analyser",13,"PricewaterhouseCoopers AS ","no_resepsjon.oslo@pwc.com"]
[{"$f":"Database!$B470&Database!$C470&Database!$D470","v":"Midt-Norge RHFD: Informasjonssikkerhet og ROS-analyser14"},"Midt-Norge RHF","D: Informasjonssikkerhet og ROS-analyser",14,"Sopra Steria AS ","helse@soprasteria.com"]
[{"$f":"Database!$B471&Database!$C471&Database!$D471","v":"Midt-Norge RHFD: Informasjonssikkerhet og ROS-analyser15"},"Midt-Norge RHF","D: Informasjonssikkerhet og ROS-analyser",15,"Advisense AS","offentlig@transcendentgroup.com "]
[{"$f":"Database!$B472&Database!$C472&Database!$D472","v":"Midt-Norge RHFD: Informasjonssikkerhet og ROS-analyser16"},"Midt-Norge RHF","D: Informasjonssikkerhet og ROS-analyser",16,null,""]
[{"$f":"Database!$B473&Database!$C473&Database!$D473","v":"Midt-Norge RHFD: Informasjonssikkerhet og ROS-analyser17"},"Midt-Norge RHF","D: Informasjonssikkerhet og ROS-analyser",17,null,""]
[{"$f":"Database!$B474&Database!$C474&Database!$D474","v":"Midt-Norge RHFD: Informasjonssikkerhet og ROS-analyser18"},"Midt-Norge RHF","D: Informasjonssikkerhet og ROS-analyser",18,null,""]
[{"$f":"Database!$B475&Database!$C475&Database!$D475","v":"Midt-Norge RHFD: Informasjonssikkerhet og ROS-analyser19"},"Midt-Norge RHF","D: Informasjonssikkerhet og ROS-analyser",19,null,""]
[{"$f":"Database!$B476&Database!$C476&Database!$D476","v":"Midt-Norge RHFD: Informasjonssikkerhet og ROS-analyser20"},"Midt-Norge RHF","D: Informasjonssikkerhet og ROS-analyser",20,null,""]
[{"$f":"Database!$B477&Database!$C477&Database!$D477","v":"Midt-Norge RHFD: Informasjonssikkerhet og ROS-analyser21"},"Midt-Norge RHF","D: Informasjonssikkerhet og ROS-analyser",21,null,""]
[{"$f":"Database!$B478&Database!$C478&Database!$D478","v":"Midt-Norge RHFD: Informasjonssikkerhet og ROS-analyser22"},"Midt-Norge RHF","D: Informasjonssikkerhet og ROS-analyser",22,null,""]
[{"$f":"Database!$B479&Database!$C479&Database!$D479","v":"Midt-Norge RHFD: Informasjonssikkerhet og ROS-analyser23"},"Midt-Norge RHF","D: Informasjonssikkerhet og ROS-analyser",23,null,""]
[{"$f":"Database!$B480&Database!$C480&Database!$D480","v":"Midt-Norge RHFD: Informasjonssikkerhet og ROS-analyser24"},"Midt-Norge RHF","D: Informasjonssikkerhet og ROS-analyser",24,null,""]
[{"$f":"Database!$B481&Database!$C481&Database!$D481","v":"Midt-Norge RHFD: Informasjonssikkerhet og ROS-analyser25"},"Midt-Norge RHF","D: Informasjonssikkerhet og ROS-analyser",25,null,""]
[{"$f":"Database!$B482&Database!$C482&Database!$D482","v":"Midt-Norge RHFD: Informasjonssikkerhet og ROS-analyser26"},"Midt-Norge RHF","D: Informasjonssikkerhet og ROS-analyser",26,null,""]
[{"$f":"Database!$B483&Database!$C483&Database!$D483","v":"Midt-Norge RHFD: Informasjonssikkerhet og ROS-analyser27"},"Midt-Norge RHF","D: Informasjonssikkerhet og ROS-analyser",27,null,""]
[{"$f":"Database!$B484&Database!$C484&Database!$D484","v":"Midt-Norge RHFD: Informasjonssikkerhet og ROS-analyser28"},"Midt-Norge RHF","D: Informasjonssikkerhet og ROS-analyser",28,null,""]
[{"$f":"Database!$B485&Database!$C485&Database!$D485","v":"Midt-Norge RHFD: Informasjonssikkerhet og ROS-analyser29"},"Midt-Norge RHF","D: Informasjonssikkerhet og ROS-analyser",29,null,""]
[{"$f":"Database!$B486&Database!$C486&Database!$D486","v":"Midt-Norge RHFD: Informasjonssikkerhet og ROS-analyser30"},"Midt-Norge RHF","D: Informasjonssikkerhet og ROS-analyser",30,null,""]
[{"$f":"Database!$B487&Database!$C487&Database!$D487","v":"Midt-Norge RHFD: Informasjonssikkerhet og ROS-analyser31"},"Midt-Norge RHF","D: Informasjonssikkerhet og ROS-analyser",31,null,""]
[{"$f":"Database!$B488&Database!$C488&Database!$D488","v":"Midt-Norge RHFD: Informasjonssikkerhet og ROS-analyser32"},"Midt-Norge RHF","D: Informasjonssikkerhet og ROS-analyser",32,null,""]
[{"$f":"Database!$B489&Database!$C489&Database!$D489","v":"Midt-Norge RHFD: Informasjonssikkerhet og ROS-analyser33"},"Midt-Norge RHF","D: Informasjonssikkerhet og ROS-analyser",33,null,""]
[{"$f":"Database!$B490&Database!$C490&Database!$D490","v":"Midt-Norge RHFD: Informasjonssikkerhet og ROS-analyser34"},"Midt-Norge RHF","D: Informasjonssikkerhet og ROS-analyser",34,null,""]
[{"$f":"Database!$B491&Database!$C491&Database!$D491","v":""},null,null,null,null,""]
[{"$f":"Database!$B492&Database!$C492&Database!$D492","v":"Midt-Norge RHFE: Test og release1"},"Midt-Norge RHF","E: Test og release",1,"A-2 Norge AS","utlysninger@a-2.no"]
[{"$f":"Database!$B493&Database!$C493&Database!$D493","v":"Midt-Norge RHFE: Test og release2"},"Midt-Norge RHF","E: Test og release",2,"Aboveit AS ","salg@aboveit.no "]
[{"$f":"Database!$B494&Database!$C494&Database!$D494","v":"Midt-Norge RHFE: Test og release3"},"Midt-Norge RHF","E: Test og release",3,"Accenture AS ","rammeavtale.helse@accenture.com"]
[{"$f":"Database!$B495&Database!$C495&Database!$D495","v":"Midt-Norge RHFE: Test og release4"},"Midt-Norge RHF","E: Test og release",4,"Systra Norge AS ","firmapost@systra.com"]
[{"$f":"Database!$B496&Database!$C496&Database!$D496","v":"Midt-Norge RHFE: Test og release5"},"Midt-Norge RHF","E: Test og release",5,"Bouvet Norge AS ","Sykehusinnkjop2023@bouvet.no"]
[{"$f":"Database!$B497&Database!$C497&Database!$D497","v":"Midt-Norge RHFE: Test og release6"},"Midt-Norge RHF","E: Test og release",6,"Capgemini Norge AS ","helsenord.no@capgemini.com"]
[{"$f":"Database!$B498&Database!$C498&Database!$D498","v":"Midt-Norge RHFE: Test og release7"},"Midt-Norge RHF","E: Test og release",7,"Deloitte AS ","noanbud@DELOITTE.no"]
[{"$f":"Database!$B499&Database!$C499&Database!$D499","v":"Midt-Norge RHFE: Test og release8"},"Midt-Norge RHF","E: Test og release",8,"Emagine AS ","sykehusinnkjop@emagine.no"]
[{"$f":"Database!$B500&Database!$C500&Database!$D500","v":"Midt-Norge RHFE: Test og release9"},"Midt-Norge RHF","E: Test og release",9,"Ernst & Young AS ","offentlige.anskaffelser@no.ey.com"]
[{"$f":"Database!$B501&Database!$C501&Database!$D501","v":"Midt-Norge RHFE: Test og release10"},"Midt-Norge RHF","E: Test og release",10,"Ework Group Norway AS ","sykehusinnkjop@eworkgroup.com  "]
[{"$f":"Database!$B502&Database!$C502&Database!$D502","v":"Midt-Norge RHFE: Test og release11"},"Midt-Norge RHF","E: Test og release",11,"Experis AS ","sykehusinnkjop@no.experis.com"]
[{"$f":"Database!$B503&Database!$C503&Database!$D503","v":"Midt-Norge RHFE: Test og release12"},"Midt-Norge RHF","E: Test og release",12,"IT Consult AS ","firmapost@itc.no"]
[{"$f":"Database!$B504&Database!$C504&Database!$D504","v":"Midt-Norge RHFE: Test og release13"},"Midt-Norge RHF","E: Test og release",13,"Netcompany AS ","anbud.no@netcompany.com "]
[{"$f":"Database!$B505&Database!$C505&Database!$D505","v":"Midt-Norge RHFE: Test og release14"},"Midt-Norge RHF","E: Test og release",14,"SOCO Norge AS ","post@soco.no"]
[{"$f":"Database!$B506&Database!$C506&Database!$D506","v":"Midt-Norge RHFE: Test og release15"},"Midt-Norge RHF","E: Test og release",15,"Sopra Steria AS ","helse@soprasteria.com"]
[{"$f":"Database!$B507&Database!$C507&Database!$D507","v":"Midt-Norge RHFE: Test og release16"},"Midt-Norge RHF","E: Test og release",16,null,""]
[{"$f":"Database!$B508&Database!$C508&Database!$D508","v":"Midt-Norge RHFE: Test og release17"},"Midt-Norge RHF","E: Test og release",17,null,""]
[{"$f":"Database!$B509&Database!$C509&Database!$D509","v":"Midt-Norge RHFE: Test og release18"},"Midt-Norge RHF","E: Test og release",18,null,""]
[{"$f":"Database!$B510&Database!$C510&Database!$D510","v":"Midt-Norge RHFE: Test og release19"},"Midt-Norge RHF","E: Test og release",19,null,""]
[{"$f":"Database!$B511&Database!$C511&Database!$D511","v":"Midt-Norge RHFE: Test og release20"},"Midt-Norge RHF","E: Test og release",20,null,""]
[{"$f":"Database!$B512&Database!$C512&Database!$D512","v":"Midt-Norge RHFE: Test og release21"},"Midt-Norge RHF","E: Test og release",21,null,""]
[{"$f":"Database!$B513&Database!$C513&Database!$D513","v":"Midt-Norge RHFE: Test og release22"},"Midt-Norge RHF","E: Test og release",22,null,""]
[{"$f":"Database!$B514&Database!$C514&Database!$D514","v":"Midt-Norge RHFE: Test og release23"},"Midt-Norge RHF","E: Test og release",23,null,""]
[{"$f":"Database!$B515&Database!$C515&Database!$D515","v":"Midt-Norge RHFE: Test og release24"},"Midt-Norge RHF","E: Test og release",24,null,""]
[{"$f":"Database!$B516&Database!$C516&Database!$D516","v":"Midt-Norge RHFE: Test og release25"},"Midt-Norge RHF","E: Test og release",25,null,""]
[{"$f":"Database!$B517&Database!$C517&Database!$D517","v":"Midt-Norge RHFE: Test og release26"},"Midt-Norge RHF","E: Test og release",26,null,""]
[{"$f":"Database!$B518&Database!$C518&Database!$D518","v":"Midt-Norge RHFE: Test og release27"},"Midt-Norge RHF","E: Test og release",27,null,""]
[{"$f":"Database!$B519&Database!$C519&Database!$D519","v":"Midt-Norge RHFE: Test og release28"},"Midt-Norge RHF","E: Test og release",28,null,""]
[{"$f":"Database!$B520&Database!$C520&Database!$D520","v":"Midt-Norge RHFE: Test og release29"},"Midt-Norge RHF","E: Test og release",29,null,""]
[{"$f":"Database!$B521&Database!$C521&Database!$D521","v":"Midt-Norge RHFE: Test og release30"},"Midt-Norge RHF","E: Test og release",30,null,""]
[{"$f":"Database!$B522&Database!$C522&Database!$D522","v":"Midt-Norge RHFE: Test og release31"},"Midt-Norge RHF","E: Test og release",31,null,""]
[{"$f":"Database!$B523&Database!$C523&Database!$D523","v":"Midt-Norge RHFE: Test og release32"},"Midt-Norge RHF","E: Test og release",32,null,""]
[{"$f":"Database!$B524&Database!$C524&Database!$D524","v":"Midt-Norge RHFE: Test og release33"},"Midt-Norge RHF","E: Test og release",33,null,""]
[{"$f":"Database!$B525&Database!$C525&Database!$D525","v":"Midt-Norge RHFE: Test og release34"},"Midt-Norge RHF","E: Test og release",34,null,""]
[null,null,null,null,null,""]
[{"$f":"Database!$B527&Database!$C527&Database!$D527","v":"Midt-Norge RHFF: Systemutvikling1"},"Midt-Norge RHF","F: Systemutvikling",1,"A-2 Norge AS","utlysninger@a-2.no"]
[{"$f":"Database!$B528&Database!$C528&Database!$D528","v":"Midt-Norge RHFF: Systemutvikling2"},"Midt-Norge RHF","F: Systemutvikling",2,"Aboveit AS ","salg@aboveit.no "]
[{"$f":"Database!$B529&Database!$C529&Database!$D529","v":"Midt-Norge RHFF: Systemutvikling3"},"Midt-Norge RHF","F: Systemutvikling",3,"Accenture AS ","rammeavtale.helse@accenture.com"]
[{"$f":"Database!$B530&Database!$C530&Database!$D530","v":"Midt-Norge RHFF: Systemutvikling4"},"Midt-Norge RHF","F: Systemutvikling",4,"Systra Norge AS ","firmapost@systra.com"]
[{"$f":"Database!$B531&Database!$C531&Database!$D531","v":"Midt-Norge RHFF: Systemutvikling5"},"Midt-Norge RHF","F: Systemutvikling",5,"Bouvet Norge AS ","Sykehusinnkjop2023@bouvet.no"]
[{"$f":"Database!$B532&Database!$C532&Database!$D532","v":"Midt-Norge RHFF: Systemutvikling6"},"Midt-Norge RHF","F: Systemutvikling",6,"Capgemini Norge AS ","helsenord.no@capgemini.com"]
[{"$f":"Database!$B533&Database!$C533&Database!$D533","v":"Midt-Norge RHFF: Systemutvikling7"},"Midt-Norge RHF","F: Systemutvikling",7,"Dfind Consulting AS ","consulting@dfind.no"]
[{"$f":"Database!$B534&Database!$C534&Database!$D534","v":"Midt-Norge RHFF: Systemutvikling8"},"Midt-Norge RHF","F: Systemutvikling",8,"Ernst & Young AS ","offentlige.anskaffelser@no.ey.com"]
[{"$f":"Database!$B535&Database!$C535&Database!$D535","v":"Midt-Norge RHFF: Systemutvikling9"},"Midt-Norge RHF","F: Systemutvikling",9,"Ework Group Norway AS ","sykehusinnkjop@eworkgroup.com  "]
[{"$f":"Database!$B536&Database!$C536&Database!$D536","v":"Midt-Norge RHFF: Systemutvikling10"},"Midt-Norge RHF","F: Systemutvikling",10,"Experis AS ","sykehusinnkjop@no.experis.com"]
[{"$f":"Database!$B537&Database!$C537&Database!$D537","v":"Midt-Norge RHFF: Systemutvikling11"},"Midt-Norge RHF","F: Systemutvikling",11,"IT Consult AS ","firmapost@itc.no"]
[{"$f":"Database!$B538&Database!$C538&Database!$D538","v":"Midt-Norge RHFF: Systemutvikling12"},"Midt-Norge RHF","F: Systemutvikling",12,"KPMG AS ","helse@kpmg.no"]
[{"$f":"Database!$B539&Database!$C539&Database!$D539","v":"Midt-Norge RHFF: Systemutvikling13"},"Midt-Norge RHF","F: Systemutvikling",13,"Netcompany AS ","anbud.no@netcompany.com "]
[{"$f":"Database!$B540&Database!$C540&Database!$D540","v":"Midt-Norge RHFF: Systemutvikling14"},"Midt-Norge RHF","F: Systemutvikling",14,"Sopra Steria AS ","helse@soprasteria.com"]
[{"$f":"Database!$B541&Database!$C541&Database!$D541","v":"Midt-Norge RHFF: Systemutvikling15"},"Midt-Norge RHF","F: Systemutvikling",15,"Twoday Conceptos AS ","salg.conceptos@twoday.com"]
[{"$f":"Database!$B542&Database!$C542&Database!$D542","v":"Midt-Norge RHFF: Systemutvikling16"},"Midt-Norge RHF","F: Systemutvikling",16,null,""]
[{"$f":"Database!$B543&Database!$C543&Database!$D543","v":"Midt-Norge RHFF: Systemutvikling17"},"Midt-Norge RHF","F: Systemutvikling",17,null,""]
[{"$f":"Database!$B544&Database!$C544&Database!$D544","v":"Midt-Norge RHFF: Systemutvikling18"},"Midt-Norge RHF","F: Systemutvikling",18,null,""]
[{"$f":"Database!$B545&Database!$C545&Database!$D545","v":"Midt-Norge RHFF: Systemutvikling19"},"Midt-Norge RHF","F: Systemutvikling",19,null,""]
[{"$f":"Database!$B546&Database!$C546&Database!$D546","v":"Midt-Norge RHFF: Systemutvikling20"},"Midt-Norge RHF","F: Systemutvikling",20,null,""]
[{"$f":"Database!$B547&Database!$C547&Database!$D547","v":"Midt-Norge RHFF: Systemutvikling21"},"Midt-Norge RHF","F: Systemutvikling",21,null,""]
[{"$f":"Database!$B548&Database!$C548&Database!$D548","v":"Midt-Norge RHFF: Systemutvikling22"},"Midt-Norge RHF","F: Systemutvikling",22,null,""]
[{"$f":"Database!$B549&Database!$C549&Database!$D549","v":"Midt-Norge RHFF: Systemutvikling23"},"Midt-Norge RHF","F: Systemutvikling",23,null,""]
[{"$f":"Database!$B550&Database!$C550&Database!$D550","v":"Midt-Norge RHFF: Systemutvikling24"},"Midt-Norge RHF","F: Systemutvikling",24,null,""]
[{"$f":"Database!$B551&Database!$C551&Database!$D551","v":"Midt-Norge RHFF: Systemutvikling25"},"Midt-Norge RHF","F: Systemutvikling",25,null,""]
[{"$f":"Database!$B552&Database!$C552&Database!$D552","v":"Midt-Norge RHFF: Systemutvikling26"},"Midt-Norge RHF","F: Systemutvikling",26,null,""]
[{"$f":"Database!$B553&Database!$C553&Database!$D553","v":"Midt-Norge RHFF: Systemutvikling27"},"Midt-Norge RHF","F: Systemutvikling",27,null,""]
[{"$f":"Database!$B554&Database!$C554&Database!$D554","v":"Midt-Norge RHFF: Systemutvikling28"},"Midt-Norge RHF","F: Systemutvikling",28,null,""]
[{"$f":"Database!$B555&Database!$C555&Database!$D555","v":"Midt-Norge RHFF: Systemutvikling29"},"Midt-Norge RHF","F: Systemutvikling",29,null,""]
[{"$f":"Database!$B556&Database!$C556&Database!$D556","v":"Midt-Norge RHFF: Systemutvikling30"},"Midt-Norge RHF","F: Systemutvikling",30,null,""]
[{"$f":"Database!$B557&Database!$C557&Database!$D557","v":"Midt-Norge RHFF: Systemutvikling31"},"Midt-Norge RHF","F: Systemutvikling",31,null,""]
[{"$f":"Database!$B558&Database!$C558&Database!$D558","v":"Midt-Norge RHFF: Systemutvikling32"},"Midt-Norge RHF","F: Systemutvikling",32,null,""]
[{"$f":"Database!$B559&Database!$C559&Database!$D559","v":"Midt-Norge RHFF: Systemutvikling33"},"Midt-Norge RHF","F: Systemutvikling",33,null,""]
[{"$f":"Database!$B560&Database!$C560&Database!$D560","v":"Midt-Norge RHFF: Systemutvikling34"},"Midt-Norge RHF","F: Systemutvikling",34,null,""]
[{"$f":"Database!$B561&Database!$C561&Database!$D561","v":""},null,null,null,null,""]
[{"$f":"Database!$B562&Database!$C562&Database!$D562","v":"Midt-Norge RHFG: Applikasjonsforvaltning, drift og forvaltning av IT-systemer og plattformer1"},"Midt-Norge RHF","G: Applikasjonsforvaltning, drift og forvaltning av IT-systemer og plattformer",1,"A-2 Norge AS","utlysninger@a-2.no"]
[{"$f":"Database!$B563&Database!$C563&Database!$D563","v":"Midt-Norge RHFG: Applikasjonsforvaltning, drift og forvaltning av IT-systemer og plattformer2"},"Midt-Norge RHF","G: Applikasjonsforvaltning, drift og forvaltning av IT-systemer og plattformer",2,"Bouvet Norge AS ","Sykehusinnkjop2023@bouvet.no"]
[{"$f":"Database!$B564&Database!$C564&Database!$D564","v":"Midt-Norge RHFG: Applikasjonsforvaltning, drift og forvaltning av IT-systemer og plattformer3"},"Midt-Norge RHF","G: Applikasjonsforvaltning, drift og forvaltning av IT-systemer og plattformer",3,"Capgemini Norge AS ","helsenord.no@capgemini.com"]
[{"$f":"Database!$B565&Database!$C565&Database!$D565","v":"Midt-Norge RHFG: Applikasjonsforvaltning, drift og forvaltning av IT-systemer og plattformer4"},"Midt-Norge RHF","G: Applikasjonsforvaltning, drift og forvaltning av IT-systemer og plattformer",4,"CGI Norge AS ","avrop@cgi.com"]
[{"$f":"Database!$B566&Database!$C566&Database!$D566","v":"Midt-Norge RHFG: Applikasjonsforvaltning, drift og forvaltning av IT-systemer og plattformer5"},"Midt-Norge RHF","G: Applikasjonsforvaltning, drift og forvaltning av IT-systemer og plattformer",5,"Crayon AS ","firmapost@crayon.com"]
[{"$f":"Database!$B567&Database!$C567&Database!$D567","v":"Midt-Norge RHFG: Applikasjonsforvaltning, drift og forvaltning av IT-systemer og plattformer6"},"Midt-Norge RHF","G: Applikasjonsforvaltning, drift og forvaltning av IT-systemer og plattformer",6,"Emagine AS ","sykehusinnkjop@emagine.no"]
[{"$f":"Database!$B568&Database!$C568&Database!$D568","v":"Midt-Norge RHFG: Applikasjonsforvaltning, drift og forvaltning av IT-systemer og plattformer7"},"Midt-Norge RHF","G: Applikasjonsforvaltning, drift og forvaltning av IT-systemer og plattformer",7,"Ernst & Young AS ","offentlige.anskaffelser@no.ey.com"]
[{"$f":"Database!$B569&Database!$C569&Database!$D569","v":"Midt-Norge RHFG: Applikasjonsforvaltning, drift og forvaltning av IT-systemer og plattformer8"},"Midt-Norge RHF","G: Applikasjonsforvaltning, drift og forvaltning av IT-systemer og plattformer",8,"Ework Group Norway AS ","sykehusinnkjop@eworkgroup.com  "]
[{"$f":"Database!$B570&Database!$C570&Database!$D570","v":"Midt-Norge RHFG: Applikasjonsforvaltning, drift og forvaltning av IT-systemer og plattformer9"},"Midt-Norge RHF","G: Applikasjonsforvaltning, drift og forvaltning av IT-systemer og plattformer",9,"Experis AS ","sykehusinnkjop@no.experis.com"]
[{"$f":"Database!$B571&Database!$C571&Database!$D571","v":"Midt-Norge RHFG: Applikasjonsforvaltning, drift og forvaltning av IT-systemer og plattformer10"},"Midt-Norge RHF","G: Applikasjonsforvaltning, drift og forvaltning av IT-systemer og plattformer",10,"IT Consult AS ","firmapost@itc.no"]
[{"$f":"Database!$B572&Database!$C572&Database!$D572","v":"Midt-Norge RHFG: Applikasjonsforvaltning, drift og forvaltning av IT-systemer og plattformer11"},"Midt-Norge RHF","G: Applikasjonsforvaltning, drift og forvaltning av IT-systemer og plattformer",11,"Move AS","konsulentledelse@move.no"]
[{"$f":"Database!$B573&Database!$C573&Database!$D573","v":"Midt-Norge RHFG: Applikasjonsforvaltning, drift og forvaltning av IT-systemer og plattformer12"},"Midt-Norge RHF","G: Applikasjonsforvaltning, drift og forvaltning av IT-systemer og plattformer",12,"Netcompany AS ","anbud.no@netcompany.com "]
[{"$f":"Database!$B574&Database!$C574&Database!$D574","v":"Midt-Norge RHFG: Applikasjonsforvaltning, drift og forvaltning av IT-systemer og plattformer13"},"Midt-Norge RHF","G: Applikasjonsforvaltning, drift og forvaltning av IT-systemer og plattformer",13,"Nordlo Grenland AS","firmapost.grenland@nordlo.com"]
[{"$f":"Database!$B575&Database!$C575&Database!$D575","v":"Midt-Norge RHFG: Applikasjonsforvaltning, drift og forvaltning av IT-systemer og plattformer14"},"Midt-Norge RHF","G: Applikasjonsforvaltning, drift og forvaltning av IT-systemer og plattformer",14,"Proact IT Norge AS ","bestilling@proact.no "]
[{"$f":"Database!$B576&Database!$C576&Database!$D576","v":"Midt-Norge RHFG: Applikasjonsforvaltning, drift og forvaltning av IT-systemer og plattformer15"},"Midt-Norge RHF","G: Applikasjonsforvaltning, drift og forvaltning av IT-systemer og plattformer",15,"Sopra Steria AS ","helse@soprasteria.com"]
[{"$f":"Database!$B577&Database!$C577&Database!$D577","v":"Midt-Norge RHFG: Applikasjonsforvaltning, drift og forvaltning av IT-systemer og plattformer16"},"Midt-Norge RHF","G: Applikasjonsforvaltning, drift og forvaltning av IT-systemer og plattformer",16,null,""]
[{"$f":"Database!$B578&Database!$C578&Database!$D578","v":"Midt-Norge RHFG: Applikasjonsforvaltning, drift og forvaltning av IT-systemer og plattformer17"},"Midt-Norge RHF","G: Applikasjonsforvaltning, drift og forvaltning av IT-systemer og plattformer",17,null,""]
[{"$f":"Database!$B579&Database!$C579&Database!$D579","v":"Midt-Norge RHFG: Applikasjonsforvaltning, drift og forvaltning av IT-systemer og plattformer18"},"Midt-Norge RHF","G: Applikasjonsforvaltning, drift og forvaltning av IT-systemer og plattformer",18,null,""]
[{"$f":"Database!$B580&Database!$C580&Database!$D580","v":"Midt-Norge RHFG: Applikasjonsforvaltning, drift og forvaltning av IT-systemer og plattformer19"},"Midt-Norge RHF","G: Applikasjonsforvaltning, drift og forvaltning av IT-systemer og plattformer",19,null,""]
[{"$f":"Database!$B581&Database!$C581&Database!$D581","v":"Midt-Norge RHFG: Applikasjonsforvaltning, drift og forvaltning av IT-systemer og plattformer20"},"Midt-Norge RHF","G: Applikasjonsforvaltning, drift og forvaltning av IT-systemer og plattformer",20,null,""]
[{"$f":"Database!$B582&Database!$C582&Database!$D582","v":"Midt-Norge RHFG: Applikasjonsforvaltning, drift og forvaltning av IT-systemer og plattformer21"},"Midt-Norge RHF","G: Applikasjonsforvaltning, drift og forvaltning av IT-systemer og plattformer",21,null,""]
[{"$f":"Database!$B583&Database!$C583&Database!$D583","v":"Midt-Norge RHFG: Applikasjonsforvaltning, drift og forvaltning av IT-systemer og plattformer22"},"Midt-Norge RHF","G: Applikasjonsforvaltning, drift og forvaltning av IT-systemer og plattformer",22,null,""]
[{"$f":"Database!$B584&Database!$C584&Database!$D584","v":"Midt-Norge RHFG: Applikasjonsforvaltning, drift og forvaltning av IT-systemer og plattformer23"},"Midt-Norge RHF","G: Applikasjonsforvaltning, drift og forvaltning av IT-systemer og plattformer",23,null,""]
[{"$f":"Database!$B585&Database!$C585&Database!$D585","v":"Midt-Norge RHFG: Applikasjonsforvaltning, drift og forvaltning av IT-systemer og plattformer24"},"Midt-Norge RHF","G: Applikasjonsforvaltning, drift og forvaltning av IT-systemer og plattformer",24,null,""]
[{"$f":"Database!$B586&Database!$C586&Database!$D586","v":"Midt-Norge RHFG: Applikasjonsforvaltning, drift og forvaltning av IT-systemer og plattformer25"},"Midt-Norge RHF","G: Applikasjonsforvaltning, drift og forvaltning av IT-systemer og plattformer",25,null,""]
[{"$f":"Database!$B587&Database!$C587&Database!$D587","v":"Midt-Norge RHFG: Applikasjonsforvaltning, drift og forvaltning av IT-systemer og plattformer26"},"Midt-Norge RHF","G: Applikasjonsforvaltning, drift og forvaltning av IT-systemer og plattformer",26,null,""]
[{"$f":"Database!$B588&Database!$C588&Database!$D588","v":"Midt-Norge RHFG: Applikasjonsforvaltning, drift og forvaltning av IT-systemer og plattformer27"},"Midt-Norge RHF","G: Applikasjonsforvaltning, drift og forvaltning av IT-systemer og plattformer",27,null,""]
[{"$f":"Database!$B589&Database!$C589&Database!$D589","v":"Midt-Norge RHFG: Applikasjonsforvaltning, drift og forvaltning av IT-systemer og plattformer28"},"Midt-Norge RHF","G: Applikasjonsforvaltning, drift og forvaltning av IT-systemer og plattformer",28,null,""]
[{"$f":"Database!$B590&Database!$C590&Database!$D590","v":"Midt-Norge RHFG: Applikasjonsforvaltning, drift og forvaltning av IT-systemer og plattformer29"},"Midt-Norge RHF","G: Applikasjonsforvaltning, drift og forvaltning av IT-systemer og plattformer",29,null,""]
[{"$f":"Database!$B591&Database!$C591&Database!$D591","v":"Midt-Norge RHFG: Applikasjonsforvaltning, drift og forvaltning av IT-systemer og plattformer30"},"Midt-Norge RHF","G: Applikasjonsforvaltning, drift og forvaltning av IT-systemer og plattformer",30,null,""]
[{"$f":"Database!$B592&Database!$C592&Database!$D592","v":"Midt-Norge RHFG: Applikasjonsforvaltning, drift og forvaltning av IT-systemer og plattformer31"},"Midt-Norge RHF","G: Applikasjonsforvaltning, drift og forvaltning av IT-systemer og plattformer",31,null,""]
[{"$f":"Database!$B593&Database!$C593&Database!$D593","v":"Midt-Norge RHFG: Applikasjonsforvaltning, drift og forvaltning av IT-systemer og plattformer32"},"Midt-Norge RHF","G: Applikasjonsforvaltning, drift og forvaltning av IT-systemer og plattformer",32,null,""]
[{"$f":"Database!$B594&Database!$C594&Database!$D594","v":"Midt-Norge RHFG: Applikasjonsforvaltning, drift og forvaltning av IT-systemer og plattformer33"},"Midt-Norge RHF","G: Applikasjonsforvaltning, drift og forvaltning av IT-systemer og plattformer",33,null,""]
[{"$f":"Database!$B595&Database!$C595&Database!$D595","v":"Midt-Norge RHFG: Applikasjonsforvaltning, drift og forvaltning av IT-systemer og plattformer34"},"Midt-Norge RHF","G: Applikasjonsforvaltning, drift og forvaltning av IT-systemer og plattformer",34,null,""]
[null,null,null,null,null,""]
[{"$f":"Database!$B597&Database!$C597&Database!$D597","v":"Midt-Norge RHFH: Nettverk1"},"Midt-Norge RHF","H: Nettverk",1,"A-2 Norge AS","utlysninger@a-2.no"]
[{"$f":"Database!$B598&Database!$C598&Database!$D598","v":"Midt-Norge RHFH: Nettverk2"},"Midt-Norge RHF","H: Nettverk",2,"Conscia Norge AS ","salg@conscia.no "]
[{"$f":"Database!$B599&Database!$C599&Database!$D599","v":"Midt-Norge RHFH: Nettverk3"},"Midt-Norge RHF","H: Nettverk",3,"Emagine AS ","sykehusinnkjop@emagine.no"]
[{"$f":"Database!$B600&Database!$C600&Database!$D600","v":"Midt-Norge RHFH: Nettverk4"},"Midt-Norge RHF","H: Nettverk",4,"Ework Group Norway AS ","sykehusinnkjop@eworkgroup.com  "]
[{"$f":"Database!$B601&Database!$C601&Database!$D601","v":"Midt-Norge RHFH: Nettverk5"},"Midt-Norge RHF","H: Nettverk",5,"Experis AS ","sykehusinnkjop@no.experis.com"]
[{"$f":"Database!$B602&Database!$C602&Database!$D602","v":"Midt-Norge RHFH: Nettverk6"},"Midt-Norge RHF","H: Nettverk",6,"IT Consult AS ","firmapost@itc.no"]
[{"$f":"Database!$B603&Database!$C603&Database!$D603","v":"Midt-Norge RHFH: Nettverk7"},"Midt-Norge RHF","H: Nettverk",7,"Move AS","konsulentledelse@move.no"]
[{"$f":"Database!$B604&Database!$C604&Database!$D604","v":"Midt-Norge RHFH: Nettverk8"},"Midt-Norge RHF","H: Nettverk",8,"NetNordic Norway AS ","salg@netnordic.no"]
[{"$f":"Database!$B605&Database!$C605&Database!$D605","v":"Midt-Norge RHFH: Nettverk9"},"Midt-Norge RHF","H: Nettverk",9,"Nordlo Grenland AS","firmapost.grenland@nordlo.com"]
[{"$f":"Database!$B606&Database!$C606&Database!$D606","v":"Midt-Norge RHFH: Nettverk10"},"Midt-Norge RHF","H: Nettverk",10,"Sopra Steria AS ","helse@soprasteria.com"]
[{"$f":"Database!$B607&Database!$C607&Database!$D607","v":"Midt-Norge RHFH: Nettverk11"},"Midt-Norge RHF","H: Nettverk",11,null,""]
[{"$f":"Database!$B608&Database!$C608&Database!$D608","v":"Midt-Norge RHFH: Nettverk12"},"Midt-Norge RHF","H: Nettverk",12,null,""]
[{"$f":"Database!$B609&Database!$C609&Database!$D609","v":"Midt-Norge RHFH: Nettverk13"},"Midt-Norge RHF","H: Nettverk",13,null,""]
[{"$f":"Database!$B610&Database!$C610&Database!$D610","v":"Midt-Norge RHFH: Nettverk14"},"Midt-Norge RHF","H: Nettverk",14,null,""]
[{"$f":"Database!$B611&Database!$C611&Database!$D611","v":"Midt-Norge RHFH: Nettverk15"},"Midt-Norge RHF","H: Nettverk",15,null,""]
[{"$f":"Database!$B612&Database!$C612&Database!$D612","v":"Midt-Norge RHFH: Nettverk16"},"Midt-Norge RHF","H: Nettverk",16,null,""]
[{"$f":"Database!$B613&Database!$C613&Database!$D613","v":"Midt-Norge RHFH: Nettverk17"},"Midt-Norge RHF","H: Nettverk",17,null,""]
[{"$f":"Database!$B614&Database!$C614&Database!$D614","v":"Midt-Norge RHFH: Nettverk18"},"Midt-Norge RHF","H: Nettverk",18,null,""]
[{"$f":"Database!$B615&Database!$C615&Database!$D615","v":"Midt-Norge RHFH: Nettverk19"},"Midt-Norge RHF","H: Nettverk",19,null,""]
[{"$f":"Database!$B616&Database!$C616&Database!$D616","v":"Midt-Norge RHFH: Nettverk20"},"Midt-Norge RHF","H: Nettverk",20,null,""]
[{"$f":"Database!$B617&Database!$C617&Database!$D617","v":"Midt-Norge RHFH: Nettverk21"},"Midt-Norge RHF","H: Nettverk",21,null,""]
[{"$f":"Database!$B618&Database!$C618&Database!$D618","v":"Midt-Norge RHFH: Nettverk22"},"Midt-Norge RHF","H: Nettverk",22,null,""]
[{"$f":"Database!$B619&Database!$C619&Database!$D619","v":"Midt-Norge RHFH: Nettverk23"},"Midt-Norge RHF","H: Nettverk",23,null,""]
[{"$f":"Database!$B620&Database!$C620&Database!$D620","v":"Midt-Norge RHFH: Nettverk24"},"Midt-Norge RHF","H: Nettverk",24,null,""]
[{"$f":"Database!$B621&Database!$C621&Database!$D621","v":"Midt-Norge RHFH: Nettverk25"},"Midt-Norge RHF","H: Nettverk",25,null,""]
[{"$f":"Database!$B622&Database!$C622&Database!$D622","v":"Midt-Norge RHFH: Nettverk26"},"Midt-Norge RHF","H: Nettverk",26,null,""]
[{"$f":"Database!$B623&Database!$C623&Database!$D623","v":"Midt-Norge RHFH: Nettverk27"},"Midt-Norge RHF","H: Nettverk",27,null,""]
[{"$f":"Database!$B624&Database!$C624&Database!$D624","v":"Midt-Norge RHFH: Nettverk28"},"Midt-Norge RHF","H: Nettverk",28,null,""]
[{"$f":"Database!$B625&Database!$C625&Database!$D625","v":"Midt-Norge RHFH: Nettverk29"},"Midt-Norge RHF","H: Nettverk",29,null,""]
[{"$f":"Database!$B626&Database!$C626&Database!$D626","v":"Midt-Norge RHFH: Nettverk30"},"Midt-Norge RHF","H: Nettverk",30,null,""]
[{"$f":"Database!$B627&Database!$C627&Database!$D627","v":"Midt-Norge RHFH: Nettverk31"},"Midt-Norge RHF","H: Nettverk",31,null,""]
[{"$f":"Database!$B628&Database!$C628&Database!$D628","v":"Midt-Norge RHFH: Nettverk32"},"Midt-Norge RHF","H: Nettverk",32,null,""]
[{"$f":"Database!$B629&Database!$C629&Database!$D629","v":"Midt-Norge RHFH: Nettverk33"},"Midt-Norge RHF","H: Nettverk",33,null,""]
[{"$f":"Database!$B630&Database!$C630&Database!$D630","v":"Midt-Norge RHFH: Nettverk34"},"Midt-Norge RHF","H: Nettverk",34,null,""]
[{"$f":"Database!$B631&Database!$C631&Database!$D631","v":""},null,null,null,null,""]
[{"$f":"Database!$B632&Database!$C632&Database!$D632","v":"Midt-Norge RHFI: Telekommunikasjon1"},"Midt-Norge RHF","I: Telekommunikasjon",1,"A-2 Norge AS","utlysninger@a-2.no"]
[{"$f":"Database!$B633&Database!$C633&Database!$D633","v":"Midt-Norge RHFI: Telekommunikasjon2"},"Midt-Norge RHF","I: Telekommunikasjon",2,"Experis AS ","sykehusinnkjop@no.experis.com"]
[{"$f":"Database!$B634&Database!$C634&Database!$D634","v":"Midt-Norge RHFI: Telekommunikasjon3"},"Midt-Norge RHF","I: Telekommunikasjon",3,"NetNordic Norway AS ","salg@netnordic.no"]
[{"$f":"Database!$B635&Database!$C635&Database!$D635","v":"Midt-Norge RHFI: Telekommunikasjon4"},"Midt-Norge RHF","I: Telekommunikasjon",4,null,""]
[{"$f":"Database!$B636&Database!$C636&Database!$D636","v":"Midt-Norge RHFI: Telekommunikasjon5"},"Midt-Norge RHF","I: Telekommunikasjon",5,null,""]
[{"$f":"Database!$B637&Database!$C637&Database!$D637","v":"Midt-Norge RHFI: Telekommunikasjon6"},"Midt-Norge RHF","I: Telekommunikasjon",6,null,""]
[{"$f":"Database!$B638&Database!$C638&Database!$D638","v":"Midt-Norge RHFI: Telekommunikasjon7"},"Midt-Norge RHF","I: Telekommunikasjon",7,null,""]
[{"$f":"Database!$B639&Database!$C639&Database!$D639","v":"Midt-Norge RHFI: Telekommunikasjon8"},"Midt-Norge RHF","I: Telekommunikasjon",8,null,""]
[{"$f":"Database!$B640&Database!$C640&Database!$D640","v":"Midt-Norge RHFI: Telekommunikasjon9"},"Midt-Norge RHF","I: Telekommunikasjon",9,null,""]
[{"$f":"Database!$B641&Database!$C641&Database!$D641","v":"Midt-Norge RHFI: Telekommunikasjon10"},"Midt-Norge RHF","I: Telekommunikasjon",10,null,""]
[{"$f":"Database!$B642&Database!$C642&Database!$D642","v":"Midt-Norge RHFI: Telekommunikasjon11"},"Midt-Norge RHF","I: Telekommunikasjon",11,null,""]
[{"$f":"Database!$B643&Database!$C643&Database!$D643","v":"Midt-Norge RHFI: Telekommunikasjon12"},"Midt-Norge RHF","I: Telekommunikasjon",12,null,""]
[{"$f":"Database!$B644&Database!$C644&Database!$D644","v":"Midt-Norge RHFI: Telekommunikasjon13"},"Midt-Norge RHF","I: Telekommunikasjon",13,null,""]
[{"$f":"Database!$B645&Database!$C645&Database!$D645","v":"Midt-Norge RHFI: Telekommunikasjon14"},"Midt-Norge RHF","I: Telekommunikasjon",14,null,""]
[{"$f":"Database!$B646&Database!$C646&Database!$D646","v":"Midt-Norge RHFI: Telekommunikasjon15"},"Midt-Norge RHF","I: Telekommunikasjon",15,null,""]
[{"$f":"Database!$B647&Database!$C647&Database!$D647","v":"Midt-Norge RHFI: Telekommunikasjon16"},"Midt-Norge RHF","I: Telekommunikasjon",16,null,""]
[{"$f":"Database!$B648&Database!$C648&Database!$D648","v":"Midt-Norge RHFI: Telekommunikasjon17"},"Midt-Norge RHF","I: Telekommunikasjon",17,null,""]
[{"$f":"Database!$B649&Database!$C649&Database!$D649","v":"Midt-Norge RHFI: Telekommunikasjon18"},"Midt-Norge RHF","I: Telekommunikasjon",18,null,""]
[{"$f":"Database!$B650&Database!$C650&Database!$D650","v":"Midt-Norge RHFI: Telekommunikasjon19"},"Midt-Norge RHF","I: Telekommunikasjon",19,null,""]
[{"$f":"Database!$B651&Database!$C651&Database!$D651","v":"Midt-Norge RHFI: Telekommunikasjon20"},"Midt-Norge RHF","I: Telekommunikasjon",20,null,""]
[{"$f":"Database!$B652&Database!$C652&Database!$D652","v":"Midt-Norge RHFI: Telekommunikasjon21"},"Midt-Norge RHF","I: Telekommunikasjon",21,null,""]
[{"$f":"Database!$B653&Database!$C653&Database!$D653","v":"Midt-Norge RHFI: Telekommunikasjon22"},"Midt-Norge RHF","I: Telekommunikasjon",22,null,""]
[{"$f":"Database!$B654&Database!$C654&Database!$D654","v":"Midt-Norge RHFI: Telekommunikasjon23"},"Midt-Norge RHF","I: Telekommunikasjon",23,null,""]
[{"$f":"Database!$B655&Database!$C655&Database!$D655","v":"Midt-Norge RHFI: Telekommunikasjon24"},"Midt-Norge RHF","I: Telekommunikasjon",24,null,""]
[{"$f":"Database!$B656&Database!$C656&Database!$D656","v":"Midt-Norge RHFI: Telekommunikasjon25"},"Midt-Norge RHF","I: Telekommunikasjon",25,null,""]
[{"$f":"Database!$B657&Database!$C657&Database!$D657","v":"Midt-Norge RHFI: Telekommunikasjon26"},"Midt-Norge RHF","I: Telekommunikasjon",26,null,""]
[{"$f":"Database!$B658&Database!$C658&Database!$D658","v":"Midt-Norge RHFI: Telekommunikasjon27"},"Midt-Norge RHF","I: Telekommunikasjon",27,null,""]
[{"$f":"Database!$B659&Database!$C659&Database!$D659","v":"Midt-Norge RHFI: Telekommunikasjon28"},"Midt-Norge RHF","I: Telekommunikasjon",28,null,""]
[{"$f":"Database!$B660&Database!$C660&Database!$D660","v":"Midt-Norge RHFI: Telekommunikasjon29"},"Midt-Norge RHF","I: Telekommunikasjon",29,null,""]
[{"$f":"Database!$B661&Database!$C661&Database!$D661","v":"Midt-Norge RHFI: Telekommunikasjon30"},"Midt-Norge RHF","I: Telekommunikasjon",30,null,""]
[{"$f":"Database!$B662&Database!$C662&Database!$D662","v":"Midt-Norge RHFI: Telekommunikasjon31"},"Midt-Norge RHF","I: Telekommunikasjon",31,null,""]
[{"$f":"Database!$B663&Database!$C663&Database!$D663","v":"Midt-Norge RHFI: Telekommunikasjon32"},"Midt-Norge RHF","I: Telekommunikasjon",32,null,""]
[{"$f":"Database!$B664&Database!$C664&Database!$D664","v":"Midt-Norge RHFI: Telekommunikasjon33"},"Midt-Norge RHF","I: Telekommunikasjon",33,null,""]
[{"$f":"Database!$B665&Database!$C665&Database!$D665","v":"Midt-Norge RHFI: Telekommunikasjon34"},"Midt-Norge RHF","I: Telekommunikasjon",34,null,""]
[null,null,null,null,null,""]
[{"$f":"Database!$B667&Database!$C667&Database!$D667","v":"Midt-Norge RHFJ: Tverrfaglige team1"},"Midt-Norge RHF","J: Tverrfaglige team",1,"A-2 Norge AS","utlysninger@a-2.no"]
[{"$f":"Database!$B668&Database!$C668&Database!$D668","v":"Midt-Norge RHFJ: Tverrfaglige team2"},"Midt-Norge RHF","J: Tverrfaglige team",2,"Accenture AS ","rammeavtale.helse@accenture.com"]
[{"$f":"Database!$B669&Database!$C669&Database!$D669","v":"Midt-Norge RHFJ: Tverrfaglige team3"},"Midt-Norge RHF","J: Tverrfaglige team",3,"Bouvet Norge AS ","Sykehusinnkjop2023@bouvet.no"]
[{"$f":"Database!$B670&Database!$C670&Database!$D670","v":"Midt-Norge RHFJ: Tverrfaglige team4"},"Midt-Norge RHF","J: Tverrfaglige team",4,"Capgemini Norge AS ","helsenord.no@capgemini.com"]
[{"$f":"Database!$B671&Database!$C671&Database!$D671","v":"Midt-Norge RHFJ: Tverrfaglige team5"},"Midt-Norge RHF","J: Tverrfaglige team",5,"Deloitte AS ","noanbud@DELOITTE.no"]
[{"$f":"Database!$B672&Database!$C672&Database!$D672","v":"Midt-Norge RHFJ: Tverrfaglige team6"},"Midt-Norge RHF","J: Tverrfaglige team",6,"Ernst & Young AS ","offentlige.anskaffelser@no.ey.com"]
[{"$f":"Database!$B673&Database!$C673&Database!$D673","v":"Midt-Norge RHFJ: Tverrfaglige team7"},"Midt-Norge RHF","J: Tverrfaglige team",7,"Netcompany AS ","anbud.no@netcompany.com "]
[{"$f":"Database!$B674&Database!$C674&Database!$D674","v":"Midt-Norge RHFJ: Tverrfaglige team8"},"Midt-Norge RHF","J: Tverrfaglige team",8,"PricewaterhouseCoopers AS ","no_resepsjon.oslo@pwc.com"]
[{"$f":"Database!$B675&Database!$C675&Database!$D675","v":"Midt-Norge RHFJ: Tverrfaglige team9"},"Midt-Norge RHF","J: Tverrfaglige team",9,"Sopra Steria AS ","helse@soprasteria.com"]
[{"$f":"Database!$B676&Database!$C676&Database!$D676","v":"Midt-Norge RHFJ: Tverrfaglige team10"},"Midt-Norge RHF","J: Tverrfaglige team",10,null,""]
[{"$f":"Database!$B677&Database!$C677&Database!$D677","v":"Midt-Norge RHFJ: Tverrfaglige team11"},"Midt-Norge RHF","J: Tverrfaglige team",11,null,""]
[{"$f":"Database!$B678&Database!$C678&Database!$D678","v":"Midt-Norge RHFJ: Tverrfaglige team12"},"Midt-Norge RHF","J: Tverrfaglige team",12,null,""]
[{"$f":"Database!$B679&Database!$C679&Database!$D679","v":"Midt-Norge RHFJ: Tverrfaglige team13"},"Midt-Norge RHF","J: Tverrfaglige team",13,null,""]
[{"$f":"Database!$B680&Database!$C680&Database!$D680","v":"Midt-Norge RHFJ: Tverrfaglige team14"},"Midt-Norge RHF","J: Tverrfaglige team",14,null,""]
[{"$f":"Database!$B681&Database!$C681&Database!$D681","v":"Midt-Norge RHFJ: Tverrfaglige team15"},"Midt-Norge RHF","J: Tverrfaglige team",15,null,""]
[{"$f":"Database!$B682&Database!$C682&Database!$D682","v":"Midt-Norge RHFJ: Tverrfaglige team16"},"Midt-Norge RHF","J: Tverrfaglige team",16,null,""]
[{"$f":"Database!$B683&Database!$C683&Database!$D683","v":"Midt-Norge RHFJ: Tverrfaglige team17"},"Midt-Norge RHF","J: Tverrfaglige team",17,null,""]
[{"$f":"Database!$B684&Database!$C684&Database!$D684","v":"Midt-Norge RHFJ: Tverrfaglige team18"},"Midt-Norge RHF","J: Tverrfaglige team",18,null,""]
[{"$f":"Database!$B685&Database!$C685&Database!$D685","v":"Midt-Norge RHFJ: Tverrfaglige team19"},"Midt-Norge RHF","J: Tverrfaglige team",19,null,""]
[{"$f":"Database!$B686&Database!$C686&Database!$D686","v":"Midt-Norge RHFJ: Tverrfaglige team20"},"Midt-Norge RHF","J: Tverrfaglige team",20,null,""]
[{"$f":"Database!$B687&Database!$C687&Database!$D687","v":"Midt-Norge RHFJ: Tverrfaglige team21"},"Midt-Norge RHF","J: Tverrfaglige team",21,null,""]
[{"$f":"Database!$B688&Database!$C688&Database!$D688","v":"Midt-Norge RHFJ: Tverrfaglige team22"},"Midt-Norge RHF","J: Tverrfaglige team",22,null,""]
[{"$f":"Database!$B689&Database!$C689&Database!$D689","v":"Midt-Norge RHFJ: Tverrfaglige team23"},"Midt-Norge RHF","J: Tverrfaglige team",23,null,""]
[{"$f":"Database!$B690&Database!$C690&Database!$D690","v":"Midt-Norge RHFJ: Tverrfaglige team24"},"Midt-Norge RHF","J: Tverrfaglige team",24,null,""]
[{"$f":"Database!$B691&Database!$C691&Database!$D691","v":"Midt-Norge RHFJ: Tverrfaglige team25"},"Midt-Norge RHF","J: Tverrfaglige team",25,null,""]
[{"$f":"Database!$B692&Database!$C692&Database!$D692","v":"Midt-Norge RHFJ: Tverrfaglige team26"},"Midt-Norge RHF","J: Tverrfaglige team",26,null,""]
[{"$f":"Database!$B693&Database!$C693&Database!$D693","v":"Midt-Norge RHFJ: Tverrfaglige team27"},"Midt-Norge RHF","J: Tverrfaglige team",27,null,""]
[{"$f":"Database!$B694&Database!$C694&Database!$D694","v":"Midt-Norge RHFJ: Tverrfaglige team28"},"Midt-Norge RHF","J: Tverrfaglige team",28,null,""]
[{"$f":"Database!$B695&Database!$C695&Database!$D695","v":"Midt-Norge RHFJ: Tverrfaglige team29"},"Midt-Norge RHF","J: Tverrfaglige team",29,null,""]
[{"$f":"Database!$B696&Database!$C696&Database!$D696","v":"Midt-Norge RHFJ: Tverrfaglige team30"},"Midt-Norge RHF","J: Tverrfaglige team",30,null,""]
[{"$f":"Database!$B697&Database!$C697&Database!$D697","v":"Midt-Norge RHFJ: Tverrfaglige team31"},"Midt-Norge RHF","J: Tverrfaglige team",31,null,""]
[{"$f":"Database!$B698&Database!$C698&Database!$D698","v":"Midt-Norge RHFJ: Tverrfaglige team32"},"Midt-Norge RHF","J: Tverrfaglige team",32,null,""]
[{"$f":"Database!$B699&Database!$C699&Database!$D699","v":"Midt-Norge RHFJ: Tverrfaglige team33"},"Midt-Norge RHF","J: Tverrfaglige team",33,null,""]
[{"$f":"Database!$B700&Database!$C700&Database!$D700","v":"Midt-Norge RHFJ: Tverrfaglige team34"},"Midt-Norge RHF","J: Tverrfaglige team",34,null,""]
[null,null,null,null,null,""]
[{"$f":"Database!$B702&Database!$C702&Database!$D702","v":"Vest RHFA: Program og Prosjektgjennomføring1"},"Vest RHF","A: Program og Prosjektgjennomføring",1,"A-2 Norge AS","utlysninger@a-2.no"]
[{"$f":"Database!$B703&Database!$C703&Database!$D703","v":"Vest RHFA: Program og Prosjektgjennomføring2"},"Vest RHF","A: Program og Prosjektgjennomføring",2,"Accenture AS ","rammeavtale.helse@accenture.com"]
[{"$f":"Database!$B704&Database!$C704&Database!$D704","v":"Vest RHFA: Program og Prosjektgjennomføring3"},"Vest RHF","A: Program og Prosjektgjennomføring",3,"Systra Norge AS ","firmapost@systra.com"]
[{"$f":"Database!$B705&Database!$C705&Database!$D705","v":"Vest RHFA: Program og Prosjektgjennomføring4"},"Vest RHF","A: Program og Prosjektgjennomføring",4,"Bouvet Norge AS ","Sykehusinnkjop2023@bouvet.no"]
[{"$f":"Database!$B706&Database!$C706&Database!$D706","v":"Vest RHFA: Program og Prosjektgjennomføring5"},"Vest RHF","A: Program og Prosjektgjennomføring",5,"Capgemini Norge AS ","helsenord.no@capgemini.com"]
[{"$f":"Database!$B707&Database!$C707&Database!$D707","v":"Vest RHFA: Program og Prosjektgjennomføring6"},"Vest RHF","A: Program og Prosjektgjennomføring",6,"Deloitte AS ","noanbud@DELOITTE.no"]
[{"$f":"Database!$B708&Database!$C708&Database!$D708","v":"Vest RHFA: Program og Prosjektgjennomføring7"},"Vest RHF","A: Program og Prosjektgjennomføring",7,"Dfind Consulting AS ","consulting@dfind.no"]
[{"$f":"Database!$B709&Database!$C709&Database!$D709","v":"Vest RHFA: Program og Prosjektgjennomføring8"},"Vest RHF","A: Program og Prosjektgjennomføring",8,"Digital Workforce AS ","info@digitalworkforce.com"]
[{"$f":"Database!$B710&Database!$C710&Database!$D710","v":"Vest RHFA: Program og Prosjektgjennomføring9"},"Vest RHF","A: Program og Prosjektgjennomføring",9,"Emagine AS ","sykehusinnkjop@emagine.no"]
[{"$f":"Database!$B711&Database!$C711&Database!$D711","v":"Vest RHFA: Program og Prosjektgjennomføring10"},"Vest RHF","A: Program og Prosjektgjennomføring",10,"Ernst & Young AS ","offentlige.anskaffelser@no.ey.com"]
[{"$f":"Database!$B712&Database!$C712&Database!$D712","v":"Vest RHFA: Program og Prosjektgjennomføring11"},"Vest RHF","A: Program og Prosjektgjennomføring",11,"Ework Group Norway AS ","sykehusinnkjop@eworkgroup.com  "]
[{"$f":"Database!$B713&Database!$C713&Database!$D713","v":"Vest RHFA: Program og Prosjektgjennomføring12"},"Vest RHF","A: Program og Prosjektgjennomføring",12,"Experis AS ","sykehusinnkjop@no.experis.com"]
[{"$f":"Database!$B714&Database!$C714&Database!$D714","v":"Vest RHFA: Program og Prosjektgjennomføring13"},"Vest RHF","A: Program og Prosjektgjennomføring",13,"KPMG AS ","helse@kpmg.no"]
[{"$f":"Database!$B715&Database!$C715&Database!$D715","v":"Vest RHFA: Program og Prosjektgjennomføring14"},"Vest RHF","A: Program og Prosjektgjennomføring",14,"Metier AS ","firmapost@metier.no"]
[{"$f":"Database!$B716&Database!$C716&Database!$D716","v":"Vest RHFA: Program og Prosjektgjennomføring15"},"Vest RHF","A: Program og Prosjektgjennomføring",15,"Netcompany AS ","anbud.no@netcompany.com "]
[{"$f":"Database!$B717&Database!$C717&Database!$D717","v":"Vest RHFA: Program og Prosjektgjennomføring16"},"Vest RHF","A: Program og Prosjektgjennomføring",16,"Nordlo Grenland AS","firmapost.grenland@nordlo.com"]
[{"$f":"Database!$B718&Database!$C718&Database!$D718","v":"Vest RHFA: Program og Prosjektgjennomføring17"},"Vest RHF","A: Program og Prosjektgjennomføring",17,"PricewaterhouseCoopers AS ","no_resepsjon.oslo@pwc.com"]
[{"$f":"Database!$B719&Database!$C719&Database!$D719","v":"Vest RHFA: Program og Prosjektgjennomføring18"},"Vest RHF","A: Program og Prosjektgjennomføring",18,"Solea AS (tidl Rainfall AS )","avrop@solea.no"]
[{"$f":"Database!$B720&Database!$C720&Database!$D720","v":"Vest RHFA: Program og Prosjektgjennomføring19"},"Vest RHF","A: Program og Prosjektgjennomføring",19,"Sopra Steria AS ","helse@soprasteria.com"]
[{"$f":"Database!$B721&Database!$C721&Database!$D721","v":"Vest RHFA: Program og Prosjektgjennomføring20"},"Vest RHF","A: Program og Prosjektgjennomføring",20,"The Boston Consulting Group Nordic AB ","anbud@bcg.com"]
[{"$f":"Database!$B722&Database!$C722&Database!$D722","v":"Vest RHFA: Program og Prosjektgjennomføring21"},"Vest RHF","A: Program og Prosjektgjennomføring",21,null,""]
[{"$f":"Database!$B723&Database!$C723&Database!$D723","v":"Vest RHFA: Program og Prosjektgjennomføring22"},"Vest RHF","A: Program og Prosjektgjennomføring",22,null,""]
[{"$f":"Database!$B724&Database!$C724&Database!$D724","v":"Vest RHFA: Program og Prosjektgjennomføring23"},"Vest RHF","A: Program og Prosjektgjennomføring",23,null,""]
[{"$f":"Database!$B725&Database!$C725&Database!$D725","v":"Vest RHFA: Program og Prosjektgjennomføring24"},"Vest RHF","A: Program og Prosjektgjennomføring",24,null,""]
[{"$f":"Database!$B726&Database!$C726&Database!$D726","v":"Vest RHFA: Program og Prosjektgjennomføring25"},"Vest RHF","A: Program og Prosjektgjennomføring",25,null,""]
[{"$f":"Database!$B727&Database!$C727&Database!$D727","v":"Vest RHFA: Program og Prosjektgjennomføring26"},"Vest RHF","A: Program og Prosjektgjennomføring",26,null,""]
[{"$f":"Database!$B728&Database!$C728&Database!$D728","v":"Vest RHFA: Program og Prosjektgjennomføring27"},"Vest RHF","A: Program og Prosjektgjennomføring",27,null,""]
[{"$f":"Database!$B729&Database!$C729&Database!$D729","v":"Vest RHFA: Program og Prosjektgjennomføring28"},"Vest RHF","A: Program og Prosjektgjennomføring",28,null,""]
[{"$f":"Database!$B730&Database!$C730&Database!$D730","v":"Vest RHFA: Program og Prosjektgjennomføring29"},"Vest RHF","A: Program og Prosjektgjennomføring",29,null,""]
[{"$f":"Database!$B731&Database!$C731&Database!$D731","v":"Vest RHFA: Program og Prosjektgjennomføring30"},"Vest RHF","A: Program og Prosjektgjennomføring",30,null,""]
[{"$f":"Database!$B732&Database!$C732&Database!$D732","v":"Vest RHFA: Program og Prosjektgjennomføring31"},"Vest RHF","A: Program og Prosjektgjennomføring",31,null,""]
[{"$f":"Database!$B733&Database!$C733&Database!$D733","v":"Vest RHFA: Program og Prosjektgjennomføring32"},"Vest RHF","A: Program og Prosjektgjennomføring",32,null,""]
[{"$f":"Database!$B734&Database!$C734&Database!$D734","v":"Vest RHFA: Program og Prosjektgjennomføring33"},"Vest RHF","A: Program og Prosjektgjennomføring",33,null,""]
[{"$f":"Database!$B735&Database!$C735&Database!$D735","v":"Vest RHFA: Program og Prosjektgjennomføring34"},"Vest RHF","A: Program og Prosjektgjennomføring",34,null,""]
[null,null,null,null,null,""]
[{"$f":"Database!$B737&Database!$C737&Database!$D737","v":"Vest RHFB: Strategiplanlegging, rådgivning og innovasjon1"},"Vest RHF","B: Strategiplanlegging, rådgivning og innovasjon",1,"A-2 Norge AS","utlysninger@a-2.no"]
[{"$f":"Database!$B738&Database!$C738&Database!$D738","v":"Vest RHFB: Strategiplanlegging, rådgivning og innovasjon2"},"Vest RHF","B: Strategiplanlegging, rådgivning og innovasjon",2,"Accenture AS ","rammeavtale.helse@accenture.com"]
[{"$f":"Database!$B739&Database!$C739&Database!$D739","v":"Vest RHFB: Strategiplanlegging, rådgivning og innovasjon3"},"Vest RHF","B: Strategiplanlegging, rådgivning og innovasjon",3,"Systra Norge AS ","firmapost@systra.com"]
[{"$f":"Database!$B740&Database!$C740&Database!$D740","v":"Vest RHFB: Strategiplanlegging, rådgivning og innovasjon4"},"Vest RHF","B: Strategiplanlegging, rådgivning og innovasjon",4,"Bouvet Norge AS ","Sykehusinnkjop2023@bouvet.no"]
[{"$f":"Database!$B741&Database!$C741&Database!$D741","v":"Vest RHFB: Strategiplanlegging, rådgivning og innovasjon5"},"Vest RHF","B: Strategiplanlegging, rådgivning og innovasjon",5,"Capgemini Norge AS ","helsenord.no@capgemini.com"]
[{"$f":"Database!$B742&Database!$C742&Database!$D742","v":"Vest RHFB: Strategiplanlegging, rådgivning og innovasjon6"},"Vest RHF","B: Strategiplanlegging, rådgivning og innovasjon",6,"Deloitte AS ","noanbud@DELOITTE.no"]
[{"$f":"Database!$B743&Database!$C743&Database!$D743","v":"Vest RHFB: Strategiplanlegging, rådgivning og innovasjon7"},"Vest RHF","B: Strategiplanlegging, rådgivning og innovasjon",7,"Emagine AS ","sykehusinnkjop@emagine.no"]
[{"$f":"Database!$B744&Database!$C744&Database!$D744","v":"Vest RHFB: Strategiplanlegging, rådgivning og innovasjon8"},"Vest RHF","B: Strategiplanlegging, rådgivning og innovasjon",8,"Ernst & Young AS ","offentlige.anskaffelser@no.ey.com"]
[{"$f":"Database!$B745&Database!$C745&Database!$D745","v":"Vest RHFB: Strategiplanlegging, rådgivning og innovasjon9"},"Vest RHF","B: Strategiplanlegging, rådgivning og innovasjon",9,"Ework Group Norway AS ","sykehusinnkjop@eworkgroup.com  "]
[{"$f":"Database!$B746&Database!$C746&Database!$D746","v":"Vest RHFB: Strategiplanlegging, rådgivning og innovasjon10"},"Vest RHF","B: Strategiplanlegging, rådgivning og innovasjon",10,"Experis AS ","sykehusinnkjop@no.experis.com"]
[{"$f":"Database!$B747&Database!$C747&Database!$D747","v":"Vest RHFB: Strategiplanlegging, rådgivning og innovasjon11"},"Vest RHF","B: Strategiplanlegging, rådgivning og innovasjon",11,"HRP AS","marked@hrpas.no"]
[{"$f":"Database!$B748&Database!$C748&Database!$D748","v":"Vest RHFB: Strategiplanlegging, rådgivning og innovasjon12"},"Vest RHF","B: Strategiplanlegging, rådgivning og innovasjon",12,"KPMG AS ","helse@kpmg.no"]
[{"$f":"Database!$B749&Database!$C749&Database!$D749","v":"Vest RHFB: Strategiplanlegging, rådgivning og innovasjon13"},"Vest RHF","B: Strategiplanlegging, rådgivning og innovasjon",13,"Metier AS ","firmapost@metier.no"]
[{"$f":"Database!$B750&Database!$C750&Database!$D750","v":"Vest RHFB: Strategiplanlegging, rådgivning og innovasjon14"},"Vest RHF","B: Strategiplanlegging, rådgivning og innovasjon",14,"PricewaterhouseCoopers AS ","no_resepsjon.oslo@pwc.com"]
[{"$f":"Database!$B751&Database!$C751&Database!$D751","v":"Vest RHFB: Strategiplanlegging, rådgivning og innovasjon15"},"Vest RHF","B: Strategiplanlegging, rådgivning og innovasjon",15,"Sopra Steria AS ","helse@soprasteria.com"]
[{"$f":"Database!$B752&Database!$C752&Database!$D752","v":"Vest RHFB: Strategiplanlegging, rådgivning og innovasjon16"},"Vest RHF","B: Strategiplanlegging, rådgivning og innovasjon",16,"The Boston Consulting Group Nordic AB ","anbud@bcg.com"]
[{"$f":"Database!$B753&Database!$C753&Database!$D753","v":"Vest RHFB: Strategiplanlegging, rådgivning og innovasjon17"},"Vest RHF","B: Strategiplanlegging, rådgivning og innovasjon",17,"Advisense AS","offentlig@transcendentgroup.com "]
[{"$f":"Database!$B754&Database!$C754&Database!$D754","v":"Vest RHFB: Strategiplanlegging, rådgivning og innovasjon18"},"Vest RHF","B: Strategiplanlegging, rådgivning og innovasjon",18,null,""]
[{"$f":"Database!$B755&Database!$C755&Database!$D755","v":"Vest RHFB: Strategiplanlegging, rådgivning og innovasjon19"},"Vest RHF","B: Strategiplanlegging, rådgivning og innovasjon",19,null,""]
[{"$f":"Database!$B756&Database!$C756&Database!$D756","v":"Vest RHFB: Strategiplanlegging, rådgivning og innovasjon20"},"Vest RHF","B: Strategiplanlegging, rådgivning og innovasjon",20,null,""]
[{"$f":"Database!$B757&Database!$C757&Database!$D757","v":"Vest RHFB: Strategiplanlegging, rådgivning og innovasjon21"},"Vest RHF","B: Strategiplanlegging, rådgivning og innovasjon",21,null,""]
[{"$f":"Database!$B758&Database!$C758&Database!$D758","v":"Vest RHFB: Strategiplanlegging, rådgivning og innovasjon22"},"Vest RHF","B: Strategiplanlegging, rådgivning og innovasjon",22,null,""]
[{"$f":"Database!$B759&Database!$C759&Database!$D759","v":"Vest RHFB: Strategiplanlegging, rådgivning og innovasjon23"},"Vest RHF","B: Strategiplanlegging, rådgivning og innovasjon",23,null,""]
[{"$f":"Database!$B760&Database!$C760&Database!$D760","v":"Vest RHFB: Strategiplanlegging, rådgivning og innovasjon24"},"Vest RHF","B: Strategiplanlegging, rådgivning og innovasjon",24,null,""]
[{"$f":"Database!$B761&Database!$C761&Database!$D761","v":"Vest RHFB: Strategiplanlegging, rådgivning og innovasjon25"},"Vest RHF","B: Strategiplanlegging, rådgivning og innovasjon",25,null,""]
[{"$f":"Database!$B762&Database!$C762&Database!$D762","v":"Vest RHFB: Strategiplanlegging, rådgivning og innovasjon26"},"Vest RHF","B: Strategiplanlegging, rådgivning og innovasjon",26,null,""]
[{"$f":"Database!$B763&Database!$C763&Database!$D763","v":"Vest RHFB: Strategiplanlegging, rådgivning og innovasjon27"},"Vest RHF","B: Strategiplanlegging, rådgivning og innovasjon",27,null,""]
[{"$f":"Database!$B764&Database!$C764&Database!$D764","v":"Vest RHFB: Strategiplanlegging, rådgivning og innovasjon28"},"Vest RHF","B: Strategiplanlegging, rådgivning og innovasjon",28,null,""]
[{"$f":"Database!$B765&Database!$C765&Database!$D765","v":"Vest RHFB: Strategiplanlegging, rådgivning og innovasjon29"},"Vest RHF","B: Strategiplanlegging, rådgivning og innovasjon",29,null,""]
[{"$f":"Database!$B766&Database!$C766&Database!$D766","v":"Vest RHFB: Strategiplanlegging, rådgivning og innovasjon30"},"Vest RHF","B: Strategiplanlegging, rådgivning og innovasjon",30,null,""]
[{"$f":"Database!$B767&Database!$C767&Database!$D767","v":"Vest RHFB: Strategiplanlegging, rådgivning og innovasjon31"},"Vest RHF","B: Strategiplanlegging, rådgivning og innovasjon",31,null,""]
[{"$f":"Database!$B768&Database!$C768&Database!$D768","v":"Vest RHFB: Strategiplanlegging, rådgivning og innovasjon32"},"Vest RHF","B: Strategiplanlegging, rådgivning og innovasjon",32,null,""]
[{"$f":"Database!$B769&Database!$C769&Database!$D769","v":"Vest RHFB: Strategiplanlegging, rådgivning og innovasjon33"},"Vest RHF","B: Strategiplanlegging, rådgivning og innovasjon",33,null,""]
[{"$f":"Database!$B770&Database!$C770&Database!$D770","v":"Vest RHFB: Strategiplanlegging, rådgivning og innovasjon34"},"Vest RHF","B: Strategiplanlegging, rådgivning og innovasjon",34,null,""]
[null,null,null,null,null,""]
[{"$f":"Database!$B772&Database!$C772&Database!$D772","v":"Vest RHFC: Arkitektur1"},"Vest RHF","C: Arkitektur",1,"A-2 Norge AS","utlysninger@a-2.no"]
[{"$f":"Database!$B773&Database!$C773&Database!$D773","v":"Vest RHFC: Arkitektur2"},"Vest RHF","C: Arkitektur",2,"Accenture AS ","rammeavtale.helse@accenture.com"]
[{"$f":"Database!$B774&Database!$C774&Database!$D774","v":"Vest RHFC: Arkitektur3"},"Vest RHF","C: Arkitektur",3,"Systra Norge AS ","firmapost@systra.com"]
[{"$f":"Database!$B775&Database!$C775&Database!$D775","v":"Vest RHFC: Arkitektur4"},"Vest RHF","C: Arkitektur",4,"Bouvet Norge AS ","Sykehusinnkjop2023@bouvet.no"]
[{"$f":"Database!$B776&Database!$C776&Database!$D776","v":"Vest RHFC: Arkitektur5"},"Vest RHF","C: Arkitektur",5,"Capgemini Norge AS ","helsenord.no@capgemini.com"]
[{"$f":"Database!$B777&Database!$C777&Database!$D777","v":"Vest RHFC: Arkitektur6"},"Vest RHF","C: Arkitektur",6,"Deloitte AS ","noanbud@DELOITTE.no"]
[{"$f":"Database!$B778&Database!$C778&Database!$D778","v":"Vest RHFC: Arkitektur7"},"Vest RHF","C: Arkitektur",7,"Dfind Consulting AS ","consulting@dfind.no"]
[{"$f":"Database!$B779&Database!$C779&Database!$D779","v":"Vest RHFC: Arkitektur8"},"Vest RHF","C: Arkitektur",8,"Emagine AS ","sykehusinnkjop@emagine.no"]
[{"$f":"Database!$B780&Database!$C780&Database!$D780","v":"Vest RHFC: Arkitektur9"},"Vest RHF","C: Arkitektur",9,"Ernst & Young AS ","offentlige.anskaffelser@no.ey.com"]
[{"$f":"Database!$B781&Database!$C781&Database!$D781","v":"Vest RHFC: Arkitektur10"},"Vest RHF","C: Arkitektur",10,"Ework Group Norway AS ","sykehusinnkjop@eworkgroup.com  "]
[{"$f":"Database!$B782&Database!$C782&Database!$D782","v":"Vest RHFC: Arkitektur11"},"Vest RHF","C: Arkitektur",11,"Experis AS ","sykehusinnkjop@no.experis.com"]
[{"$f":"Database!$B783&Database!$C783&Database!$D783","v":"Vest RHFC: Arkitektur12"},"Vest RHF","C: Arkitektur",12,"HRP AS","marked@hrpas.no"]
[{"$f":"Database!$B784&Database!$C784&Database!$D784","v":"Vest RHFC: Arkitektur13"},"Vest RHF","C: Arkitektur",13,"Implement Consulting Group AS ","tender@implement.dk"]
[{"$f":"Database!$B785&Database!$C785&Database!$D785","v":"Vest RHFC: Arkitektur14"},"Vest RHF","C: Arkitektur",14,"IT Consult AS ","firmapost@itc.no"]
[{"$f":"Database!$B786&Database!$C786&Database!$D786","v":"Vest RHFC: Arkitektur15"},"Vest RHF","C: Arkitektur",15,"KPMG AS ","helse@kpmg.no"]
[{"$f":"Database!$B787&Database!$C787&Database!$D787","v":"Vest RHFC: Arkitektur16"},"Vest RHF","C: Arkitektur",16,"Netcompany AS ","anbud.no@netcompany.com "]
[{"$f":"Database!$B788&Database!$C788&Database!$D788","v":"Vest RHFC: Arkitektur17"},"Vest RHF","C: Arkitektur",17,"Nordlo Grenland AS","firmapost.grenland@nordlo.com"]
[{"$f":"Database!$B789&Database!$C789&Database!$D789","v":"Vest RHFC: Arkitektur18"},"Vest RHF","C: Arkitektur",18,"Nimtech Consult AS ","oppdrag@nimtech.no"]
[{"$f":"Database!$B790&Database!$C790&Database!$D790","v":"Vest RHFC: Arkitektur19"},"Vest RHF","C: Arkitektur",19,"PricewaterhouseCoopers AS ","no_resepsjon.oslo@pwc.com"]
[{"$f":"Database!$B791&Database!$C791&Database!$D791","v":"Vest RHFC: Arkitektur20"},"Vest RHF","C: Arkitektur",20,"Solea AS (tidl Rainfall AS )","avrop@solea.no"]
[{"$f":"Database!$B792&Database!$C792&Database!$D792","v":"Vest RHFC: Arkitektur21"},"Vest RHF","C: Arkitektur",21,"Sopra Steria AS ","helse@soprasteria.com"]
[{"$f":"Database!$B793&Database!$C793&Database!$D793","v":"Vest RHFC: Arkitektur22"},"Vest RHF","C: Arkitektur",22,"The Boston Consulting Group Nordic AB ","anbud@bcg.com"]
[{"$f":"Database!$B794&Database!$C794&Database!$D794","v":"Vest RHFC: Arkitektur23"},"Vest RHF","C: Arkitektur",23,null,""]
[{"$f":"Database!$B795&Database!$C795&Database!$D795","v":"Vest RHFC: Arkitektur24"},"Vest RHF","C: Arkitektur",24,null,""]
[{"$f":"Database!$B796&Database!$C796&Database!$D796","v":"Vest RHFC: Arkitektur25"},"Vest RHF","C: Arkitektur",25,null,""]
[{"$f":"Database!$B797&Database!$C797&Database!$D797","v":"Vest RHFC: Arkitektur26"},"Vest RHF","C: Arkitektur",26,null,""]
[{"$f":"Database!$B798&Database!$C798&Database!$D798","v":"Vest RHFC: Arkitektur27"},"Vest RHF","C: Arkitektur",27,null,""]
[{"$f":"Database!$B799&Database!$C799&Database!$D799","v":"Vest RHFC: Arkitektur28"},"Vest RHF","C: Arkitektur",28,null,""]
[{"$f":"Database!$B800&Database!$C800&Database!$D800","v":"Vest RHFC: Arkitektur29"},"Vest RHF","C: Arkitektur",29,null,""]
[{"$f":"Database!$B801&Database!$C801&Database!$D801","v":"Vest RHFC: Arkitektur30"},"Vest RHF","C: Arkitektur",30,null,""]
[{"$f":"Database!$B802&Database!$C802&Database!$D802","v":"Vest RHFC: Arkitektur31"},"Vest RHF","C: Arkitektur",31,null,""]
[{"$f":"Database!$B803&Database!$C803&Database!$D803","v":"Vest RHFC: Arkitektur32"},"Vest RHF","C: Arkitektur",32,null,""]
[{"$f":"Database!$B804&Database!$C804&Database!$D804","v":"Vest RHFC: Arkitektur33"},"Vest RHF","C: Arkitektur",33,null,""]
[{"$f":"Database!$B805&Database!$C805&Database!$D805","v":"Vest RHFC: Arkitektur34"},"Vest RHF","C: Arkitektur",34,null,""]
[null,null,null,null,null,""]
[{"$f":"Database!$B807&Database!$C807&Database!$D807","v":"Vest RHFD: Informasjonssikkerhet og ROS-analyser1"},"Vest RHF","D: Informasjonssikkerhet og ROS-analyser",1,"A-2 Norge AS","utlysninger@a-2.no"]
[{"$f":"Database!$B808&Database!$C808&Database!$D808","v":"Vest RHFD: Informasjonssikkerhet og ROS-analyser2"},"Vest RHF","D: Informasjonssikkerhet og ROS-analyser",2,"Accenture AS ","rammeavtale.helse@accenture.com"]
[{"$f":"Database!$B809&Database!$C809&Database!$D809","v":"Vest RHFD: Informasjonssikkerhet og ROS-analyser3"},"Vest RHF","D: Informasjonssikkerhet og ROS-analyser",3,"Systra Norge AS ","firmapost@systra.com"]
[{"$f":"Database!$B810&Database!$C810&Database!$D810","v":"Vest RHFD: Informasjonssikkerhet og ROS-analyser4"},"Vest RHF","D: Informasjonssikkerhet og ROS-analyser",4,"Bouvet Norge AS ","Sykehusinnkjop2023@bouvet.no"]
[{"$f":"Database!$B811&Database!$C811&Database!$D811","v":"Vest RHFD: Informasjonssikkerhet og ROS-analyser5"},"Vest RHF","D: Informasjonssikkerhet og ROS-analyser",5,"Capgemini Norge AS ","helsenord.no@capgemini.com"]
[{"$f":"Database!$B812&Database!$C812&Database!$D812","v":"Vest RHFD: Informasjonssikkerhet og ROS-analyser6"},"Vest RHF","D: Informasjonssikkerhet og ROS-analyser",6,"Deloitte AS ","noanbud@DELOITTE.no"]
[{"$f":"Database!$B813&Database!$C813&Database!$D813","v":"Vest RHFD: Informasjonssikkerhet og ROS-analyser7"},"Vest RHF","D: Informasjonssikkerhet og ROS-analyser",7,"Emagine AS ","sykehusinnkjop@emagine.no"]
[{"$f":"Database!$B814&Database!$C814&Database!$D814","v":"Vest RHFD: Informasjonssikkerhet og ROS-analyser8"},"Vest RHF","D: Informasjonssikkerhet og ROS-analyser",8,"Ernst & Young AS ","offentlige.anskaffelser@no.ey.com"]
[{"$f":"Database!$B815&Database!$C815&Database!$D815","v":"Vest RHFD: Informasjonssikkerhet og ROS-analyser9"},"Vest RHF","D: Informasjonssikkerhet og ROS-analyser",9,"Ework Group Norway AS ","sykehusinnkjop@eworkgroup.com  "]
[{"$f":"Database!$B816&Database!$C816&Database!$D816","v":"Vest RHFD: Informasjonssikkerhet og ROS-analyser10"},"Vest RHF","D: Informasjonssikkerhet og ROS-analyser",10,"Experis AS ","sykehusinnkjop@no.experis.com"]
[{"$f":"Database!$B817&Database!$C817&Database!$D817","v":"Vest RHFD: Informasjonssikkerhet og ROS-analyser11"},"Vest RHF","D: Informasjonssikkerhet og ROS-analyser",11,"HRP AS","marked@hrpas.no"]
[{"$f":"Database!$B818&Database!$C818&Database!$D818","v":"Vest RHFD: Informasjonssikkerhet og ROS-analyser12"},"Vest RHF","D: Informasjonssikkerhet og ROS-analyser",12,"Implement Consulting Group AS ","tender@implement.dk"]
[{"$f":"Database!$B819&Database!$C819&Database!$D819","v":"Vest RHFD: Informasjonssikkerhet og ROS-analyser13"},"Vest RHF","D: Informasjonssikkerhet og ROS-analyser",13,"IT Consult AS ","firmapost@itc.no"]
[{"$f":"Database!$B820&Database!$C820&Database!$D820","v":"Vest RHFD: Informasjonssikkerhet og ROS-analyser14"},"Vest RHF","D: Informasjonssikkerhet og ROS-analyser",14,"KPMG AS ","helse@kpmg.no"]
[{"$f":"Database!$B821&Database!$C821&Database!$D821","v":"Vest RHFD: Informasjonssikkerhet og ROS-analyser15"},"Vest RHF","D: Informasjonssikkerhet og ROS-analyser",15,"Move AS","konsulentledelse@move.no"]
[{"$f":"Database!$B822&Database!$C822&Database!$D822","v":"Vest RHFD: Informasjonssikkerhet og ROS-analyser16"},"Vest RHF","D: Informasjonssikkerhet og ROS-analyser",16,"PricewaterhouseCoopers AS ","no_resepsjon.oslo@pwc.com"]
[{"$f":"Database!$B823&Database!$C823&Database!$D823","v":"Vest RHFD: Informasjonssikkerhet og ROS-analyser17"},"Vest RHF","D: Informasjonssikkerhet og ROS-analyser",17,"Sopra Steria AS ","helse@soprasteria.com"]
[{"$f":"Database!$B824&Database!$C824&Database!$D824","v":"Vest RHFD: Informasjonssikkerhet og ROS-analyser18"},"Vest RHF","D: Informasjonssikkerhet og ROS-analyser",18,"Advisense AS","offentlig@transcendentgroup.com "]
[{"$f":"Database!$B825&Database!$C825&Database!$D825","v":"Vest RHFD: Informasjonssikkerhet og ROS-analyser19"},"Vest RHF","D: Informasjonssikkerhet og ROS-analyser",19,null,""]
[{"$f":"Database!$B826&Database!$C826&Database!$D826","v":"Vest RHFD: Informasjonssikkerhet og ROS-analyser20"},"Vest RHF","D: Informasjonssikkerhet og ROS-analyser",20,null,""]
[{"$f":"Database!$B827&Database!$C827&Database!$D827","v":"Vest RHFD: Informasjonssikkerhet og ROS-analyser21"},"Vest RHF","D: Informasjonssikkerhet og ROS-analyser",21,null,""]
[{"$f":"Database!$B828&Database!$C828&Database!$D828","v":"Vest RHFD: Informasjonssikkerhet og ROS-analyser22"},"Vest RHF","D: Informasjonssikkerhet og ROS-analyser",22,null,""]
[{"$f":"Database!$B829&Database!$C829&Database!$D829","v":"Vest RHFD: Informasjonssikkerhet og ROS-analyser23"},"Vest RHF","D: Informasjonssikkerhet og ROS-analyser",23,null,""]
[{"$f":"Database!$B830&Database!$C830&Database!$D830","v":"Vest RHFD: Informasjonssikkerhet og ROS-analyser24"},"Vest RHF","D: Informasjonssikkerhet og ROS-analyser",24,null,""]
[{"$f":"Database!$B831&Database!$C831&Database!$D831","v":"Vest RHFD: Informasjonssikkerhet og ROS-analyser25"},"Vest RHF","D: Informasjonssikkerhet og ROS-analyser",25,null,""]
[{"$f":"Database!$B832&Database!$C832&Database!$D832","v":"Vest RHFD: Informasjonssikkerhet og ROS-analyser26"},"Vest RHF","D: Informasjonssikkerhet og ROS-analyser",26,null,""]
[{"$f":"Database!$B833&Database!$C833&Database!$D833","v":"Vest RHFD: Informasjonssikkerhet og ROS-analyser27"},"Vest RHF","D: Informasjonssikkerhet og ROS-analyser",27,null,""]
[{"$f":"Database!$B834&Database!$C834&Database!$D834","v":"Vest RHFD: Informasjonssikkerhet og ROS-analyser28"},"Vest RHF","D: Informasjonssikkerhet og ROS-analyser",28,null,""]
[{"$f":"Database!$B835&Database!$C835&Database!$D835","v":"Vest RHFD: Informasjonssikkerhet og ROS-analyser29"},"Vest RHF","D: Informasjonssikkerhet og ROS-analyser",29,null,""]
[{"$f":"Database!$B836&Database!$C836&Database!$D836","v":"Vest RHFD: Informasjonssikkerhet og ROS-analyser30"},"Vest RHF","D: Informasjonssikkerhet og ROS-analyser",30,null,""]
[{"$f":"Database!$B837&Database!$C837&Database!$D837","v":"Vest RHFD: Informasjonssikkerhet og ROS-analyser31"},"Vest RHF","D: Informasjonssikkerhet og ROS-analyser",31,null,""]
[{"$f":"Database!$B838&Database!$C838&Database!$D838","v":"Vest RHFD: Informasjonssikkerhet og ROS-analyser32"},"Vest RHF","D: Informasjonssikkerhet og ROS-analyser",32,null,""]
[{"$f":"Database!$B839&Database!$C839&Database!$D839","v":"Vest RHFD: Informasjonssikkerhet og ROS-analyser33"},"Vest RHF","D: Informasjonssikkerhet og ROS-analyser",33,null,""]
[{"$f":"Database!$B840&Database!$C840&Database!$D840","v":"Vest RHFD: Informasjonssikkerhet og ROS-analyser34"},"Vest RHF","D: Informasjonssikkerhet og ROS-analyser",34,null,""]
[null,null,null,null,null,""]
[{"$f":"Database!$B842&Database!$C842&Database!$D842","v":"Vest RHFE: Test og release1"},"Vest RHF","E: Test og release",1,"A-2 Norge AS","utlysninger@a-2.no"]
[{"$f":"Database!$B843&Database!$C843&Database!$D843","v":"Vest RHFE: Test og release2"},"Vest RHF","E: Test og release",2,"Aboveit AS ","salg@aboveit.no "]
[{"$f":"Database!$B844&Database!$C844&Database!$D844","v":"Vest RHFE: Test og release3"},"Vest RHF","E: Test og release",3,"Accenture AS ","rammeavtale.helse@accenture.com"]
[{"$f":"Database!$B845&Database!$C845&Database!$D845","v":"Vest RHFE: Test og release4"},"Vest RHF","E: Test og release",4,"Systra Norge AS ","firmapost@systra.com"]
[{"$f":"Database!$B846&Database!$C846&Database!$D846","v":"Vest RHFE: Test og release5"},"Vest RHF","E: Test og release",5,"Bouvet Norge AS ","Sykehusinnkjop2023@bouvet.no"]
[{"$f":"Database!$B847&Database!$C847&Database!$D847","v":"Vest RHFE: Test og release6"},"Vest RHF","E: Test og release",6,"Capgemini Norge AS ","helsenord.no@capgemini.com"]
[{"$f":"Database!$B848&Database!$C848&Database!$D848","v":"Vest RHFE: Test og release7"},"Vest RHF","E: Test og release",7,"Deloitte AS ","noanbud@DELOITTE.no"]
[{"$f":"Database!$B849&Database!$C849&Database!$D849","v":"Vest RHFE: Test og release8"},"Vest RHF","E: Test og release",8,"Emagine AS ","sykehusinnkjop@emagine.no"]
[{"$f":"Database!$B850&Database!$C850&Database!$D850","v":"Vest RHFE: Test og release9"},"Vest RHF","E: Test og release",9,"Ernst & Young AS ","offentlige.anskaffelser@no.ey.com"]
[{"$f":"Database!$B851&Database!$C851&Database!$D851","v":"Vest RHFE: Test og release10"},"Vest RHF","E: Test og release",10,"Ework Group Norway AS ","sykehusinnkjop@eworkgroup.com  "]
[{"$f":"Database!$B852&Database!$C852&Database!$D852","v":"Vest RHFE: Test og release11"},"Vest RHF","E: Test og release",11,"Experis AS ","sykehusinnkjop@no.experis.com"]
[{"$f":"Database!$B853&Database!$C853&Database!$D853","v":"Vest RHFE: Test og release12"},"Vest RHF","E: Test og release",12,"HRP AS","marked@hrpas.no"]
[{"$f":"Database!$B854&Database!$C854&Database!$D854","v":"Vest RHFE: Test og release13"},"Vest RHF","E: Test og release",13,"Implement Consulting Group AS ","tender@implement.dk"]
[{"$f":"Database!$B855&Database!$C855&Database!$D855","v":"Vest RHFE: Test og release14"},"Vest RHF","E: Test og release",14,"IT Consult AS ","firmapost@itc.no"]
[{"$f":"Database!$B856&Database!$C856&Database!$D856","v":"Vest RHFE: Test og release15"},"Vest RHF","E: Test og release",15,"Netcompany AS ","anbud.no@netcompany.com "]
[{"$f":"Database!$B857&Database!$C857&Database!$D857","v":"Vest RHFE: Test og release16"},"Vest RHF","E: Test og release",16,"Nordlo Grenland AS","firmapost.grenland@nordlo.com"]
[{"$f":"Database!$B858&Database!$C858&Database!$D858","v":"Vest RHFE: Test og release17"},"Vest RHF","E: Test og release",17,"PricewaterhouseCoopers AS ","no_resepsjon.oslo@pwc.com"]
[{"$f":"Database!$B859&Database!$C859&Database!$D859","v":"Vest RHFE: Test og release18"},"Vest RHF","E: Test og release",18,"Solea AS (tidl Rainfall AS )","avrop@solea.no"]
[{"$f":"Database!$B860&Database!$C860&Database!$D860","v":"Vest RHFE: Test og release19"},"Vest RHF","E: Test og release",19,"SOCO Norge AS ","post@soco.no"]
[{"$f":"Database!$B861&Database!$C861&Database!$D861","v":"Vest RHFE: Test og release20"},"Vest RHF","E: Test og release",20,"Sopra Steria AS ","helse@soprasteria.com"]
[{"$f":"Database!$B862&Database!$C862&Database!$D862","v":"Vest RHFE: Test og release21"},"Vest RHF","E: Test og release",21,null,""]
[{"$f":"Database!$B863&Database!$C863&Database!$D863","v":"Vest RHFE: Test og release22"},"Vest RHF","E: Test og release",22,null,""]
[{"$f":"Database!$B864&Database!$C864&Database!$D864","v":"Vest RHFE: Test og release23"},"Vest RHF","E: Test og release",23,null,""]
[{"$f":"Database!$B865&Database!$C865&Database!$D865","v":"Vest RHFE: Test og release24"},"Vest RHF","E: Test og release",24,null,""]
[{"$f":"Database!$B866&Database!$C866&Database!$D866","v":"Vest RHFE: Test og release25"},"Vest RHF","E: Test og release",25,null,""]
[{"$f":"Database!$B867&Database!$C867&Database!$D867","v":"Vest RHFE: Test og release26"},"Vest RHF","E: Test og release",26,null,""]
[{"$f":"Database!$B868&Database!$C868&Database!$D868","v":"Vest RHFE: Test og release27"},"Vest RHF","E: Test og release",27,null,""]
[{"$f":"Database!$B869&Database!$C869&Database!$D869","v":"Vest RHFE: Test og release28"},"Vest RHF","E: Test og release",28,null,""]
[{"$f":"Database!$B870&Database!$C870&Database!$D870","v":"Vest RHFE: Test og release29"},"Vest RHF","E: Test og release",29,null,""]
[{"$f":"Database!$B871&Database!$C871&Database!$D871","v":"Vest RHFE: Test og release30"},"Vest RHF","E: Test og release",30,null,""]
[{"$f":"Database!$B872&Database!$C872&Database!$D872","v":"Vest RHFE: Test og release31"},"Vest RHF","E: Test og release",31,null,""]
[{"$f":"Database!$B873&Database!$C873&Database!$D873","v":"Vest RHFE: Test og release32"},"Vest RHF","E: Test og release",32,null,""]
[{"$f":"Database!$B874&Database!$C874&Database!$D874","v":"Vest RHFE: Test og release33"},"Vest RHF","E: Test og release",33,null,""]
[{"$f":"Database!$B875&Database!$C875&Database!$D875","v":"Vest RHFE: Test og release34"},"Vest RHF","E: Test og release",34,null,""]
[null,null,null,null,null,""]
[{"$f":"Database!$B877&Database!$C877&Database!$D877","v":"Vest RHFF: Systemutvikling1"},"Vest RHF","F: Systemutvikling",1,"A-2 Norge AS","utlysninger@a-2.no"]
[{"$f":"Database!$B878&Database!$C878&Database!$D878","v":"Vest RHFF: Systemutvikling2"},"Vest RHF","F: Systemutvikling",2,"Aboveit AS ","salg@aboveit.no "]
[{"$f":"Database!$B879&Database!$C879&Database!$D879","v":"Vest RHFF: Systemutvikling3"},"Vest RHF","F: Systemutvikling",3,"Accenture AS ","rammeavtale.helse@accenture.com"]
[{"$f":"Database!$B880&Database!$C880&Database!$D880","v":"Vest RHFF: Systemutvikling4"},"Vest RHF","F: Systemutvikling",4,"Systra Norge AS ","firmapost@systra.com"]
[{"$f":"Database!$B881&Database!$C881&Database!$D881","v":"Vest RHFF: Systemutvikling5"},"Vest RHF","F: Systemutvikling",5,"Bouvet Norge AS ","Sykehusinnkjop2023@bouvet.no"]
[{"$f":"Database!$B882&Database!$C882&Database!$D882","v":"Vest RHFF: Systemutvikling6"},"Vest RHF","F: Systemutvikling",6,"Capgemini Norge AS ","helsenord.no@capgemini.com"]
[{"$f":"Database!$B883&Database!$C883&Database!$D883","v":"Vest RHFF: Systemutvikling7"},"Vest RHF","F: Systemutvikling",7,"CGI Norge AS ","avrop@cgi.com"]
[{"$f":"Database!$B884&Database!$C884&Database!$D884","v":"Vest RHFF: Systemutvikling8"},"Vest RHF","F: Systemutvikling",8,"Dfind Consulting AS ","consulting@dfind.no"]
[{"$f":"Database!$B885&Database!$C885&Database!$D885","v":"Vest RHFF: Systemutvikling9"},"Vest RHF","F: Systemutvikling",9,"Digital Workforce AS ","info@digitalworkforce.com"]
[{"$f":"Database!$B886&Database!$C886&Database!$D886","v":"Vest RHFF: Systemutvikling10"},"Vest RHF","F: Systemutvikling",10,"Emagine AS ","sykehusinnkjop@emagine.no"]
[{"$f":"Database!$B887&Database!$C887&Database!$D887","v":"Vest RHFF: Systemutvikling11"},"Vest RHF","F: Systemutvikling",11,"Ernst & Young AS ","offentlige.anskaffelser@no.ey.com"]
[{"$f":"Database!$B888&Database!$C888&Database!$D888","v":"Vest RHFF: Systemutvikling12"},"Vest RHF","F: Systemutvikling",12,"Ework Group Norway AS ","sykehusinnkjop@eworkgroup.com  "]
[{"$f":"Database!$B889&Database!$C889&Database!$D889","v":"Vest RHFF: Systemutvikling13"},"Vest RHF","F: Systemutvikling",13,"Experis AS ","sykehusinnkjop@no.experis.com"]
[{"$f":"Database!$B890&Database!$C890&Database!$D890","v":"Vest RHFF: Systemutvikling14"},"Vest RHF","F: Systemutvikling",14,"IT Consult AS ","firmapost@itc.no"]
[{"$f":"Database!$B891&Database!$C891&Database!$D891","v":"Vest RHFF: Systemutvikling15"},"Vest RHF","F: Systemutvikling",15,"KPMG AS ","helse@kpmg.no"]
[{"$f":"Database!$B892&Database!$C892&Database!$D892","v":"Vest RHFF: Systemutvikling16"},"Vest RHF","F: Systemutvikling",16,"Netcompany AS ","anbud.no@netcompany.com "]
[{"$f":"Database!$B893&Database!$C893&Database!$D893","v":"Vest RHFF: Systemutvikling17"},"Vest RHF","F: Systemutvikling",17,"NetNordic Norway AS ","salg@netnordic.no"]
[{"$f":"Database!$B894&Database!$C894&Database!$D894","v":"Vest RHFF: Systemutvikling18"},"Vest RHF","F: Systemutvikling",18,"Solea AS (tidl Rainfall AS )","avrop@solea.no"]
[{"$f":"Database!$B895&Database!$C895&Database!$D895","v":"Vest RHFF: Systemutvikling19"},"Vest RHF","F: Systemutvikling",19,"Sopra Steria AS ","helse@soprasteria.com"]
[{"$f":"Database!$B896&Database!$C896&Database!$D896","v":"Vest RHFF: Systemutvikling20"},"Vest RHF","F: Systemutvikling",20,"Twoday Conceptos AS ","salg.conceptos@twoday.com"]
[{"$f":"Database!$B897&Database!$C897&Database!$D897","v":"Vest RHFF: Systemutvikling21"},"Vest RHF","F: Systemutvikling",21,null,""]
[{"$f":"Database!$B898&Database!$C898&Database!$D898","v":"Vest RHFF: Systemutvikling22"},"Vest RHF","F: Systemutvikling",22,null,""]
[{"$f":"Database!$B899&Database!$C899&Database!$D899","v":"Vest RHFF: Systemutvikling23"},"Vest RHF","F: Systemutvikling",23,null,""]
[{"$f":"Database!$B900&Database!$C900&Database!$D900","v":"Vest RHFF: Systemutvikling24"},"Vest RHF","F: Systemutvikling",24,null,""]
[{"$f":"Database!$B901&Database!$C901&Database!$D901","v":"Vest RHFF: Systemutvikling25"},"Vest RHF","F: Systemutvikling",25,null,""]
[{"$f":"Database!$B902&Database!$C902&Database!$D902","v":"Vest RHFF: Systemutvikling26"},"Vest RHF","F: Systemutvikling",26,null,""]
[{"$f":"Database!$B903&Database!$C903&Database!$D903","v":"Vest RHFF: Systemutvikling27"},"Vest RHF","F: Systemutvikling",27,null,""]
[{"$f":"Database!$B904&Database!$C904&Database!$D904","v":"Vest RHFF: Systemutvikling28"},"Vest RHF","F: Systemutvikling",28,null,""]
[{"$f":"Database!$B905&Database!$C905&Database!$D905","v":"Vest RHFF: Systemutvikling29"},"Vest RHF","F: Systemutvikling",29,null,""]
[{"$f":"Database!$B906&Database!$C906&Database!$D906","v":"Vest RHFF: Systemutvikling30"},"Vest RHF","F: Systemutvikling",30,null,""]
[{"$f":"Database!$B907&Database!$C907&Database!$D907","v":"Vest RHFF: Systemutvikling31"},"Vest RHF","F: Systemutvikling",31,null,""]
[{"$f":"Database!$B908&Database!$C908&Database!$D908","v":"Vest RHFF: Systemutvikling32"},"Vest RHF","F: Systemutvikling",32,null,""]
[{"$f":"Database!$B909&Database!$C909&Database!$D909","v":"Vest RHFF: Systemutvikling33"},"Vest RHF","F: Systemutvikling",33,null,""]
[{"$f":"Database!$B910&Database!$C910&Database!$D910","v":"Vest RHFF: Systemutvikling34"},"Vest RHF","F: Systemutvikling",34,null,""]
[null,null,null,null,null,""]
[{"$f":"Database!$B912&Database!$C912&Database!$D912","v":"Vest RHFG: Applikasjonsforvaltning, drift og forvaltning av IT-systemer og plattformer1"},"Vest RHF","G: Applikasjonsforvaltning, drift og forvaltning av IT-systemer og plattformer",1,"A-2 Norge AS","utlysninger@a-2.no"]
[{"$f":"Database!$B913&Database!$C913&Database!$D913","v":"Vest RHFG: Applikasjonsforvaltning, drift og forvaltning av IT-systemer og plattformer2"},"Vest RHF","G: Applikasjonsforvaltning, drift og forvaltning av IT-systemer og plattformer",2,"Bouvet Norge AS ","Sykehusinnkjop2023@bouvet.no"]
[{"$f":"Database!$B914&Database!$C914&Database!$D914","v":"Vest RHFG: Applikasjonsforvaltning, drift og forvaltning av IT-systemer og plattformer3"},"Vest RHF","G: Applikasjonsforvaltning, drift og forvaltning av IT-systemer og plattformer",3,"Capgemini Norge AS ","helsenord.no@capgemini.com"]
[{"$f":"Database!$B915&Database!$C915&Database!$D915","v":"Vest RHFG: Applikasjonsforvaltning, drift og forvaltning av IT-systemer og plattformer4"},"Vest RHF","G: Applikasjonsforvaltning, drift og forvaltning av IT-systemer og plattformer",4,"CGI Norge AS ","avrop@cgi.com"]
[{"$f":"Database!$B916&Database!$C916&Database!$D916","v":"Vest RHFG: Applikasjonsforvaltning, drift og forvaltning av IT-systemer og plattformer5"},"Vest RHF","G: Applikasjonsforvaltning, drift og forvaltning av IT-systemer og plattformer",5,"Crayon AS ","firmapost@crayon.com"]
[{"$f":"Database!$B917&Database!$C917&Database!$D917","v":"Vest RHFG: Applikasjonsforvaltning, drift og forvaltning av IT-systemer og plattformer6"},"Vest RHF","G: Applikasjonsforvaltning, drift og forvaltning av IT-systemer og plattformer",6,"Emagine AS ","sykehusinnkjop@emagine.no"]
[{"$f":"Database!$B918&Database!$C918&Database!$D918","v":"Vest RHFG: Applikasjonsforvaltning, drift og forvaltning av IT-systemer og plattformer7"},"Vest RHF","G: Applikasjonsforvaltning, drift og forvaltning av IT-systemer og plattformer",7,"Ernst & Young AS ","offentlige.anskaffelser@no.ey.com"]
[{"$f":"Database!$B919&Database!$C919&Database!$D919","v":"Vest RHFG: Applikasjonsforvaltning, drift og forvaltning av IT-systemer og plattformer8"},"Vest RHF","G: Applikasjonsforvaltning, drift og forvaltning av IT-systemer og plattformer",8,"Ework Group Norway AS ","sykehusinnkjop@eworkgroup.com  "]
[{"$f":"Database!$B920&Database!$C920&Database!$D920","v":"Vest RHFG: Applikasjonsforvaltning, drift og forvaltning av IT-systemer og plattformer9"},"Vest RHF","G: Applikasjonsforvaltning, drift og forvaltning av IT-systemer og plattformer",9,"Experis AS ","sykehusinnkjop@no.experis.com"]
[{"$f":"Database!$B921&Database!$C921&Database!$D921","v":"Vest RHFG: Applikasjonsforvaltning, drift og forvaltning av IT-systemer og plattformer10"},"Vest RHF","G: Applikasjonsforvaltning, drift og forvaltning av IT-systemer og plattformer",10,"HRP AS","marked@hrpas.no"]
[{"$f":"Database!$B922&Database!$C922&Database!$D922","v":"Vest RHFG: Applikasjonsforvaltning, drift og forvaltning av IT-systemer og plattformer11"},"Vest RHF","G: Applikasjonsforvaltning, drift og forvaltning av IT-systemer og plattformer",11,"IT Consult AS ","firmapost@itc.no"]
[{"$f":"Database!$B923&Database!$C923&Database!$D923","v":"Vest RHFG: Applikasjonsforvaltning, drift og forvaltning av IT-systemer og plattformer12"},"Vest RHF","G: Applikasjonsforvaltning, drift og forvaltning av IT-systemer og plattformer",12,"Move AS","konsulentledelse@move.no"]
[{"$f":"Database!$B924&Database!$C924&Database!$D924","v":"Vest RHFG: Applikasjonsforvaltning, drift og forvaltning av IT-systemer og plattformer13"},"Vest RHF","G: Applikasjonsforvaltning, drift og forvaltning av IT-systemer og plattformer",13,"Netcompany AS ","anbud.no@netcompany.com "]
[{"$f":"Database!$B925&Database!$C925&Database!$D925","v":"Vest RHFG: Applikasjonsforvaltning, drift og forvaltning av IT-systemer og plattformer14"},"Vest RHF","G: Applikasjonsforvaltning, drift og forvaltning av IT-systemer og plattformer",14,"Nordlo Grenland AS","firmapost.grenland@nordlo.com"]
[{"$f":"Database!$B926&Database!$C926&Database!$D926","v":"Vest RHFG: Applikasjonsforvaltning, drift og forvaltning av IT-systemer og plattformer15"},"Vest RHF","G: Applikasjonsforvaltning, drift og forvaltning av IT-systemer og plattformer",15,"Proact IT Norge AS ","bestilling@proact.no "]
[{"$f":"Database!$B927&Database!$C927&Database!$D927","v":"Vest RHFG: Applikasjonsforvaltning, drift og forvaltning av IT-systemer og plattformer16"},"Vest RHF","G: Applikasjonsforvaltning, drift og forvaltning av IT-systemer og plattformer",16,"Sopra Steria AS ","helse@soprasteria.com"]
[{"$f":"Database!$B928&Database!$C928&Database!$D928","v":"Vest RHFG: Applikasjonsforvaltning, drift og forvaltning av IT-systemer og plattformer17"},"Vest RHF","G: Applikasjonsforvaltning, drift og forvaltning av IT-systemer og plattformer",17,null,""]
[{"$f":"Database!$B929&Database!$C929&Database!$D929","v":"Vest RHFG: Applikasjonsforvaltning, drift og forvaltning av IT-systemer og plattformer18"},"Vest RHF","G: Applikasjonsforvaltning, drift og forvaltning av IT-systemer og plattformer",18,null,""]
[{"$f":"Database!$B930&Database!$C930&Database!$D930","v":"Vest RHFG: Applikasjonsforvaltning, drift og forvaltning av IT-systemer og plattformer19"},"Vest RHF","G: Applikasjonsforvaltning, drift og forvaltning av IT-systemer og plattformer",19,null,""]
[{"$f":"Database!$B931&Database!$C931&Database!$D931","v":"Vest RHFG: Applikasjonsforvaltning, drift og forvaltning av IT-systemer og plattformer20"},"Vest RHF","G: Applikasjonsforvaltning, drift og forvaltning av IT-systemer og plattformer",20,null,""]
[{"$f":"Database!$B932&Database!$C932&Database!$D932","v":"Vest RHFG: Applikasjonsforvaltning, drift og forvaltning av IT-systemer og plattformer21"},"Vest RHF","G: Applikasjonsforvaltning, drift og forvaltning av IT-systemer og plattformer",21,null,""]
[{"$f":"Database!$B933&Database!$C933&Database!$D933","v":"Vest RHFG: Applikasjonsforvaltning, drift og forvaltning av IT-systemer og plattformer22"},"Vest RHF","G: Applikasjonsforvaltning, drift og forvaltning av IT-systemer og plattformer",22,null,""]
[{"$f":"Database!$B934&Database!$C934&Database!$D934","v":"Vest RHFG: Applikasjonsforvaltning, drift og forvaltning av IT-systemer og plattformer23"},"Vest RHF","G: Applikasjonsforvaltning, drift og forvaltning av IT-systemer og plattformer",23,null,""]
[{"$f":"Database!$B935&Database!$C935&Database!$D935","v":"Vest RHFG: Applikasjonsforvaltning, drift og forvaltning av IT-systemer og plattformer24"},"Vest RHF","G: Applikasjonsforvaltning, drift og forvaltning av IT-systemer og plattformer",24,null,""]
[{"$f":"Database!$B936&Database!$C936&Database!$D936","v":"Vest RHFG: Applikasjonsforvaltning, drift og forvaltning av IT-systemer og plattformer25"},"Vest RHF","G: Applikasjonsforvaltning, drift og forvaltning av IT-systemer og plattformer",25,null,""]
[{"$f":"Database!$B937&Database!$C937&Database!$D937","v":"Vest RHFG: Applikasjonsforvaltning, drift og forvaltning av IT-systemer og plattformer26"},"Vest RHF","G: Applikasjonsforvaltning, drift og forvaltning av IT-systemer og plattformer",26,null,""]
[{"$f":"Database!$B938&Database!$C938&Database!$D938","v":"Vest RHFG: Applikasjonsforvaltning, drift og forvaltning av IT-systemer og plattformer27"},"Vest RHF","G: Applikasjonsforvaltning, drift og forvaltning av IT-systemer og plattformer",27,null,""]
[{"$f":"Database!$B939&Database!$C939&Database!$D939","v":"Vest RHFG: Applikasjonsforvaltning, drift og forvaltning av IT-systemer og plattformer28"},"Vest RHF","G: Applikasjonsforvaltning, drift og forvaltning av IT-systemer og plattformer",28,null,""]
[{"$f":"Database!$B940&Database!$C940&Database!$D940","v":"Vest RHFG: Applikasjonsforvaltning, drift og forvaltning av IT-systemer og plattformer29"},"Vest RHF","G: Applikasjonsforvaltning, drift og forvaltning av IT-systemer og plattformer",29,null,""]
[{"$f":"Database!$B941&Database!$C941&Database!$D941","v":"Vest RHFG: Applikasjonsforvaltning, drift og forvaltning av IT-systemer og plattformer30"},"Vest RHF","G: Applikasjonsforvaltning, drift og forvaltning av IT-systemer og plattformer",30,null,""]
[{"$f":"Database!$B942&Database!$C942&Database!$D942","v":"Vest RHFG: Applikasjonsforvaltning, drift og forvaltning av IT-systemer og plattformer31"},"Vest RHF","G: Applikasjonsforvaltning, drift og forvaltning av IT-systemer og plattformer",31,null,""]
[{"$f":"Database!$B943&Database!$C943&Database!$D943","v":"Vest RHFG: Applikasjonsforvaltning, drift og forvaltning av IT-systemer og plattformer32"},"Vest RHF","G: Applikasjonsforvaltning, drift og forvaltning av IT-systemer og plattformer",32,null,""]
[{"$f":"Database!$B944&Database!$C944&Database!$D944","v":"Vest RHFG: Applikasjonsforvaltning, drift og forvaltning av IT-systemer og plattformer33"},"Vest RHF","G: Applikasjonsforvaltning, drift og forvaltning av IT-systemer og plattformer",33,null,""]
[{"$f":"Database!$B945&Database!$C945&Database!$D945","v":"Vest RHFG: Applikasjonsforvaltning, drift og forvaltning av IT-systemer og plattformer34"},"Vest RHF","G: Applikasjonsforvaltning, drift og forvaltning av IT-systemer og plattformer",34,null,""]
[null,null,null,null,null,""]
[{"$f":"Database!$B947&Database!$C947&Database!$D947","v":"Vest RHFH: Nettverk1"},"Vest RHF","H: Nettverk",1,"A-2 Norge AS","utlysninger@a-2.no"]
[{"$f":"Database!$B948&Database!$C948&Database!$D948","v":"Vest RHFH: Nettverk2"},"Vest RHF","H: Nettverk",2,"Conscia Norge AS ","salg@conscia.no "]
[{"$f":"Database!$B949&Database!$C949&Database!$D949","v":"Vest RHFH: Nettverk3"},"Vest RHF","H: Nettverk",3,"Emagine AS ","sykehusinnkjop@emagine.no"]
[{"$f":"Database!$B950&Database!$C950&Database!$D950","v":"Vest RHFH: Nettverk4"},"Vest RHF","H: Nettverk",4,"Ework Group Norway AS ","sykehusinnkjop@eworkgroup.com  "]
[{"$f":"Database!$B951&Database!$C951&Database!$D951","v":"Vest RHFH: Nettverk5"},"Vest RHF","H: Nettverk",5,"Experis AS ","sykehusinnkjop@no.experis.com"]
[{"$f":"Database!$B952&Database!$C952&Database!$D952","v":"Vest RHFH: Nettverk6"},"Vest RHF","H: Nettverk",6,"HRP AS","marked@hrpas.no"]
[{"$f":"Database!$B953&Database!$C953&Database!$D953","v":"Vest RHFH: Nettverk7"},"Vest RHF","H: Nettverk",7,"IT Consult AS ","firmapost@itc.no"]
[{"$f":"Database!$B954&Database!$C954&Database!$D954","v":"Vest RHFH: Nettverk8"},"Vest RHF","H: Nettverk",8,"Move AS","konsulentledelse@move.no"]
[{"$f":"Database!$B955&Database!$C955&Database!$D955","v":"Vest RHFH: Nettverk9"},"Vest RHF","H: Nettverk",9,"NetNordic Norway AS ","salg@netnordic.no"]
[{"$f":"Database!$B956&Database!$C956&Database!$D956","v":"Vest RHFH: Nettverk10"},"Vest RHF","H: Nettverk",10,"Nordlo Grenland AS","firmapost.grenland@nordlo.com"]
[{"$f":"Database!$B957&Database!$C957&Database!$D957","v":"Vest RHFH: Nettverk11"},"Vest RHF","H: Nettverk",11,"Sopra Steria AS ","helse@soprasteria.com"]
[{"$f":"Database!$B958&Database!$C958&Database!$D958","v":"Vest RHFH: Nettverk12"},"Vest RHF","H: Nettverk",12,null,""]
[{"$f":"Database!$B959&Database!$C959&Database!$D959","v":"Vest RHFH: Nettverk13"},"Vest RHF","H: Nettverk",13,null,""]
[{"$f":"Database!$B960&Database!$C960&Database!$D960","v":"Vest RHFH: Nettverk14"},"Vest RHF","H: Nettverk",14,null,""]
[{"$f":"Database!$B961&Database!$C961&Database!$D961","v":"Vest RHFH: Nettverk15"},"Vest RHF","H: Nettverk",15,null,""]
[{"$f":"Database!$B962&Database!$C962&Database!$D962","v":"Vest RHFH: Nettverk16"},"Vest RHF","H: Nettverk",16,null,""]
[{"$f":"Database!$B963&Database!$C963&Database!$D963","v":"Vest RHFH: Nettverk17"},"Vest RHF","H: Nettverk",17,null,""]
[{"$f":"Database!$B964&Database!$C964&Database!$D964","v":"Vest RHFH: Nettverk18"},"Vest RHF","H: Nettverk",18,null,""]
[{"$f":"Database!$B965&Database!$C965&Database!$D965","v":"Vest RHFH: Nettverk19"},"Vest RHF","H: Nettverk",19,null,""]
[{"$f":"Database!$B966&Database!$C966&Database!$D966","v":"Vest RHFH: Nettverk20"},"Vest RHF","H: Nettverk",20,null,""]
[{"$f":"Database!$B967&Database!$C967&Database!$D967","v":"Vest RHFH: Nettverk21"},"Vest RHF","H: Nettverk",21,null,""]
[{"$f":"Database!$B968&Database!$C968&Database!$D968","v":"Vest RHFH: Nettverk22"},"Vest RHF","H: Nettverk",22,null,""]
[{"$f":"Database!$B969&Database!$C969&Database!$D969","v":"Vest RHFH: Nettverk23"},"Vest RHF","H: Nettverk",23,null,""]
[{"$f":"Database!$B970&Database!$C970&Database!$D970","v":"Vest RHFH: Nettverk24"},"Vest RHF","H: Nettverk",24,null,""]
[{"$f":"Database!$B971&Database!$C971&Database!$D971","v":"Vest RHFH: Nettverk25"},"Vest RHF","H: Nettverk",25,null,""]
[{"$f":"Database!$B972&Database!$C972&Database!$D972","v":"Vest RHFH: Nettverk26"},"Vest RHF","H: Nettverk",26,null,""]
[{"$f":"Database!$B973&Database!$C973&Database!$D973","v":"Vest RHFH: Nettverk27"},"Vest RHF","H: Nettverk",27,null,""]
[{"$f":"Database!$B974&Database!$C974&Database!$D974","v":"Vest RHFH: Nettverk28"},"Vest RHF","H: Nettverk",28,null,""]
[{"$f":"Database!$B975&Database!$C975&Database!$D975","v":"Vest RHFH: Nettverk29"},"Vest RHF","H: Nettverk",29,null,""]
[{"$f":"Database!$B976&Database!$C976&Database!$D976","v":"Vest RHFH: Nettverk30"},"Vest RHF","H: Nettverk",30,null,""]
[{"$f":"Database!$B977&Database!$C977&Database!$D977","v":"Vest RHFH: Nettverk31"},"Vest RHF","H: Nettverk",31,null,""]
[{"$f":"Database!$B978&Database!$C978&Database!$D978","v":"Vest RHFH: Nettverk32"},"Vest RHF","H: Nettverk",32,null,""]
[{"$f":"Database!$B979&Database!$C979&Database!$D979","v":"Vest RHFH: Nettverk33"},"Vest RHF","H: Nettverk",33,null,""]
[{"$f":"Database!$B980&Database!$C980&Database!$D980","v":"Vest RHFH: Nettverk34"},"Vest RHF","H: Nettverk",34,null,""]
[null,null,null,null,null,""]
[{"$f":"Database!$B982&Database!$C982&Database!$D982","v":"Vest RHFI: Telekommunikasjon1"},"Vest RHF","I: Telekommunikasjon",1,"A-2 Norge AS","utlysninger@a-2.no"]
[{"$f":"Database!$B983&Database!$C983&Database!$D983","v":"Vest RHFI: Telekommunikasjon2"},"Vest RHF","I: Telekommunikasjon",2,"Experis AS ","sykehusinnkjop@no.experis.com"]
[{"$f":"Database!$B984&Database!$C984&Database!$D984","v":"Vest RHFI: Telekommunikasjon3"},"Vest RHF","I: Telekommunikasjon",3,"HRP AS","marked@hrpas.no"]
[{"$f":"Database!$B985&Database!$C985&Database!$D985","v":"Vest RHFI: Telekommunikasjon4"},"Vest RHF","I: Telekommunikasjon",4,"NetNordic Norway AS ","salg@netnordic.no"]
[{"$f":"Database!$B986&Database!$C986&Database!$D986","v":"Vest RHFI: Telekommunikasjon5"},"Vest RHF","I: Telekommunikasjon",5,null,""]
[{"$f":"Database!$B987&Database!$C987&Database!$D987","v":"Vest RHFI: Telekommunikasjon6"},"Vest RHF","I: Telekommunikasjon",6,null,""]
[{"$f":"Database!$B988&Database!$C988&Database!$D988","v":"Vest RHFI: Telekommunikasjon7"},"Vest RHF","I: Telekommunikasjon",7,null,""]
[{"$f":"Database!$B989&Database!$C989&Database!$D989","v":"Vest RHFI: Telekommunikasjon8"},"Vest RHF","I: Telekommunikasjon",8,null,""]
[{"$f":"Database!$B990&Database!$C990&Database!$D990","v":"Vest RHFI: Telekommunikasjon9"},"Vest RHF","I: Telekommunikasjon",9,null,""]
[{"$f":"Database!$B991&Database!$C991&Database!$D991","v":"Vest RHFI: Telekommunikasjon10"},"Vest RHF","I: Telekommunikasjon",10,null,""]
[{"$f":"Database!$B992&Database!$C992&Database!$D992","v":"Vest RHFI: Telekommunikasjon11"},"Vest RHF","I: Telekommunikasjon",11,null,""]
[{"$f":"Database!$B993&Database!$C993&Database!$D993","v":"Vest RHFI: Telekommunikasjon12"},"Vest RHF","I: Telekommunikasjon",12,null,""]
[{"$f":"Database!$B994&Database!$C994&Database!$D994","v":"Vest RHFI: Telekommunikasjon13"},"Vest RHF","I: Telekommunikasjon",13,null,""]
[{"$f":"Database!$B995&Database!$C995&Database!$D995","v":"Vest RHFI: Telekommunikasjon14"},"Vest RHF","I: Telekommunikasjon",14,null,""]
[{"$f":"Database!$B996&Database!$C996&Database!$D996","v":"Vest RHFI: Telekommunikasjon15"},"Vest RHF","I: Telekommunikasjon",15,null,""]
[{"$f":"Database!$B997&Database!$C997&Database!$D997","v":"Vest RHFI: Telekommunikasjon16"},"Vest RHF","I: Telekommunikasjon",16,null,""]
[{"$f":"Database!$B998&Database!$C998&Database!$D998","v":"Vest RHFI: Telekommunikasjon17"},"Vest RHF","I: Telekommunikasjon",17,null,""]
[{"$f":"Database!$B999&Database!$C999&Database!$D999","v":"Vest RHFI: Telekommunikasjon18"},"Vest RHF","I: Telekommunikasjon",18,null,""]
[{"$f":"Database!$B1000&Database!$C1000&Database!$D1000","v":"Vest RHFI: Telekommunikasjon19"},"Vest RHF","I: Telekommunikasjon",19,null,""]
[{"$f":"Database!$B1001&Database!$C1001&Database!$D1001","v":"Vest RHFI: Telekommunikasjon20"},"Vest RHF","I: Telekommunikasjon",20,null,""]
[{"$f":"Database!$B1002&Database!$C1002&Database!$D1002","v":"Vest RHFI: Telekommunikasjon21"},"Vest RHF","I: Telekommunikasjon",21,null,""]
[{"$f":"Database!$B1003&Database!$C1003&Database!$D1003","v":"Vest RHFI: Telekommunikasjon22"},"Vest RHF","I: Telekommunikasjon",22,null,""]
[{"$f":"Database!$B1004&Database!$C1004&Database!$D1004","v":"Vest RHFI: Telekommunikasjon23"},"Vest RHF","I: Telekommunikasjon",23,null,""]
[{"$f":"Database!$B1005&Database!$C1005&Database!$D1005","v":"Vest RHFI: Telekommunikasjon24"},"Vest RHF","I: Telekommunikasjon",24,null,""]
[{"$f":"Database!$B1006&Database!$C1006&Database!$D1006","v":"Vest RHFI: Telekommunikasjon25"},"Vest RHF","I: Telekommunikasjon",25,null,""]
[{"$f":"Database!$B1007&Database!$C1007&Database!$D1007","v":"Vest RHFI: Telekommunikasjon26"},"Vest RHF","I: Telekommunikasjon",26,null,""]
[{"$f":"Database!$B1008&Database!$C1008&Database!$D1008","v":"Vest RHFI: Telekommunikasjon27"},"Vest RHF","I: Telekommunikasjon",27,null,""]
[{"$f":"Database!$B1009&Database!$C1009&Database!$D1009","v":"Vest RHFI: Telekommunikasjon28"},"Vest RHF","I: Telekommunikasjon",28,null,""]
[{"$f":"Database!$B1010&Database!$C1010&Database!$D1010","v":"Vest RHFI: Telekommunikasjon29"},"Vest RHF","I: Telekommunikasjon",29,null,""]
[{"$f":"Database!$B1011&Database!$C1011&Database!$D1011","v":"Vest RHFI: Telekommunikasjon30"},"Vest RHF","I: Telekommunikasjon",30,null,""]
[{"$f":"Database!$B1012&Database!$C1012&Database!$D1012","v":"Vest RHFI: Telekommunikasjon31"},"Vest RHF","I: Telekommunikasjon",31,null,""]
[{"$f":"Database!$B1013&Database!$C1013&Database!$D1013","v":"Vest RHFI: Telekommunikasjon32"},"Vest RHF","I: Telekommunikasjon",32,null,""]
[{"$f":"Database!$B1014&Database!$C1014&Database!$D1014","v":"Vest RHFI: Telekommunikasjon33"},"Vest RHF","I: Telekommunikasjon",33,null,""]
[{"$f":"Database!$B1015&Database!$C1015&Database!$D1015","v":"Vest RHFI: Telekommunikasjon34"},"Vest RHF","I: Telekommunikasjon",34,null,""]
[null,null,null,null,null,""]
[{"$f":"Database!$B1017&Database!$C1017&Database!$D1017","v":"Vest RHFJ: Tverrfaglige team1"},"Vest RHF","J: Tverrfaglige team",1,"A-2 Norge AS","utlysninger@a-2.no"]
[{"$f":"Database!$B1018&Database!$C1018&Database!$D1018","v":"Vest RHFJ: Tverrfaglige team2"},"Vest RHF","J: Tverrfaglige team",2,"Accenture AS ","rammeavtale.helse@accenture.com"]
[{"$f":"Database!$B1019&Database!$C1019&Database!$D1019","v":"Vest RHFJ: Tverrfaglige team3"},"Vest RHF","J: Tverrfaglige team",3,"Bouvet Norge AS ","Sykehusinnkjop2023@bouvet.no"]
[{"$f":"Database!$B1020&Database!$C1020&Database!$D1020","v":"Vest RHFJ: Tverrfaglige team4"},"Vest RHF","J: Tverrfaglige team",4,"Capgemini Norge AS ","helsenord.no@capgemini.com"]
[{"$f":"Database!$B1021&Database!$C1021&Database!$D1021","v":"Vest RHFJ: Tverrfaglige team5"},"Vest RHF","J: Tverrfaglige team",5,"Deloitte AS ","noanbud@DELOITTE.no"]
[{"$f":"Database!$B1022&Database!$C1022&Database!$D1022","v":"Vest RHFJ: Tverrfaglige team6"},"Vest RHF","J: Tverrfaglige team",6,"Ernst & Young AS ","offentlige.anskaffelser@no.ey.com"]
[{"$f":"Database!$B1023&Database!$C1023&Database!$D1023","v":"Vest RHFJ: Tverrfaglige team7"},"Vest RHF","J: Tverrfaglige team",7,"Netcompany AS ","anbud.no@netcompany.com "]
[{"$f":"Database!$B1024&Database!$C1024&Database!$D1024","v":"Vest RHFJ: Tverrfaglige team8"},"Vest RHF","J: Tverrfaglige team",8,"PricewaterhouseCoopers AS ","no_resepsjon.oslo@pwc.com"]
[{"$f":"Database!$B1025&Database!$C1025&Database!$D1025","v":"Vest RHFJ: Tverrfaglige team9"},"Vest RHF","J: Tverrfaglige team",9,"Solea AS (tidl Rainfall AS )","avrop@solea.no"]
[{"$f":"Database!$B1026&Database!$C1026&Database!$D1026","v":"Vest RHFJ: Tverrfaglige team10"},"Vest RHF","J: Tverrfaglige team",10,"Sopra Steria AS ","helse@soprasteria.com"]
[{"$f":"Database!$B1027&Database!$C1027&Database!$D1027","v":"Vest RHFJ: Tverrfaglige team11"},"Vest RHF","J: Tverrfaglige team",11,null,""]
[{"$f":"Database!$B1028&Database!$C1028&Database!$D1028","v":"Vest RHFJ: Tverrfaglige team12"},"Vest RHF","J: Tverrfaglige team",12,null,""]
[{"$f":"Database!$B1029&Database!$C1029&Database!$D1029","v":"Vest RHFJ: Tverrfaglige team13"},"Vest RHF","J: Tverrfaglige team",13,null,""]
[{"$f":"Database!$B1030&Database!$C1030&Database!$D1030","v":"Vest RHFJ: Tverrfaglige team14"},"Vest RHF","J: Tverrfaglige team",14,null,""]
[{"$f":"Database!$B1031&Database!$C1031&Database!$D1031","v":"Vest RHFJ: Tverrfaglige team15"},"Vest RHF","J: Tverrfaglige team",15,null,""]
[{"$f":"Database!$B1032&Database!$C1032&Database!$D1032","v":"Vest RHFJ: Tverrfaglige team16"},"Vest RHF","J: Tverrfaglige team",16,null,""]
[{"$f":"Database!$B1033&Database!$C1033&Database!$D1033","v":"Vest RHFJ: Tverrfaglige team17"},"Vest RHF","J: Tverrfaglige team",17,null,""]
[{"$f":"Database!$B1034&Database!$C1034&Database!$D1034","v":"Vest RHFJ: Tverrfaglige team18"},"Vest RHF","J: Tverrfaglige team",18,null,""]
[{"$f":"Database!$B1035&Database!$C1035&Database!$D1035","v":"Vest RHFJ: Tverrfaglige team19"},"Vest RHF","J: Tverrfaglige team",19,null,""]
[{"$f":"Database!$B1036&Database!$C1036&Database!$D1036","v":"Vest RHFJ: Tverrfaglige team20"},"Vest RHF","J: Tverrfaglige team",20,null,""]
[{"$f":"Database!$B1037&Database!$C1037&Database!$D1037","v":"Vest RHFJ: Tverrfaglige team21"},"Vest RHF","J: Tverrfaglige team",21,null,""]
[{"$f":"Database!$B1038&Database!$C1038&Database!$D1038","v":"Vest RHFJ: Tverrfaglige team22"},"Vest RHF","J: Tverrfaglige team",22,null,""]
[{"$f":"Database!$B1039&Database!$C1039&Database!$D1039","v":"Vest RHFJ: Tverrfaglige team23"},"Vest RHF","J: Tverrfaglige team",23,null,""]
[{"$f":"Database!$B1040&Database!$C1040&Database!$D1040","v":"Vest RHFJ: Tverrfaglige team24"},"Vest RHF","J: Tverrfaglige team",24,null,""]
[{"$f":"Database!$B1041&Database!$C1041&Database!$D1041","v":"Vest RHFJ: Tverrfaglige team25"},"Vest RHF","J: Tverrfaglige team",25,null,""]
[{"$f":"Database!$B1042&Database!$C1042&Database!$D1042","v":"Vest RHFJ: Tverrfaglige team26"},"Vest RHF","J: Tverrfaglige team",26,null,""]
[{"$f":"Database!$B1043&Database!$C1043&Database!$D1043","v":"Vest RHFJ: Tverrfaglige team27"},"Vest RHF","J: Tverrfaglige team",27,null,""]
[{"$f":"Database!$B1044&Database!$C1044&Database!$D1044","v":"Vest RHFJ: Tverrfaglige team28"},"Vest RHF","J: Tverrfaglige team",28,null,""]
[{"$f":"Database!$B1045&Database!$C1045&Database!$D1045","v":"Vest RHFJ: Tverrfaglige team29"},"Vest RHF","J: Tverrfaglige team",29,null,""]
[{"$f":"Database!$B1046&Database!$C1046&Database!$D1046","v":"Vest RHFJ: Tverrfaglige team30"},"Vest RHF","J: Tverrfaglige team",30,null,""]
[{"$f":"Database!$B1047&Database!$C1047&Database!$D1047","v":"Vest RHFJ: Tverrfaglige team31"},"Vest RHF","J: Tverrfaglige team",31,null,""]
[{"$f":"Database!$B1048&Database!$C1048&Database!$D1048","v":"Vest RHFJ: Tverrfaglige team32"},"Vest RHF","J: Tverrfaglige team",32,null,""]
[{"$f":"Database!$B1049&Database!$C1049&Database!$D1049","v":"Vest RHFJ: Tverrfaglige team33"},"Vest RHF","J: Tverrfaglige team",33,null,""]
[{"$f":"Database!$B1050&Database!$C1050&Database!$D1050","v":"Vest RHFJ: Tverrfaglige team34"},"Vest RHF","J: Tverrfaglige team",34,null,""]
[null,null,null,null,null,""]
[{"$f":"Database!$B1052&Database!$C1052&Database!$D1052","v":"Sør-Øst RHFA: Program og Prosjektgjennomføring1"},"Sør-Øst RHF","A: Program og Prosjektgjennomføring",1,"A-2 Norge AS","utlysninger@a-2.no"]
[{"$f":"Database!$B1053&Database!$C1053&Database!$D1053","v":"Sør-Øst RHFA: Program og Prosjektgjennomføring2"},"Sør-Øst RHF","A: Program og Prosjektgjennomføring",2,"Accenture AS ","rammeavtale.helse@accenture.com"]
[{"$f":"Database!$B1054&Database!$C1054&Database!$D1054","v":"Sør-Øst RHFA: Program og Prosjektgjennomføring3"},"Sør-Øst RHF","A: Program og Prosjektgjennomføring",3,"Systra Norge AS ","firmapost@systra.com"]
[{"$f":"Database!$B1055&Database!$C1055&Database!$D1055","v":"Sør-Øst RHFA: Program og Prosjektgjennomføring4"},"Sør-Øst RHF","A: Program og Prosjektgjennomføring",4,"Bouvet Norge AS ","Sykehusinnkjop2023@bouvet.no"]
[{"$f":"Database!$B1056&Database!$C1056&Database!$D1056","v":"Sør-Øst RHFA: Program og Prosjektgjennomføring5"},"Sør-Øst RHF","A: Program og Prosjektgjennomføring",5,"Capgemini Norge AS ","helsenord.no@capgemini.com"]
[{"$f":"Database!$B1057&Database!$C1057&Database!$D1057","v":"Sør-Øst RHFA: Program og Prosjektgjennomføring6"},"Sør-Øst RHF","A: Program og Prosjektgjennomføring",6,"Deloitte AS ","noanbud@DELOITTE.no"]
[{"$f":"Database!$B1058&Database!$C1058&Database!$D1058","v":"Sør-Øst RHFA: Program og Prosjektgjennomføring7"},"Sør-Øst RHF","A: Program og Prosjektgjennomføring",7,"Dfind Consulting AS ","consulting@dfind.no"]
[{"$f":"Database!$B1059&Database!$C1059&Database!$D1059","v":"Sør-Øst RHFA: Program og Prosjektgjennomføring8"},"Sør-Øst RHF","A: Program og Prosjektgjennomføring",8,"Emagine AS ","sykehusinnkjop@emagine.no"]
[{"$f":"Database!$B1060&Database!$C1060&Database!$D1060","v":"Sør-Øst RHFA: Program og Prosjektgjennomføring9"},"Sør-Øst RHF","A: Program og Prosjektgjennomføring",9,"Ernst & Young AS ","offentlige.anskaffelser@no.ey.com"]
[{"$f":"Database!$B1061&Database!$C1061&Database!$D1061","v":"Sør-Øst RHFA: Program og Prosjektgjennomføring10"},"Sør-Øst RHF","A: Program og Prosjektgjennomføring",10,"Ework Group Norway AS ","sykehusinnkjop@eworkgroup.com  "]
[{"$f":"Database!$B1062&Database!$C1062&Database!$D1062","v":"Sør-Øst RHFA: Program og Prosjektgjennomføring11"},"Sør-Øst RHF","A: Program og Prosjektgjennomføring",11,"Experis AS ","sykehusinnkjop@no.experis.com"]
[{"$f":"Database!$B1063&Database!$C1063&Database!$D1063","v":"Sør-Øst RHFA: Program og Prosjektgjennomføring12"},"Sør-Øst RHF","A: Program og Prosjektgjennomføring",12,"KPMG AS ","helse@kpmg.no"]
[{"$f":"Database!$B1064&Database!$C1064&Database!$D1064","v":"Sør-Øst RHFA: Program og Prosjektgjennomføring13"},"Sør-Øst RHF","A: Program og Prosjektgjennomføring",13,"Metier AS ","firmapost@metier.no"]
[{"$f":"Database!$B1065&Database!$C1065&Database!$D1065","v":"Sør-Øst RHFA: Program og Prosjektgjennomføring14"},"Sør-Øst RHF","A: Program og Prosjektgjennomføring",14,"Netcompany AS ","anbud.no@netcompany.com "]
[{"$f":"Database!$B1066&Database!$C1066&Database!$D1066","v":"Sør-Øst RHFA: Program og Prosjektgjennomføring15"},"Sør-Øst RHF","A: Program og Prosjektgjennomføring",15,"PricewaterhouseCoopers AS ","no_resepsjon.oslo@pwc.com"]
[{"$f":"Database!$B1067&Database!$C1067&Database!$D1067","v":"Sør-Øst RHFA: Program og Prosjektgjennomføring16"},"Sør-Øst RHF","A: Program og Prosjektgjennomføring",16,"Sopra Steria AS ","helse@soprasteria.com"]
[{"$f":"Database!$B1068&Database!$C1068&Database!$D1068","v":"Sør-Øst RHFA: Program og Prosjektgjennomføring17"},"Sør-Øst RHF","A: Program og Prosjektgjennomføring",17,"The Boston Consulting Group Nordic AB ","anbud@bcg.com"]
[{"$f":"Database!$B1069&Database!$C1069&Database!$D1069","v":"Sør-Øst RHFA: Program og Prosjektgjennomføring18"},"Sør-Øst RHF","A: Program og Prosjektgjennomføring",18,null,""]
[{"$f":"Database!$B1070&Database!$C1070&Database!$D1070","v":"Sør-Øst RHFA: Program og Prosjektgjennomføring19"},"Sør-Øst RHF","A: Program og Prosjektgjennomføring",19,null,""]
[{"$f":"Database!$B1071&Database!$C1071&Database!$D1071","v":"Sør-Øst RHFA: Program og Prosjektgjennomføring20"},"Sør-Øst RHF","A: Program og Prosjektgjennomføring",20,null,""]
[{"$f":"Database!$B1072&Database!$C1072&Database!$D1072","v":"Sør-Øst RHFA: Program og Prosjektgjennomføring21"},"Sør-Øst RHF","A: Program og Prosjektgjennomføring",21,null,""]
[{"$f":"Database!$B1073&Database!$C1073&Database!$D1073","v":"Sør-Øst RHFA: Program og Prosjektgjennomføring22"},"Sør-Øst RHF","A: Program og Prosjektgjennomføring",22,null,""]
[{"$f":"Database!$B1074&Database!$C1074&Database!$D1074","v":"Sør-Øst RHFA: Program og Prosjektgjennomføring23"},"Sør-Øst RHF","A: Program og Prosjektgjennomføring",23,null,""]
[{"$f":"Database!$B1075&Database!$C1075&Database!$D1075","v":"Sør-Øst RHFA: Program og Prosjektgjennomføring24"},"Sør-Øst RHF","A: Program og Prosjektgjennomføring",24,null,""]
[{"$f":"Database!$B1076&Database!$C1076&Database!$D1076","v":"Sør-Øst RHFA: Program og Prosjektgjennomføring25"},"Sør-Øst RHF","A: Program og Prosjektgjennomføring",25,null,""]
[{"$f":"Database!$B1077&Database!$C1077&Database!$D1077","v":"Sør-Øst RHFA: Program og Prosjektgjennomføring26"},"Sør-Øst RHF","A: Program og Prosjektgjennomføring",26,null,""]
[{"$f":"Database!$B1078&Database!$C1078&Database!$D1078","v":"Sør-Øst RHFA: Program og Prosjektgjennomføring27"},"Sør-Øst RHF","A: Program og Prosjektgjennomføring",27,null,""]
[{"$f":"Database!$B1079&Database!$C1079&Database!$D1079","v":"Sør-Øst RHFA: Program og Prosjektgjennomføring28"},"Sør-Øst RHF","A: Program og Prosjektgjennomføring",28,null,""]
[{"$f":"Database!$B1080&Database!$C1080&Database!$D1080","v":"Sør-Øst RHFA: Program og Prosjektgjennomføring29"},"Sør-Øst RHF","A: Program og Prosjektgjennomføring",29,null,""]
[{"$f":"Database!$B1081&Database!$C1081&Database!$D1081","v":"Sør-Øst RHFA: Program og Prosjektgjennomføring30"},"Sør-Øst RHF","A: Program og Prosjektgjennomføring",30,null,""]
[{"$f":"Database!$B1082&Database!$C1082&Database!$D1082","v":"Sør-Øst RHFA: Program og Prosjektgjennomføring31"},"Sør-Øst RHF","A: Program og Prosjektgjennomføring",31,null,""]
[{"$f":"Database!$B1083&Database!$C1083&Database!$D1083","v":"Sør-Øst RHFA: Program og Prosjektgjennomføring32"},"Sør-Øst RHF","A: Program og Prosjektgjennomføring",32,null,""]
[{"$f":"Database!$B1084&Database!$C1084&Database!$D1084","v":"Sør-Øst RHFA: Program og Prosjektgjennomføring33"},"Sør-Øst RHF","A: Program og Prosjektgjennomføring",33,null,""]
[{"$f":"Database!$B1085&Database!$C1085&Database!$D1085","v":"Sør-Øst RHFA: Program og Prosjektgjennomføring34"},"Sør-Øst RHF","A: Program og Prosjektgjennomføring",34,null,""]
[null,null,null,null,null,""]
[{"$f":"Database!$B1087&Database!$C1087&Database!$D1087","v":"Sør-Øst RHFB: Strategiplanlegging, rådgivning og innovasjon1"},"Sør-Øst RHF","B: Strategiplanlegging, rådgivning og innovasjon",1,"A-2 Norge AS","utlysninger@a-2.no"]
[{"$f":"Database!$B1088&Database!$C1088&Database!$D1088","v":"Sør-Øst RHFB: Strategiplanlegging, rådgivning og innovasjon2"},"Sør-Øst RHF","B: Strategiplanlegging, rådgivning og innovasjon",2,"Accenture AS ","rammeavtale.helse@accenture.com"]
[{"$f":"Database!$B1089&Database!$C1089&Database!$D1089","v":"Sør-Øst RHFB: Strategiplanlegging, rådgivning og innovasjon3"},"Sør-Øst RHF","B: Strategiplanlegging, rådgivning og innovasjon",3,"Systra Norge AS ","firmapost@systra.com"]
[{"$f":"Database!$B1090&Database!$C1090&Database!$D1090","v":"Sør-Øst RHFB: Strategiplanlegging, rådgivning og innovasjon4"},"Sør-Øst RHF","B: Strategiplanlegging, rådgivning og innovasjon",4,"Bouvet Norge AS ","Sykehusinnkjop2023@bouvet.no"]
[{"$f":"Database!$B1091&Database!$C1091&Database!$D1091","v":"Sør-Øst RHFB: Strategiplanlegging, rådgivning og innovasjon5"},"Sør-Øst RHF","B: Strategiplanlegging, rådgivning og innovasjon",5,"Capgemini Norge AS ","helsenord.no@capgemini.com"]
[{"$f":"Database!$B1092&Database!$C1092&Database!$D1092","v":"Sør-Øst RHFB: Strategiplanlegging, rådgivning og innovasjon6"},"Sør-Øst RHF","B: Strategiplanlegging, rådgivning og innovasjon",6,"Deloitte AS ","noanbud@DELOITTE.no"]
[{"$f":"Database!$B1093&Database!$C1093&Database!$D1093","v":"Sør-Øst RHFB: Strategiplanlegging, rådgivning og innovasjon7"},"Sør-Øst RHF","B: Strategiplanlegging, rådgivning og innovasjon",7,"Emagine AS ","sykehusinnkjop@emagine.no"]
[{"$f":"Database!$B1094&Database!$C1094&Database!$D1094","v":"Sør-Øst RHFB: Strategiplanlegging, rådgivning og innovasjon8"},"Sør-Øst RHF","B: Strategiplanlegging, rådgivning og innovasjon",8,"Ernst & Young AS ","offentlige.anskaffelser@no.ey.com"]
[{"$f":"Database!$B1095&Database!$C1095&Database!$D1095","v":"Sør-Øst RHFB: Strategiplanlegging, rådgivning og innovasjon9"},"Sør-Øst RHF","B: Strategiplanlegging, rådgivning og innovasjon",9,"Ework Group Norway AS ","sykehusinnkjop@eworkgroup.com  "]
[{"$f":"Database!$B1096&Database!$C1096&Database!$D1096","v":"Sør-Øst RHFB: Strategiplanlegging, rådgivning og innovasjon10"},"Sør-Øst RHF","B: Strategiplanlegging, rådgivning og innovasjon",10,"Experis AS ","sykehusinnkjop@no.experis.com"]
[{"$f":"Database!$B1097&Database!$C1097&Database!$D1097","v":"Sør-Øst RHFB: Strategiplanlegging, rådgivning og innovasjon11"},"Sør-Øst RHF","B: Strategiplanlegging, rådgivning og innovasjon",11,"KPMG AS ","helse@kpmg.no"]
[{"$f":"Database!$B1098&Database!$C1098&Database!$D1098","v":"Sør-Øst RHFB: Strategiplanlegging, rådgivning og innovasjon12"},"Sør-Øst RHF","B: Strategiplanlegging, rådgivning og innovasjon",12,"Metier AS ","firmapost@metier.no"]
[{"$f":"Database!$B1099&Database!$C1099&Database!$D1099","v":"Sør-Øst RHFB: Strategiplanlegging, rådgivning og innovasjon13"},"Sør-Øst RHF","B: Strategiplanlegging, rådgivning og innovasjon",13,"PricewaterhouseCoopers AS ","no_resepsjon.oslo@pwc.com"]
[{"$f":"Database!$B1100&Database!$C1100&Database!$D1100","v":"Sør-Øst RHFB: Strategiplanlegging, rådgivning og innovasjon14"},"Sør-Øst RHF","B: Strategiplanlegging, rådgivning og innovasjon",14,"Sopra Steria AS ","helse@soprasteria.com"]
[{"$f":"Database!$B1101&Database!$C1101&Database!$D1101","v":"Sør-Øst RHFB: Strategiplanlegging, rådgivning og innovasjon15"},"Sør-Øst RHF","B: Strategiplanlegging, rådgivning og innovasjon",15,"The Boston Consulting Group Nordic AB ","anbud@bcg.com"]
[{"$f":"Database!$B1102&Database!$C1102&Database!$D1102","v":"Sør-Øst RHFB: Strategiplanlegging, rådgivning og innovasjon16"},"Sør-Øst RHF","B: Strategiplanlegging, rådgivning og innovasjon",16,"Advisense AS","offentlig@transcendentgroup.com "]
[{"$f":"Database!$B1103&Database!$C1103&Database!$D1103","v":"Sør-Øst RHFB: Strategiplanlegging, rådgivning og innovasjon17"},"Sør-Øst RHF","B: Strategiplanlegging, rådgivning og innovasjon",17,null,""]
[{"$f":"Database!$B1104&Database!$C1104&Database!$D1104","v":"Sør-Øst RHFB: Strategiplanlegging, rådgivning og innovasjon18"},"Sør-Øst RHF","B: Strategiplanlegging, rådgivning og innovasjon",18,null,""]
[{"$f":"Database!$B1105&Database!$C1105&Database!$D1105","v":"Sør-Øst RHFB: Strategiplanlegging, rådgivning og innovasjon19"},"Sør-Øst RHF","B: Strategiplanlegging, rådgivning og innovasjon",19,null,""]
[{"$f":"Database!$B1106&Database!$C1106&Database!$D1106","v":"Sør-Øst RHFB: Strategiplanlegging, rådgivning og innovasjon20"},"Sør-Øst RHF","B: Strategiplanlegging, rådgivning og innovasjon",20,null,""]
[{"$f":"Database!$B1107&Database!$C1107&Database!$D1107","v":"Sør-Øst RHFB: Strategiplanlegging, rådgivning og innovasjon21"},"Sør-Øst RHF","B: Strategiplanlegging, rådgivning og innovasjon",21,null,""]
[{"$f":"Database!$B1108&Database!$C1108&Database!$D1108","v":"Sør-Øst RHFB: Strategiplanlegging, rådgivning og innovasjon22"},"Sør-Øst RHF","B: Strategiplanlegging, rådgivning og innovasjon",22,null,""]
[{"$f":"Database!$B1109&Database!$C1109&Database!$D1109","v":"Sør-Øst RHFB: Strategiplanlegging, rådgivning og innovasjon23"},"Sør-Øst RHF","B: Strategiplanlegging, rådgivning og innovasjon",23,null,""]
[{"$f":"Database!$B1110&Database!$C1110&Database!$D1110","v":"Sør-Øst RHFB: Strategiplanlegging, rådgivning og innovasjon24"},"Sør-Øst RHF","B: Strategiplanlegging, rådgivning og innovasjon",24,null,""]
[{"$f":"Database!$B1111&Database!$C1111&Database!$D1111","v":"Sør-Øst RHFB: Strategiplanlegging, rådgivning og innovasjon25"},"Sør-Øst RHF","B: Strategiplanlegging, rådgivning og innovasjon",25,null,""]
[{"$f":"Database!$B1112&Database!$C1112&Database!$D1112","v":"Sør-Øst RHFB: Strategiplanlegging, rådgivning og innovasjon26"},"Sør-Øst RHF","B: Strategiplanlegging, rådgivning og innovasjon",26,null,""]
[{"$f":"Database!$B1113&Database!$C1113&Database!$D1113","v":"Sør-Øst RHFB: Strategiplanlegging, rådgivning og innovasjon27"},"Sør-Øst RHF","B: Strategiplanlegging, rådgivning og innovasjon",27,null,""]
[{"$f":"Database!$B1114&Database!$C1114&Database!$D1114","v":"Sør-Øst RHFB: Strategiplanlegging, rådgivning og innovasjon28"},"Sør-Øst RHF","B: Strategiplanlegging, rådgivning og innovasjon",28,null,""]
[{"$f":"Database!$B1115&Database!$C1115&Database!$D1115","v":"Sør-Øst RHFB: Strategiplanlegging, rådgivning og innovasjon29"},"Sør-Øst RHF","B: Strategiplanlegging, rådgivning og innovasjon",29,null,""]
[{"$f":"Database!$B1116&Database!$C1116&Database!$D1116","v":"Sør-Øst RHFB: Strategiplanlegging, rådgivning og innovasjon30"},"Sør-Øst RHF","B: Strategiplanlegging, rådgivning og innovasjon",30,null,""]
[{"$f":"Database!$B1117&Database!$C1117&Database!$D1117","v":"Sør-Øst RHFB: Strategiplanlegging, rådgivning og innovasjon31"},"Sør-Øst RHF","B: Strategiplanlegging, rådgivning og innovasjon",31,null,""]
[{"$f":"Database!$B1118&Database!$C1118&Database!$D1118","v":"Sør-Øst RHFB: Strategiplanlegging, rådgivning og innovasjon32"},"Sør-Øst RHF","B: Strategiplanlegging, rådgivning og innovasjon",32,null,""]
[{"$f":"Database!$B1119&Database!$C1119&Database!$D1119","v":"Sør-Øst RHFB: Strategiplanlegging, rådgivning og innovasjon33"},"Sør-Øst RHF","B: Strategiplanlegging, rådgivning og innovasjon",33,null,""]
[{"$f":"Database!$B1120&Database!$C1120&Database!$D1120","v":"Sør-Øst RHFB: Strategiplanlegging, rådgivning og innovasjon34"},"Sør-Øst RHF","B: Strategiplanlegging, rådgivning og innovasjon",34,null,""]
[null,null,null,null,null,""]
[{"$f":"Database!$B1122&Database!$C1122&Database!$D1122","v":"Sør-Øst RHFC: Arkitektur1"},"Sør-Øst RHF","C: Arkitektur",1,"A-2 Norge AS","utlysninger@a-2.no"]
[{"$f":"Database!$B1123&Database!$C1123&Database!$D1123","v":"Sør-Øst RHFC: Arkitektur2"},"Sør-Øst RHF","C: Arkitektur",2,"Accenture AS ","rammeavtale.helse@accenture.com"]
[{"$f":"Database!$B1124&Database!$C1124&Database!$D1124","v":"Sør-Øst RHFC: Arkitektur3"},"Sør-Øst RHF","C: Arkitektur",3,"Systra Norge AS ","firmapost@systra.com"]
[{"$f":"Database!$B1125&Database!$C1125&Database!$D1125","v":"Sør-Øst RHFC: Arkitektur4"},"Sør-Øst RHF","C: Arkitektur",4,"Bouvet Norge AS ","Sykehusinnkjop2023@bouvet.no"]
[{"$f":"Database!$B1126&Database!$C1126&Database!$D1126","v":"Sør-Øst RHFC: Arkitektur5"},"Sør-Øst RHF","C: Arkitektur",5,"Capgemini Norge AS ","helsenord.no@capgemini.com"]
[{"$f":"Database!$B1127&Database!$C1127&Database!$D1127","v":"Sør-Øst RHFC: Arkitektur6"},"Sør-Øst RHF","C: Arkitektur",6,"Deloitte AS ","noanbud@DELOITTE.no"]
[{"$f":"Database!$B1128&Database!$C1128&Database!$D1128","v":"Sør-Øst RHFC: Arkitektur7"},"Sør-Øst RHF","C: Arkitektur",7,"Emagine AS ","sykehusinnkjop@emagine.no"]
[{"$f":"Database!$B1129&Database!$C1129&Database!$D1129","v":"Sør-Øst RHFC: Arkitektur8"},"Sør-Øst RHF","C: Arkitektur",8,"Ernst & Young AS ","offentlige.anskaffelser@no.ey.com"]
[{"$f":"Database!$B1130&Database!$C1130&Database!$D1130","v":"Sør-Øst RHFC: Arkitektur9"},"Sør-Øst RHF","C: Arkitektur",9,"Ework Group Norway AS ","sykehusinnkjop@eworkgroup.com  "]
[{"$f":"Database!$B1131&Database!$C1131&Database!$D1131","v":"Sør-Øst RHFC: Arkitektur10"},"Sør-Øst RHF","C: Arkitektur",10,"Experis AS ","sykehusinnkjop@no.experis.com"]
[{"$f":"Database!$B1132&Database!$C1132&Database!$D1132","v":"Sør-Øst RHFC: Arkitektur11"},"Sør-Øst RHF","C: Arkitektur",11,"IT Consult AS ","firmapost@itc.no"]
[{"$f":"Database!$B1133&Database!$C1133&Database!$D1133","v":"Sør-Øst RHFC: Arkitektur12"},"Sør-Øst RHF","C: Arkitektur",12,"KPMG AS ","helse@kpmg.no"]
[{"$f":"Database!$B1134&Database!$C1134&Database!$D1134","v":"Sør-Øst RHFC: Arkitektur13"},"Sør-Øst RHF","C: Arkitektur",13,"Netcompany AS ","anbud.no@netcompany.com "]
[{"$f":"Database!$B1135&Database!$C1135&Database!$D1135","v":"Sør-Øst RHFC: Arkitektur14"},"Sør-Øst RHF","C: Arkitektur",14,"PricewaterhouseCoopers AS ","no_resepsjon.oslo@pwc.com"]
[{"$f":"Database!$B1136&Database!$C1136&Database!$D1136","v":"Sør-Øst RHFC: Arkitektur15"},"Sør-Øst RHF","C: Arkitektur",15,"Sopra Steria AS ","helse@soprasteria.com"]
[{"$f":"Database!$B1137&Database!$C1137&Database!$D1137","v":"Sør-Øst RHFC: Arkitektur16"},"Sør-Øst RHF","C: Arkitektur",16,"The Boston Consulting Group Nordic AB ","anbud@bcg.com"]
[{"$f":"Database!$B1138&Database!$C1138&Database!$D1138","v":"Sør-Øst RHFC: Arkitektur17"},"Sør-Øst RHF","C: Arkitektur",17,null,""]
[{"$f":"Database!$B1139&Database!$C1139&Database!$D1139","v":"Sør-Øst RHFC: Arkitektur18"},"Sør-Øst RHF","C: Arkitektur",18,null,""]
[{"$f":"Database!$B1140&Database!$C1140&Database!$D1140","v":"Sør-Øst RHFC: Arkitektur19"},"Sør-Øst RHF","C: Arkitektur",19,null,""]
[{"$f":"Database!$B1141&Database!$C1141&Database!$D1141","v":"Sør-Øst RHFC: Arkitektur20"},"Sør-Øst RHF","C: Arkitektur",20,null,""]
[{"$f":"Database!$B1142&Database!$C1142&Database!$D1142","v":"Sør-Øst RHFC: Arkitektur21"},"Sør-Øst RHF","C: Arkitektur",21,null,""]
[{"$f":"Database!$B1143&Database!$C1143&Database!$D1143","v":"Sør-Øst RHFC: Arkitektur22"},"Sør-Øst RHF","C: Arkitektur",22,null,""]
[{"$f":"Database!$B1144&Database!$C1144&Database!$D1144","v":"Sør-Øst RHFC: Arkitektur23"},"Sør-Øst RHF","C: Arkitektur",23,null,""]
[{"$f":"Database!$B1145&Database!$C1145&Database!$D1145","v":"Sør-Øst RHFC: Arkitektur24"},"Sør-Øst RHF","C: Arkitektur",24,null,""]
[{"$f":"Database!$B1146&Database!$C1146&Database!$D1146","v":"Sør-Øst RHFC: Arkitektur25"},"Sør-Øst RHF","C: Arkitektur",25,null,""]
[{"$f":"Database!$B1147&Database!$C1147&Database!$D1147","v":"Sør-Øst RHFC: Arkitektur26"},"Sør-Øst RHF","C: Arkitektur",26,null,""]
[{"$f":"Database!$B1148&Database!$C1148&Database!$D1148","v":"Sør-Øst RHFC: Arkitektur27"},"Sør-Øst RHF","C: Arkitektur",27,null,""]
[{"$f":"Database!$B1149&Database!$C1149&Database!$D1149","v":"Sør-Øst RHFC: Arkitektur28"},"Sør-Øst RHF","C: Arkitektur",28,null,""]
[{"$f":"Database!$B1150&Database!$C1150&Database!$D1150","v":"Sør-Øst RHFC: Arkitektur29"},"Sør-Øst RHF","C: Arkitektur",29,null,""]
[{"$f":"Database!$B1151&Database!$C1151&Database!$D1151","v":"Sør-Øst RHFC: Arkitektur30"},"Sør-Øst RHF","C: Arkitektur",30,null,""]
[{"$f":"Database!$B1152&Database!$C1152&Database!$D1152","v":"Sør-Øst RHFC: Arkitektur31"},"Sør-Øst RHF","C: Arkitektur",31,null,""]
[{"$f":"Database!$B1153&Database!$C1153&Database!$D1153","v":"Sør-Øst RHFC: Arkitektur32"},"Sør-Øst RHF","C: Arkitektur",32,null,""]
[{"$f":"Database!$B1154&Database!$C1154&Database!$D1154","v":"Sør-Øst RHFC: Arkitektur33"},"Sør-Øst RHF","C: Arkitektur",33,null,""]
[{"$f":"Database!$B1155&Database!$C1155&Database!$D1155","v":"Sør-Øst RHFC: Arkitektur34"},"Sør-Øst RHF","C: Arkitektur",34,null,""]
[null,null,null,null,null,""]
[{"$f":"Database!$B1157&Database!$C1157&Database!$D1157","v":"Sør-Øst RHFD: Informasjonssikkerhet og ROS-analyser1"},"Sør-Øst RHF","D: Informasjonssikkerhet og ROS-analyser",1,"A-2 Norge AS","utlysninger@a-2.no"]
[{"$f":"Database!$B1158&Database!$C1158&Database!$D1158","v":"Sør-Øst RHFD: Informasjonssikkerhet og ROS-analyser2"},"Sør-Øst RHF","D: Informasjonssikkerhet og ROS-analyser",2,"Systra Norge AS ","firmapost@systra.com"]
[{"$f":"Database!$B1159&Database!$C1159&Database!$D1159","v":"Sør-Øst RHFD: Informasjonssikkerhet og ROS-analyser3"},"Sør-Øst RHF","D: Informasjonssikkerhet og ROS-analyser",3,"Bouvet Norge AS ","Sykehusinnkjop2023@bouvet.no"]
[{"$f":"Database!$B1160&Database!$C1160&Database!$D1160","v":"Sør-Øst RHFD: Informasjonssikkerhet og ROS-analyser4"},"Sør-Øst RHF","D: Informasjonssikkerhet og ROS-analyser",4,"Capgemini Norge AS ","helsenord.no@capgemini.com"]
[{"$f":"Database!$B1161&Database!$C1161&Database!$D1161","v":"Sør-Øst RHFD: Informasjonssikkerhet og ROS-analyser5"},"Sør-Øst RHF","D: Informasjonssikkerhet og ROS-analyser",5,"Deloitte AS ","noanbud@DELOITTE.no"]
[{"$f":"Database!$B1162&Database!$C1162&Database!$D1162","v":"Sør-Øst RHFD: Informasjonssikkerhet og ROS-analyser6"},"Sør-Øst RHF","D: Informasjonssikkerhet og ROS-analyser",6,"Emagine AS ","sykehusinnkjop@emagine.no"]
[{"$f":"Database!$B1163&Database!$C1163&Database!$D1163","v":"Sør-Øst RHFD: Informasjonssikkerhet og ROS-analyser7"},"Sør-Øst RHF","D: Informasjonssikkerhet og ROS-analyser",7,"Ernst & Young AS ","offentlige.anskaffelser@no.ey.com"]
[{"$f":"Database!$B1164&Database!$C1164&Database!$D1164","v":"Sør-Øst RHFD: Informasjonssikkerhet og ROS-analyser8"},"Sør-Øst RHF","D: Informasjonssikkerhet og ROS-analyser",8,"Ework Group Norway AS ","sykehusinnkjop@eworkgroup.com  "]
[{"$f":"Database!$B1165&Database!$C1165&Database!$D1165","v":"Sør-Øst RHFD: Informasjonssikkerhet og ROS-analyser9"},"Sør-Øst RHF","D: Informasjonssikkerhet og ROS-analyser",9,"Experis AS ","sykehusinnkjop@no.experis.com"]
[{"$f":"Database!$B1166&Database!$C1166&Database!$D1166","v":"Sør-Øst RHFD: Informasjonssikkerhet og ROS-analyser10"},"Sør-Øst RHF","D: Informasjonssikkerhet og ROS-analyser",10,"IT Consult AS ","firmapost@itc.no"]
[{"$f":"Database!$B1167&Database!$C1167&Database!$D1167","v":"Sør-Øst RHFD: Informasjonssikkerhet og ROS-analyser11"},"Sør-Øst RHF","D: Informasjonssikkerhet og ROS-analyser",11,"KPMG AS ","helse@kpmg.no"]
[{"$f":"Database!$B1168&Database!$C1168&Database!$D1168","v":"Sør-Øst RHFD: Informasjonssikkerhet og ROS-analyser12"},"Sør-Øst RHF","D: Informasjonssikkerhet og ROS-analyser",12,"PricewaterhouseCoopers AS ","no_resepsjon.oslo@pwc.com"]
[{"$f":"Database!$B1169&Database!$C1169&Database!$D1169","v":"Sør-Øst RHFD: Informasjonssikkerhet og ROS-analyser13"},"Sør-Øst RHF","D: Informasjonssikkerhet og ROS-analyser",13,"Sopra Steria AS ","helse@soprasteria.com"]
[{"$f":"Database!$B1170&Database!$C1170&Database!$D1170","v":"Sør-Øst RHFD: Informasjonssikkerhet og ROS-analyser14"},"Sør-Øst RHF","D: Informasjonssikkerhet og ROS-analyser",14,"Advisense AS","offentlig@transcendentgroup.com "]
[{"$f":"Database!$B1171&Database!$C1171&Database!$D1171","v":"Sør-Øst RHFD: Informasjonssikkerhet og ROS-analyser15"},"Sør-Øst RHF","D: Informasjonssikkerhet og ROS-analyser",15,null,""]
[{"$f":"Database!$B1172&Database!$C1172&Database!$D1172","v":"Sør-Øst RHFD: Informasjonssikkerhet og ROS-analyser16"},"Sør-Øst RHF","D: Informasjonssikkerhet og ROS-analyser",16,null,""]
[{"$f":"Database!$B1173&Database!$C1173&Database!$D1173","v":"Sør-Øst RHFD: Informasjonssikkerhet og ROS-analyser17"},"Sør-Øst RHF","D: Informasjonssikkerhet og ROS-analyser",17,null,""]
[{"$f":"Database!$B1174&Database!$C1174&Database!$D1174","v":"Sør-Øst RHFD: Informasjonssikkerhet og ROS-analyser18"},"Sør-Øst RHF","D: Informasjonssikkerhet og ROS-analyser",18,null,""]
[{"$f":"Database!$B1175&Database!$C1175&Database!$D1175","v":"Sør-Øst RHFD: Informasjonssikkerhet og ROS-analyser19"},"Sør-Øst RHF","D: Informasjonssikkerhet og ROS-analyser",19,null,""]
[{"$f":"Database!$B1176&Database!$C1176&Database!$D1176","v":"Sør-Øst RHFD: Informasjonssikkerhet og ROS-analyser20"},"Sør-Øst RHF","D: Informasjonssikkerhet og ROS-analyser",20,null,""]
[{"$f":"Database!$B1177&Database!$C1177&Database!$D1177","v":"Sør-Øst RHFD: Informasjonssikkerhet og ROS-analyser21"},"Sør-Øst RHF","D: Informasjonssikkerhet og ROS-analyser",21,null,""]
[{"$f":"Database!$B1178&Database!$C1178&Database!$D1178","v":"Sør-Øst RHFD: Informasjonssikkerhet og ROS-analyser22"},"Sør-Øst RHF","D: Informasjonssikkerhet og ROS-analyser",22,null,""]
[{"$f":"Database!$B1179&Database!$C1179&Database!$D1179","v":"Sør-Øst RHFD: Informasjonssikkerhet og ROS-analyser23"},"Sør-Øst RHF","D: Informasjonssikkerhet og ROS-analyser",23,null,""]
[{"$f":"Database!$B1180&Database!$C1180&Database!$D1180","v":"Sør-Øst RHFD: Informasjonssikkerhet og ROS-analyser24"},"Sør-Øst RHF","D: Informasjonssikkerhet og ROS-analyser",24,null,""]
[{"$f":"Database!$B1181&Database!$C1181&Database!$D1181","v":"Sør-Øst RHFD: Informasjonssikkerhet og ROS-analyser25"},"Sør-Øst RHF","D: Informasjonssikkerhet og ROS-analyser",25,null,""]
[{"$f":"Database!$B1182&Database!$C1182&Database!$D1182","v":"Sør-Øst RHFD: Informasjonssikkerhet og ROS-analyser26"},"Sør-Øst RHF","D: Informasjonssikkerhet og ROS-analyser",26,null,""]
[{"$f":"Database!$B1183&Database!$C1183&Database!$D1183","v":"Sør-Øst RHFD: Informasjonssikkerhet og ROS-analyser27"},"Sør-Øst RHF","D: Informasjonssikkerhet og ROS-analyser",27,null,""]
[{"$f":"Database!$B1184&Database!$C1184&Database!$D1184","v":"Sør-Øst RHFD: Informasjonssikkerhet og ROS-analyser28"},"Sør-Øst RHF","D: Informasjonssikkerhet og ROS-analyser",28,null,""]
[{"$f":"Database!$B1185&Database!$C1185&Database!$D1185","v":"Sør-Øst RHFD: Informasjonssikkerhet og ROS-analyser29"},"Sør-Øst RHF","D: Informasjonssikkerhet og ROS-analyser",29,null,""]
[{"$f":"Database!$B1186&Database!$C1186&Database!$D1186","v":"Sør-Øst RHFD: Informasjonssikkerhet og ROS-analyser30"},"Sør-Øst RHF","D: Informasjonssikkerhet og ROS-analyser",30,null,""]
[{"$f":"Database!$B1187&Database!$C1187&Database!$D1187","v":"Sør-Øst RHFD: Informasjonssikkerhet og ROS-analyser31"},"Sør-Øst RHF","D: Informasjonssikkerhet og ROS-analyser",31,null,""]
[{"$f":"Database!$B1188&Database!$C1188&Database!$D1188","v":"Sør-Øst RHFD: Informasjonssikkerhet og ROS-analyser32"},"Sør-Øst RHF","D: Informasjonssikkerhet og ROS-analyser",32,null,""]
[{"$f":"Database!$B1189&Database!$C1189&Database!$D1189","v":"Sør-Øst RHFD: Informasjonssikkerhet og ROS-analyser33"},"Sør-Øst RHF","D: Informasjonssikkerhet og ROS-analyser",33,null,""]
[{"$f":"Database!$B1190&Database!$C1190&Database!$D1190","v":"Sør-Øst RHFD: Informasjonssikkerhet og ROS-analyser34"},"Sør-Øst RHF","D: Informasjonssikkerhet og ROS-analyser",34,null,""]
[null,null,null,null,null,""]
[{"$f":"Database!$B1192&Database!$C1192&Database!$D1192","v":"Sør-Øst RHFE: Test og release1"},"Sør-Øst RHF","E: Test og release",1,"Aboveit AS ","salg@aboveit.no "]
[{"$f":"Database!$B1193&Database!$C1193&Database!$D1193","v":"Sør-Øst RHFE: Test og release2"},"Sør-Øst RHF","E: Test og release",2,"Systra Norge AS ","firmapost@systra.com"]
[{"$f":"Database!$B1194&Database!$C1194&Database!$D1194","v":"Sør-Øst RHFE: Test og release3"},"Sør-Øst RHF","E: Test og release",3,"Bouvet Norge AS ","Sykehusinnkjop2023@bouvet.no"]
[{"$f":"Database!$B1195&Database!$C1195&Database!$D1195","v":"Sør-Øst RHFE: Test og release4"},"Sør-Øst RHF","E: Test og release",4,"Capgemini Norge AS ","helsenord.no@capgemini.com"]
[{"$f":"Database!$B1196&Database!$C1196&Database!$D1196","v":"Sør-Øst RHFE: Test og release5"},"Sør-Øst RHF","E: Test og release",5,"Deloitte AS ","noanbud@DELOITTE.no"]
[{"$f":"Database!$B1197&Database!$C1197&Database!$D1197","v":"Sør-Øst RHFE: Test og release6"},"Sør-Øst RHF","E: Test og release",6,"Ework Group Norway AS ","sykehusinnkjop@eworkgroup.com  "]
[{"$f":"Database!$B1198&Database!$C1198&Database!$D1198","v":"Sør-Øst RHFE: Test og release7"},"Sør-Øst RHF","E: Test og release",7,"Experis AS ","sykehusinnkjop@no.experis.com"]
[{"$f":"Database!$B1199&Database!$C1199&Database!$D1199","v":"Sør-Øst RHFE: Test og release8"},"Sør-Øst RHF","E: Test og release",8,"IT Consult AS ","firmapost@itc.no"]
[{"$f":"Database!$B1200&Database!$C1200&Database!$D1200","v":"Sør-Øst RHFE: Test og release9"},"Sør-Øst RHF","E: Test og release",9,"Netcompany AS ","anbud.no@netcompany.com "]
[{"$f":"Database!$B1201&Database!$C1201&Database!$D1201","v":"Sør-Øst RHFE: Test og release10"},"Sør-Øst RHF","E: Test og release",10,"SOCO Norge AS ","post@soco.no"]
[{"$f":"Database!$B1202&Database!$C1202&Database!$D1202","v":"Sør-Øst RHFE: Test og release11"},"Sør-Øst RHF","E: Test og release",11,"Sopra Steria AS ","helse@soprasteria.com"]
[{"$f":"Database!$B1203&Database!$C1203&Database!$D1203","v":"Sør-Øst RHFE: Test og release12"},"Sør-Øst RHF","E: Test og release",12,null,""]
[{"$f":"Database!$B1204&Database!$C1204&Database!$D1204","v":"Sør-Øst RHFE: Test og release13"},"Sør-Øst RHF","E: Test og release",13,null,""]
[{"$f":"Database!$B1205&Database!$C1205&Database!$D1205","v":"Sør-Øst RHFE: Test og release14"},"Sør-Øst RHF","E: Test og release",14,null,""]
[{"$f":"Database!$B1206&Database!$C1206&Database!$D1206","v":"Sør-Øst RHFE: Test og release15"},"Sør-Øst RHF","E: Test og release",15,null,""]
[{"$f":"Database!$B1207&Database!$C1207&Database!$D1207","v":"Sør-Øst RHFE: Test og release16"},"Sør-Øst RHF","E: Test og release",16,null,""]
[{"$f":"Database!$B1208&Database!$C1208&Database!$D1208","v":"Sør-Øst RHFE: Test og release17"},"Sør-Øst RHF","E: Test og release",17,null,""]
[{"$f":"Database!$B1209&Database!$C1209&Database!$D1209","v":"Sør-Øst RHFE: Test og release18"},"Sør-Øst RHF","E: Test og release",18,null,""]
[{"$f":"Database!$B1210&Database!$C1210&Database!$D1210","v":"Sør-Øst RHFE: Test og release19"},"Sør-Øst RHF","E: Test og release",19,null,""]
[{"$f":"Database!$B1211&Database!$C1211&Database!$D1211","v":"Sør-Øst RHFE: Test og release20"},"Sør-Øst RHF","E: Test og release",20,null,""]
[{"$f":"Database!$B1212&Database!$C1212&Database!$D1212","v":"Sør-Øst RHFE: Test og release21"},"Sør-Øst RHF","E: Test og release",21,null,""]
[{"$f":"Database!$B1213&Database!$C1213&Database!$D1213","v":"Sør-Øst RHFE: Test og release22"},"Sør-Øst RHF","E: Test og release",22,null,""]
[{"$f":"Database!$B1214&Database!$C1214&Database!$D1214","v":"Sør-Øst RHFE: Test og release23"},"Sør-Øst RHF","E: Test og release",23,null,""]
[{"$f":"Database!$B1215&Database!$C1215&Database!$D1215","v":"Sør-Øst RHFE: Test og release24"},"Sør-Øst RHF","E: Test og release",24,null,""]
[{"$f":"Database!$B1216&Database!$C1216&Database!$D1216","v":"Sør-Øst RHFE: Test og release25"},"Sør-Øst RHF","E: Test og release",25,null,""]
[{"$f":"Database!$B1217&Database!$C1217&Database!$D1217","v":"Sør-Øst RHFE: Test og release26"},"Sør-Øst RHF","E: Test og release",26,null,""]
[{"$f":"Database!$B1218&Database!$C1218&Database!$D1218","v":"Sør-Øst RHFE: Test og release27"},"Sør-Øst RHF","E: Test og release",27,null,""]
[{"$f":"Database!$B1219&Database!$C1219&Database!$D1219","v":"Sør-Øst RHFE: Test og release28"},"Sør-Øst RHF","E: Test og release",28,null,""]
[{"$f":"Database!$B1220&Database!$C1220&Database!$D1220","v":"Sør-Øst RHFE: Test og release29"},"Sør-Øst RHF","E: Test og release",29,null,""]
[{"$f":"Database!$B1221&Database!$C1221&Database!$D1221","v":"Sør-Øst RHFE: Test og release30"},"Sør-Øst RHF","E: Test og release",30,null,""]
[{"$f":"Database!$B1222&Database!$C1222&Database!$D1222","v":"Sør-Øst RHFE: Test og release31"},"Sør-Øst RHF","E: Test og release",31,null,""]
[{"$f":"Database!$B1223&Database!$C1223&Database!$D1223","v":"Sør-Øst RHFE: Test og release32"},"Sør-Øst RHF","E: Test og release",32,null,""]
[{"$f":"Database!$B1224&Database!$C1224&Database!$D1224","v":"Sør-Øst RHFE: Test og release33"},"Sør-Øst RHF","E: Test og release",33,null,""]
[{"$f":"Database!$B1225&Database!$C1225&Database!$D1225","v":"Sør-Øst RHFE: Test og release34"},"Sør-Øst RHF","E: Test og release",34,null,""]
[null,null,null,null,null,""]
[{"$f":"Database!$B1227&Database!$C1227&Database!$D1227","v":"Sør-Øst RHFF: Systemutvikling1"},"Sør-Øst RHF","F: Systemutvikling",1,"Aboveit AS ","salg@aboveit.no "]
[{"$f":"Database!$B1228&Database!$C1228&Database!$D1228","v":"Sør-Øst RHFF: Systemutvikling2"},"Sør-Øst RHF","F: Systemutvikling",2,"Systra Norge AS ","firmapost@systra.com"]
[{"$f":"Database!$B1229&Database!$C1229&Database!$D1229","v":"Sør-Øst RHFF: Systemutvikling3"},"Sør-Øst RHF","F: Systemutvikling",3,"Bouvet Norge AS ","Sykehusinnkjop2023@bouvet.no"]
[{"$f":"Database!$B1230&Database!$C1230&Database!$D1230","v":"Sør-Øst RHFF: Systemutvikling4"},"Sør-Øst RHF","F: Systemutvikling",4,"Capgemini Norge AS ","helsenord.no@capgemini.com"]
[{"$f":"Database!$B1231&Database!$C1231&Database!$D1231","v":"Sør-Øst RHFF: Systemutvikling5"},"Sør-Øst RHF","F: Systemutvikling",5,"Ework Group Norway AS ","sykehusinnkjop@eworkgroup.com  "]
[{"$f":"Database!$B1232&Database!$C1232&Database!$D1232","v":"Sør-Øst RHFF: Systemutvikling6"},"Sør-Øst RHF","F: Systemutvikling",6,"Experis AS ","sykehusinnkjop@no.experis.com"]
[{"$f":"Database!$B1233&Database!$C1233&Database!$D1233","v":"Sør-Øst RHFF: Systemutvikling7"},"Sør-Øst RHF","F: Systemutvikling",7,"IT Consult AS ","firmapost@itc.no"]
[{"$f":"Database!$B1234&Database!$C1234&Database!$D1234","v":"Sør-Øst RHFF: Systemutvikling8"},"Sør-Øst RHF","F: Systemutvikling",8,"KPMG AS ","helse@kpmg.no"]
[{"$f":"Database!$B1235&Database!$C1235&Database!$D1235","v":"Sør-Øst RHFF: Systemutvikling9"},"Sør-Øst RHF","F: Systemutvikling",9,"Netcompany AS ","anbud.no@netcompany.com "]
[{"$f":"Database!$B1236&Database!$C1236&Database!$D1236","v":"Sør-Øst RHFF: Systemutvikling10"},"Sør-Øst RHF","F: Systemutvikling",10,"Sopra Steria AS ","helse@soprasteria.com"]
[{"$f":"Database!$B1237&Database!$C1237&Database!$D1237","v":"Sør-Øst RHFF: Systemutvikling11"},"Sør-Øst RHF","F: Systemutvikling",11,"Twoday Conceptos AS ","salg.conceptos@twoday.com"]
[{"$f":"Database!$B1238&Database!$C1238&Database!$D1238","v":"Sør-Øst RHFF: Systemutvikling12"},"Sør-Øst RHF","F: Systemutvikling",12,null,""]
[{"$f":"Database!$B1239&Database!$C1239&Database!$D1239","v":"Sør-Øst RHFF: Systemutvikling13"},"Sør-Øst RHF","F: Systemutvikling",13,null,""]
[{"$f":"Database!$B1240&Database!$C1240&Database!$D1240","v":"Sør-Øst RHFF: Systemutvikling14"},"Sør-Øst RHF","F: Systemutvikling",14,null,""]
[{"$f":"Database!$B1241&Database!$C1241&Database!$D1241","v":"Sør-Øst RHFF: Systemutvikling15"},"Sør-Øst RHF","F: Systemutvikling",15,null,""]
[{"$f":"Database!$B1242&Database!$C1242&Database!$D1242","v":"Sør-Øst RHFF: Systemutvikling16"},"Sør-Øst RHF","F: Systemutvikling",16,null,""]
[{"$f":"Database!$B1243&Database!$C1243&Database!$D1243","v":"Sør-Øst RHFF: Systemutvikling17"},"Sør-Øst RHF","F: Systemutvikling",17,null,""]
[{"$f":"Database!$B1244&Database!$C1244&Database!$D1244","v":"Sør-Øst RHFF: Systemutvikling18"},"Sør-Øst RHF","F: Systemutvikling",18,null,""]
[{"$f":"Database!$B1245&Database!$C1245&Database!$D1245","v":"Sør-Øst RHFF: Systemutvikling19"},"Sør-Øst RHF","F: Systemutvikling",19,null,""]
[{"$f":"Database!$B1246&Database!$C1246&Database!$D1246","v":"Sør-Øst RHFF: Systemutvikling20"},"Sør-Øst RHF","F: Systemutvikling",20,null,""]
[{"$f":"Database!$B1247&Database!$C1247&Database!$D1247","v":"Sør-Øst RHFF: Systemutvikling21"},"Sør-Øst RHF","F: Systemutvikling",21,null,""]
[{"$f":"Database!$B1248&Database!$C1248&Database!$D1248","v":"Sør-Øst RHFF: Systemutvikling22"},"Sør-Øst RHF","F: Systemutvikling",22,null,""]
[{"$f":"Database!$B1249&Database!$C1249&Database!$D1249","v":"Sør-Øst RHFF: Systemutvikling23"},"Sør-Øst RHF","F: Systemutvikling",23,null,""]
[{"$f":"Database!$B1250&Database!$C1250&Database!$D1250","v":"Sør-Øst RHFF: Systemutvikling24"},"Sør-Øst RHF","F: Systemutvikling",24,null,""]
[{"$f":"Database!$B1251&Database!$C1251&Database!$D1251","v":"Sør-Øst RHFF: Systemutvikling25"},"Sør-Øst RHF","F: Systemutvikling",25,null,""]
[{"$f":"Database!$B1252&Database!$C1252&Database!$D1252","v":"Sør-Øst RHFF: Systemutvikling26"},"Sør-Øst RHF","F: Systemutvikling",26,null,""]
[{"$f":"Database!$B1253&Database!$C1253&Database!$D1253","v":"Sør-Øst RHFF: Systemutvikling27"},"Sør-Øst RHF","F: Systemutvikling",27,null,""]
[{"$f":"Database!$B1254&Database!$C1254&Database!$D1254","v":"Sør-Øst RHFF: Systemutvikling28"},"Sør-Øst RHF","F: Systemutvikling",28,null,""]
[{"$f":"Database!$B1255&Database!$C1255&Database!$D1255","v":"Sør-Øst RHFF: Systemutvikling29"},"Sør-Øst RHF","F: Systemutvikling",29,null,""]
[{"$f":"Database!$B1256&Database!$C1256&Database!$D1256","v":"Sør-Øst RHFF: Systemutvikling30"},"Sør-Øst RHF","F: Systemutvikling",30,null,""]
[{"$f":"Database!$B1257&Database!$C1257&Database!$D1257","v":"Sør-Øst RHFF: Systemutvikling31"},"Sør-Øst RHF","F: Systemutvikling",31,null,""]
[{"$f":"Database!$B1258&Database!$C1258&Database!$D1258","v":"Sør-Øst RHFF: Systemutvikling32"},"Sør-Øst RHF","F: Systemutvikling",32,null,""]
[{"$f":"Database!$B1259&Database!$C1259&Database!$D1259","v":"Sør-Øst RHFF: Systemutvikling33"},"Sør-Øst RHF","F: Systemutvikling",33,null,""]
[{"$f":"Database!$B1260&Database!$C1260&Database!$D1260","v":"Sør-Øst RHFF: Systemutvikling34"},"Sør-Øst RHF","F: Systemutvikling",34,null,""]
[null,null,null,null,null,""]
[{"$f":"Database!$B1262&Database!$C1262&Database!$D1262","v":"Sør-Øst RHFG: Applikasjonsforvaltning, drift og forvaltning av IT-systemer og plattformer1"},"Sør-Øst RHF","G: Applikasjonsforvaltning, drift og forvaltning av IT-systemer og plattformer",1,"A-2 Norge AS","utlysninger@a-2.no"]
[{"$f":"Database!$B1263&Database!$C1263&Database!$D1263","v":"Sør-Øst RHFG: Applikasjonsforvaltning, drift og forvaltning av IT-systemer og plattformer2"},"Sør-Øst RHF","G: Applikasjonsforvaltning, drift og forvaltning av IT-systemer og plattformer",2,"Bouvet Norge AS ","Sykehusinnkjop2023@bouvet.no"]
[{"$f":"Database!$B1264&Database!$C1264&Database!$D1264","v":"Sør-Øst RHFG: Applikasjonsforvaltning, drift og forvaltning av IT-systemer og plattformer3"},"Sør-Øst RHF","G: Applikasjonsforvaltning, drift og forvaltning av IT-systemer og plattformer",3,"Crayon AS ","firmapost@crayon.com"]
[{"$f":"Database!$B1265&Database!$C1265&Database!$D1265","v":"Sør-Øst RHFG: Applikasjonsforvaltning, drift og forvaltning av IT-systemer og plattformer4"},"Sør-Øst RHF","G: Applikasjonsforvaltning, drift og forvaltning av IT-systemer og plattformer",4,"Ework Group Norway AS ","sykehusinnkjop@eworkgroup.com  "]
[{"$f":"Database!$B1266&Database!$C1266&Database!$D1266","v":"Sør-Øst RHFG: Applikasjonsforvaltning, drift og forvaltning av IT-systemer og plattformer5"},"Sør-Øst RHF","G: Applikasjonsforvaltning, drift og forvaltning av IT-systemer og plattformer",5,"Experis AS ","sykehusinnkjop@no.experis.com"]
[{"$f":"Database!$B1267&Database!$C1267&Database!$D1267","v":"Sør-Øst RHFG: Applikasjonsforvaltning, drift og forvaltning av IT-systemer og plattformer6"},"Sør-Øst RHF","G: Applikasjonsforvaltning, drift og forvaltning av IT-systemer og plattformer",6,"IT Consult AS ","firmapost@itc.no"]
[{"$f":"Database!$B1268&Database!$C1268&Database!$D1268","v":"Sør-Øst RHFG: Applikasjonsforvaltning, drift og forvaltning av IT-systemer og plattformer7"},"Sør-Øst RHF","G: Applikasjonsforvaltning, drift og forvaltning av IT-systemer og plattformer",7,"Netcompany AS ","anbud.no@netcompany.com "]
[{"$f":"Database!$B1269&Database!$C1269&Database!$D1269","v":"Sør-Øst RHFG: Applikasjonsforvaltning, drift og forvaltning av IT-systemer og plattformer8"},"Sør-Øst RHF","G: Applikasjonsforvaltning, drift og forvaltning av IT-systemer og plattformer",8,"Sopra Steria AS ","helse@soprasteria.com"]
[{"$f":"Database!$B1270&Database!$C1270&Database!$D1270","v":"Sør-Øst RHFG: Applikasjonsforvaltning, drift og forvaltning av IT-systemer og plattformer9"},"Sør-Øst RHF","G: Applikasjonsforvaltning, drift og forvaltning av IT-systemer og plattformer",9,null,""]
[{"$f":"Database!$B1271&Database!$C1271&Database!$D1271","v":"Sør-Øst RHFG: Applikasjonsforvaltning, drift og forvaltning av IT-systemer og plattformer10"},"Sør-Øst RHF","G: Applikasjonsforvaltning, drift og forvaltning av IT-systemer og plattformer",10,null,""]
[{"$f":"Database!$B1272&Database!$C1272&Database!$D1272","v":"Sør-Øst RHFG: Applikasjonsforvaltning, drift og forvaltning av IT-systemer og plattformer11"},"Sør-Øst RHF","G: Applikasjonsforvaltning, drift og forvaltning av IT-systemer og plattformer",11,null,""]
[{"$f":"Database!$B1273&Database!$C1273&Database!$D1273","v":"Sør-Øst RHFG: Applikasjonsforvaltning, drift og forvaltning av IT-systemer og plattformer12"},"Sør-Øst RHF","G: Applikasjonsforvaltning, drift og forvaltning av IT-systemer og plattformer",12,null,""]
[{"$f":"Database!$B1274&Database!$C1274&Database!$D1274","v":"Sør-Øst RHFG: Applikasjonsforvaltning, drift og forvaltning av IT-systemer og plattformer13"},"Sør-Øst RHF","G: Applikasjonsforvaltning, drift og forvaltning av IT-systemer og plattformer",13,null,""]
[{"$f":"Database!$B1275&Database!$C1275&Database!$D1275","v":"Sør-Øst RHFG: Applikasjonsforvaltning, drift og forvaltning av IT-systemer og plattformer14"},"Sør-Øst RHF","G: Applikasjonsforvaltning, drift og forvaltning av IT-systemer og plattformer",14,null,""]
[{"$f":"Database!$B1276&Database!$C1276&Database!$D1276","v":"Sør-Øst RHFG: Applikasjonsforvaltning, drift og forvaltning av IT-systemer og plattformer15"},"Sør-Øst RHF","G: Applikasjonsforvaltning, drift og forvaltning av IT-systemer og plattformer",15,null,""]
[{"$f":"Database!$B1277&Database!$C1277&Database!$D1277","v":"Sør-Øst RHFG: Applikasjonsforvaltning, drift og forvaltning av IT-systemer og plattformer16"},"Sør-Øst RHF","G: Applikasjonsforvaltning, drift og forvaltning av IT-systemer og plattformer",16,null,""]
[{"$f":"Database!$B1278&Database!$C1278&Database!$D1278","v":"Sør-Øst RHFG: Applikasjonsforvaltning, drift og forvaltning av IT-systemer og plattformer17"},"Sør-Øst RHF","G: Applikasjonsforvaltning, drift og forvaltning av IT-systemer og plattformer",17,null,""]
[{"$f":"Database!$B1279&Database!$C1279&Database!$D1279","v":"Sør-Øst RHFG: Applikasjonsforvaltning, drift og forvaltning av IT-systemer og plattformer18"},"Sør-Øst RHF","G: Applikasjonsforvaltning, drift og forvaltning av IT-systemer og plattformer",18,null,""]
[{"$f":"Database!$B1280&Database!$C1280&Database!$D1280","v":"Sør-Øst RHFG: Applikasjonsforvaltning, drift og forvaltning av IT-systemer og plattformer19"},"Sør-Øst RHF","G: Applikasjonsforvaltning, drift og forvaltning av IT-systemer og plattformer",19,null,""]
[{"$f":"Database!$B1281&Database!$C1281&Database!$D1281","v":"Sør-Øst RHFG: Applikasjonsforvaltning, drift og forvaltning av IT-systemer og plattformer20"},"Sør-Øst RHF","G: Applikasjonsforvaltning, drift og forvaltning av IT-systemer og plattformer",20,null,""]
[{"$f":"Database!$B1282&Database!$C1282&Database!$D1282","v":"Sør-Øst RHFG: Applikasjonsforvaltning, drift og forvaltning av IT-systemer og plattformer21"},"Sør-Øst RHF","G: Applikasjonsforvaltning, drift og forvaltning av IT-systemer og plattformer",21,null,""]
[{"$f":"Database!$B1283&Database!$C1283&Database!$D1283","v":"Sør-Øst RHFG: Applikasjonsforvaltning, drift og forvaltning av IT-systemer og plattformer22"},"Sør-Øst RHF","G: Applikasjonsforvaltning, drift og forvaltning av IT-systemer og plattformer",22,null,""]
[{"$f":"Database!$B1284&Database!$C1284&Database!$D1284","v":"Sør-Øst RHFG: Applikasjonsforvaltning, drift og forvaltning av IT-systemer og plattformer23"},"Sør-Øst RHF","G: Applikasjonsforvaltning, drift og forvaltning av IT-systemer og plattformer",23,null,""]
[{"$f":"Database!$B1285&Database!$C1285&Database!$D1285","v":"Sør-Øst RHFG: Applikasjonsforvaltning, drift og forvaltning av IT-systemer og plattformer24"},"Sør-Øst RHF","G: Applikasjonsforvaltning, drift og forvaltning av IT-systemer og plattformer",24,null,""]
[{"$f":"Database!$B1286&Database!$C1286&Database!$D1286","v":"Sør-Øst RHFG: Applikasjonsforvaltning, drift og forvaltning av IT-systemer og plattformer25"},"Sør-Øst RHF","G: Applikasjonsforvaltning, drift og forvaltning av IT-systemer og plattformer",25,null,""]
[{"$f":"Database!$B1287&Database!$C1287&Database!$D1287","v":"Sør-Øst RHFG: Applikasjonsforvaltning, drift og forvaltning av IT-systemer og plattformer26"},"Sør-Øst RHF","G: Applikasjonsforvaltning, drift og forvaltning av IT-systemer og plattformer",26,null,""]
[{"$f":"Database!$B1288&Database!$C1288&Database!$D1288","v":"Sør-Øst RHFG: Applikasjonsforvaltning, drift og forvaltning av IT-systemer og plattformer27"},"Sør-Øst RHF","G: Applikasjonsforvaltning, drift og forvaltning av IT-systemer og plattformer",27,null,""]
[{"$f":"Database!$B1289&Database!$C1289&Database!$D1289","v":"Sør-Øst RHFG: Applikasjonsforvaltning, drift og forvaltning av IT-systemer og plattformer28"},"Sør-Øst RHF","G: Applikasjonsforvaltning, drift og forvaltning av IT-systemer og plattformer",28,null,""]
[{"$f":"Database!$B1290&Database!$C1290&Database!$D1290","v":"Sør-Øst RHFG: Applikasjonsforvaltning, drift og forvaltning av IT-systemer og plattformer29"},"Sør-Øst RHF","G: Applikasjonsforvaltning, drift og forvaltning av IT-systemer og plattformer",29,null,""]
[{"$f":"Database!$B1291&Database!$C1291&Database!$D1291","v":"Sør-Øst RHFG: Applikasjonsforvaltning, drift og forvaltning av IT-systemer og plattformer30"},"Sør-Øst RHF","G: Applikasjonsforvaltning, drift og forvaltning av IT-systemer og plattformer",30,null,""]
[{"$f":"Database!$B1292&Database!$C1292&Database!$D1292","v":"Sør-Øst RHFG: Applikasjonsforvaltning, drift og forvaltning av IT-systemer og plattformer31"},"Sør-Øst RHF","G: Applikasjonsforvaltning, drift og forvaltning av IT-systemer og plattformer",31,null,""]
[{"$f":"Database!$B1293&Database!$C1293&Database!$D1293","v":"Sør-Øst RHFG: Applikasjonsforvaltning, drift og forvaltning av IT-systemer og plattformer32"},"Sør-Øst RHF","G: Applikasjonsforvaltning, drift og forvaltning av IT-systemer og plattformer",32,null,""]
[{"$f":"Database!$B1294&Database!$C1294&Database!$D1294","v":"Sør-Øst RHFG: Applikasjonsforvaltning, drift og forvaltning av IT-systemer og plattformer33"},"Sør-Øst RHF","G: Applikasjonsforvaltning, drift og forvaltning av IT-systemer og plattformer",33,null,""]
[{"$f":"Database!$B1295&Database!$C1295&Database!$D1295","v":"Sør-Øst RHFG: Applikasjonsforvaltning, drift og forvaltning av IT-systemer og plattformer34"},"Sør-Øst RHF","G: Applikasjonsforvaltning, drift og forvaltning av IT-systemer og plattformer",34,null,""]
[null,null,null,null,null,""]
[{"$f":"Database!$B1297&Database!$C1297&Database!$D1297","v":"Sør-Øst RHFH: Nettverk1"},"Sør-Øst RHF","H: Nettverk",1,"A-2 Norge AS","utlysninger@a-2.no"]
[{"$f":"Database!$B1298&Database!$C1298&Database!$D1298","v":"Sør-Øst RHFH: Nettverk2"},"Sør-Øst RHF","H: Nettverk",2,"Conscia Norge AS ","salg@conscia.no "]
[{"$f":"Database!$B1299&Database!$C1299&Database!$D1299","v":"Sør-Øst RHFH: Nettverk3"},"Sør-Øst RHF","H: Nettverk",3,"Emagine AS ","sykehusinnkjop@emagine.no"]
[{"$f":"Database!$B1300&Database!$C1300&Database!$D1300","v":"Sør-Øst RHFH: Nettverk4"},"Sør-Øst RHF","H: Nettverk",4,"Ework Group Norway AS ","sykehusinnkjop@eworkgroup.com  "]
[{"$f":"Database!$B1301&Database!$C1301&Database!$D1301","v":"Sør-Øst RHFH: Nettverk5"},"Sør-Øst RHF","H: Nettverk",5,"Experis AS ","sykehusinnkjop@no.experis.com"]
[{"$f":"Database!$B1302&Database!$C1302&Database!$D1302","v":"Sør-Øst RHFH: Nettverk6"},"Sør-Øst RHF","H: Nettverk",6,"IT Consult AS ","firmapost@itc.no"]
[{"$f":"Database!$B1303&Database!$C1303&Database!$D1303","v":"Sør-Øst RHFH: Nettverk7"},"Sør-Øst RHF","H: Nettverk",7,"NetNordic Norway AS ","salg@netnordic.no"]
[{"$f":"Database!$B1304&Database!$C1304&Database!$D1304","v":"Sør-Øst RHFH: Nettverk8"},"Sør-Øst RHF","H: Nettverk",8,"Sopra Steria AS ","helse@soprasteria.com"]
[{"$f":"Database!$B1305&Database!$C1305&Database!$D1305","v":"Sør-Øst RHFH: Nettverk9"},"Sør-Øst RHF","H: Nettverk",9,null,""]
[{"$f":"Database!$B1306&Database!$C1306&Database!$D1306","v":"Sør-Øst RHFH: Nettverk10"},"Sør-Øst RHF","H: Nettverk",10,null,""]
[{"$f":"Database!$B1307&Database!$C1307&Database!$D1307","v":"Sør-Øst RHFH: Nettverk11"},"Sør-Øst RHF","H: Nettverk",11,null,""]
[{"$f":"Database!$B1308&Database!$C1308&Database!$D1308","v":"Sør-Øst RHFH: Nettverk12"},"Sør-Øst RHF","H: Nettverk",12,null,""]
[{"$f":"Database!$B1309&Database!$C1309&Database!$D1309","v":"Sør-Øst RHFH: Nettverk13"},"Sør-Øst RHF","H: Nettverk",13,null,""]
[{"$f":"Database!$B1310&Database!$C1310&Database!$D1310","v":"Sør-Øst RHFH: Nettverk14"},"Sør-Øst RHF","H: Nettverk",14,null,""]
[{"$f":"Database!$B1311&Database!$C1311&Database!$D1311","v":"Sør-Øst RHFH: Nettverk15"},"Sør-Øst RHF","H: Nettverk",15,null,""]
[{"$f":"Database!$B1312&Database!$C1312&Database!$D1312","v":"Sør-Øst RHFH: Nettverk16"},"Sør-Øst RHF","H: Nettverk",16,null,""]
[{"$f":"Database!$B1313&Database!$C1313&Database!$D1313","v":"Sør-Øst RHFH: Nettverk17"},"Sør-Øst RHF","H: Nettverk",17,null,""]
[{"$f":"Database!$B1314&Database!$C1314&Database!$D1314","v":"Sør-Øst RHFH: Nettverk18"},"Sør-Øst RHF","H: Nettverk",18,null,""]
[{"$f":"Database!$B1315&Database!$C1315&Database!$D1315","v":"Sør-Øst RHFH: Nettverk19"},"Sør-Øst RHF","H: Nettverk",19,null,""]
[{"$f":"Database!$B1316&Database!$C1316&Database!$D1316","v":"Sør-Øst RHFH: Nettverk20"},"Sør-Øst RHF","H: Nettverk",20,null,""]
[{"$f":"Database!$B1317&Database!$C1317&Database!$D1317","v":"Sør-Øst RHFH: Nettverk21"},"Sør-Øst RHF","H: Nettverk",21,null,""]
[{"$f":"Database!$B1318&Database!$C1318&Database!$D1318","v":"Sør-Øst RHFH: Nettverk22"},"Sør-Øst RHF","H: Nettverk",22,null,""]
[{"$f":"Database!$B1319&Database!$C1319&Database!$D1319","v":"Sør-Øst RHFH: Nettverk23"},"Sør-Øst RHF","H: Nettverk",23,null,""]
[{"$f":"Database!$B1320&Database!$C1320&Database!$D1320","v":"Sør-Øst RHFH: Nettverk24"},"Sør-Øst RHF","H: Nettverk",24,null,""]
[{"$f":"Database!$B1321&Database!$C1321&Database!$D1321","v":"Sør-Øst RHFH: Nettverk25"},"Sør-Øst RHF","H: Nettverk",25,null,""]
[{"$f":"Database!$B1322&Database!$C1322&Database!$D1322","v":"Sør-Øst RHFH: Nettverk26"},"Sør-Øst RHF","H: Nettverk",26,null,""]
[{"$f":"Database!$B1323&Database!$C1323&Database!$D1323","v":"Sør-Øst RHFH: Nettverk27"},"Sør-Øst RHF","H: Nettverk",27,null,""]
[{"$f":"Database!$B1324&Database!$C1324&Database!$D1324","v":"Sør-Øst RHFH: Nettverk28"},"Sør-Øst RHF","H: Nettverk",28,null,""]
[{"$f":"Database!$B1325&Database!$C1325&Database!$D1325","v":"Sør-Øst RHFH: Nettverk29"},"Sør-Øst RHF","H: Nettverk",29,null,""]
[{"$f":"Database!$B1326&Database!$C1326&Database!$D1326","v":"Sør-Øst RHFH: Nettverk30"},"Sør-Øst RHF","H: Nettverk",30,null,""]
[{"$f":"Database!$B1327&Database!$C1327&Database!$D1327","v":"Sør-Øst RHFH: Nettverk31"},"Sør-Øst RHF","H: Nettverk",31,null,""]
[{"$f":"Database!$B1328&Database!$C1328&Database!$D1328","v":"Sør-Øst RHFH: Nettverk32"},"Sør-Øst RHF","H: Nettverk",32,null,""]
[{"$f":"Database!$B1329&Database!$C1329&Database!$D1329","v":"Sør-Øst RHFH: Nettverk33"},"Sør-Øst RHF","H: Nettverk",33,null,""]
[{"$f":"Database!$B1330&Database!$C1330&Database!$D1330","v":"Sør-Øst RHFH: Nettverk34"},"Sør-Øst RHF","H: Nettverk",34,null,""]
[null,null,null,null,null,""]
[{"$f":"Database!$B1332&Database!$C1332&Database!$D1332","v":"Sør-Øst RHFI: Telekommunikasjon1"},"Sør-Øst RHF","I: Telekommunikasjon",1,"A-2 Norge AS","utlysninger@a-2.no"]
[{"$f":"Database!$B1333&Database!$C1333&Database!$D1333","v":"Sør-Øst RHFI: Telekommunikasjon2"},"Sør-Øst RHF","I: Telekommunikasjon",2,"Experis AS ","sykehusinnkjop@no.experis.com"]
[{"$f":"Database!$B1334&Database!$C1334&Database!$D1334","v":"Sør-Øst RHFI: Telekommunikasjon3"},"Sør-Øst RHF","I: Telekommunikasjon",3,"NetNordic Norway AS ","salg@netnordic.no"]
[{"$f":"Database!$B1335&Database!$C1335&Database!$D1335","v":"Sør-Øst RHFI: Telekommunikasjon4"},"Sør-Øst RHF","I: Telekommunikasjon",4,null,""]
[{"$f":"Database!$B1336&Database!$C1336&Database!$D1336","v":"Sør-Øst RHFI: Telekommunikasjon5"},"Sør-Øst RHF","I: Telekommunikasjon",5,null,""]
[{"$f":"Database!$B1337&Database!$C1337&Database!$D1337","v":"Sør-Øst RHFI: Telekommunikasjon6"},"Sør-Øst RHF","I: Telekommunikasjon",6,null,""]
[{"$f":"Database!$B1338&Database!$C1338&Database!$D1338","v":"Sør-Øst RHFI: Telekommunikasjon7"},"Sør-Øst RHF","I: Telekommunikasjon",7,null,""]
[{"$f":"Database!$B1339&Database!$C1339&Database!$D1339","v":"Sør-Øst RHFI: Telekommunikasjon8"},"Sør-Øst RHF","I: Telekommunikasjon",8,null,""]
[{"$f":"Database!$B1340&Database!$C1340&Database!$D1340","v":"Sør-Øst RHFI: Telekommunikasjon9"},"Sør-Øst RHF","I: Telekommunikasjon",9,null,""]
[{"$f":"Database!$B1341&Database!$C1341&Database!$D1341","v":"Sør-Øst RHFI: Telekommunikasjon10"},"Sør-Øst RHF","I: Telekommunikasjon",10,null,""]
[{"$f":"Database!$B1342&Database!$C1342&Database!$D1342","v":"Sør-Øst RHFI: Telekommunikasjon11"},"Sør-Øst RHF","I: Telekommunikasjon",11,null,""]
[{"$f":"Database!$B1343&Database!$C1343&Database!$D1343","v":"Sør-Øst RHFI: Telekommunikasjon12"},"Sør-Øst RHF","I: Telekommunikasjon",12,null,""]
[{"$f":"Database!$B1344&Database!$C1344&Database!$D1344","v":"Sør-Øst RHFI: Telekommunikasjon13"},"Sør-Øst RHF","I: Telekommunikasjon",13,null,""]
[{"$f":"Database!$B1345&Database!$C1345&Database!$D1345","v":"Sør-Øst RHFI: Telekommunikasjon14"},"Sør-Øst RHF","I: Telekommunikasjon",14,null,""]
[{"$f":"Database!$B1346&Database!$C1346&Database!$D1346","v":"Sør-Øst RHFI: Telekommunikasjon15"},"Sør-Øst RHF","I: Telekommunikasjon",15,null,""]
[{"$f":"Database!$B1347&Database!$C1347&Database!$D1347","v":"Sør-Øst RHFI: Telekommunikasjon16"},"Sør-Øst RHF","I: Telekommunikasjon",16,null,""]
[{"$f":"Database!$B1348&Database!$C1348&Database!$D1348","v":"Sør-Øst RHFI: Telekommunikasjon17"},"Sør-Øst RHF","I: Telekommunikasjon",17,null,""]
[{"$f":"Database!$B1349&Database!$C1349&Database!$D1349","v":"Sør-Øst RHFI: Telekommunikasjon18"},"Sør-Øst RHF","I: Telekommunikasjon",18,null,""]
[{"$f":"Database!$B1350&Database!$C1350&Database!$D1350","v":"Sør-Øst RHFI: Telekommunikasjon19"},"Sør-Øst RHF","I: Telekommunikasjon",19,null,""]
[{"$f":"Database!$B1351&Database!$C1351&Database!$D1351","v":"Sør-Øst RHFI: Telekommunikasjon20"},"Sør-Øst RHF","I: Telekommunikasjon",20,null,""]
[{"$f":"Database!$B1352&Database!$C1352&Database!$D1352","v":"Sør-Øst RHFI: Telekommunikasjon21"},"Sør-Øst RHF","I: Telekommunikasjon",21,null,""]
[{"$f":"Database!$B1353&Database!$C1353&Database!$D1353","v":"Sør-Øst RHFI: Telekommunikasjon22"},"Sør-Øst RHF","I: Telekommunikasjon",22,null,""]
[{"$f":"Database!$B1354&Database!$C1354&Database!$D1354","v":"Sør-Øst RHFI: Telekommunikasjon23"},"Sør-Øst RHF","I: Telekommunikasjon",23,null,""]
[{"$f":"Database!$B1355&Database!$C1355&Database!$D1355","v":"Sør-Øst RHFI: Telekommunikasjon24"},"Sør-Øst RHF","I: Telekommunikasjon",24,null,""]
[{"$f":"Database!$B1356&Database!$C1356&Database!$D1356","v":"Sør-Øst RHFI: Telekommunikasjon25"},"Sør-Øst RHF","I: Telekommunikasjon",25,null,""]
[{"$f":"Database!$B1357&Database!$C1357&Database!$D1357","v":"Sør-Øst RHFI: Telekommunikasjon26"},"Sør-Øst RHF","I: Telekommunikasjon",26,null,""]
[{"$f":"Database!$B1358&Database!$C1358&Database!$D1358","v":"Sør-Øst RHFI: Telekommunikasjon27"},"Sør-Øst RHF","I: Telekommunikasjon",27,null,""]
[{"$f":"Database!$B1359&Database!$C1359&Database!$D1359","v":"Sør-Øst RHFI: Telekommunikasjon28"},"Sør-Øst RHF","I: Telekommunikasjon",28,null,""]
[{"$f":"Database!$B1360&Database!$C1360&Database!$D1360","v":"Sør-Øst RHFI: Telekommunikasjon29"},"Sør-Øst RHF","I: Telekommunikasjon",29,null,""]
[{"$f":"Database!$B1361&Database!$C1361&Database!$D1361","v":"Sør-Øst RHFI: Telekommunikasjon30"},"Sør-Øst RHF","I: Telekommunikasjon",30,null,""]
[{"$f":"Database!$B1362&Database!$C1362&Database!$D1362","v":"Sør-Øst RHFI: Telekommunikasjon31"},"Sør-Øst RHF","I: Telekommunikasjon",31,null,""]
[{"$f":"Database!$B1363&Database!$C1363&Database!$D1363","v":"Sør-Øst RHFI: Telekommunikasjon32"},"Sør-Øst RHF","I: Telekommunikasjon",32,null,""]
[{"$f":"Database!$B1364&Database!$C1364&Database!$D1364","v":"Sør-Øst RHFI: Telekommunikasjon33"},"Sør-Øst RHF","I: Telekommunikasjon",33,null,""]
[{"$f":"Database!$B1365&Database!$C1365&Database!$D1365","v":"Sør-Øst RHFI: Telekommunikasjon34"},"Sør-Øst RHF","I: Telekommunikasjon",34,null,""]
[null,null,null,null,null,""]
[{"$f":"Database!$B1367&Database!$C1367&Database!$D1367","v":"Sør-Øst RHFJ: Tverrfaglige team1"},"Sør-Øst RHF","J: Tverrfaglige team",1,"A-2 Norge AS","utlysninger@a-2.no"]
[{"$f":"Database!$B1368&Database!$C1368&Database!$D1368","v":"Sør-Øst RHFJ: Tverrfaglige team2"},"Sør-Øst RHF","J: Tverrfaglige team",2,"Accenture AS ","rammeavtale.helse@accenture.com"]
[{"$f":"Database!$B1369&Database!$C1369&Database!$D1369","v":"Sør-Øst RHFJ: Tverrfaglige team3"},"Sør-Øst RHF","J: Tverrfaglige team",3,"Bouvet Norge AS ","Sykehusinnkjop2023@bouvet.no"]
[{"$f":"Database!$B1370&Database!$C1370&Database!$D1370","v":"Sør-Øst RHFJ: Tverrfaglige team4"},"Sør-Øst RHF","J: Tverrfaglige team",4,"Capgemini Norge AS ","helsenord.no@capgemini.com"]
[{"$f":"Database!$B1371&Database!$C1371&Database!$D1371","v":"Sør-Øst RHFJ: Tverrfaglige team5"},"Sør-Øst RHF","J: Tverrfaglige team",5,"Deloitte AS ","noanbud@DELOITTE.no"]
[{"$f":"Database!$B1372&Database!$C1372&Database!$D1372","v":"Sør-Øst RHFJ: Tverrfaglige team6"},"Sør-Øst RHF","J: Tverrfaglige team",6,"Ernst & Young AS ","offentlige.anskaffelser@no.ey.com"]
[{"$f":"Database!$B1373&Database!$C1373&Database!$D1373","v":"Sør-Øst RHFJ: Tverrfaglige team7"},"Sør-Øst RHF","J: Tverrfaglige team",7,"Netcompany AS ","anbud.no@netcompany.com "]
[{"$f":"Database!$B1374&Database!$C1374&Database!$D1374","v":"Sør-Øst RHFJ: Tverrfaglige team8"},"Sør-Øst RHF","J: Tverrfaglige team",8,"PricewaterhouseCoopers AS ","no_resepsjon.oslo@pwc.com"]
[{"$f":"Database!$B1375&Database!$C1375&Database!$D1375","v":"Sør-Øst RHFJ: Tverrfaglige team9"},"Sør-Øst RHF","J: Tverrfaglige team",9,"Sopra Steria AS ","helse@soprasteria.com"]
[{"$f":"Database!$B1376&Database!$C1376&Database!$D1376","v":"Sør-Øst RHFJ: Tverrfaglige team10"},"Sør-Øst RHF","J: Tverrfaglige team",10,null,""]
[{"$f":"Database!$B1377&Database!$C1377&Database!$D1377","v":"Sør-Øst RHFJ: Tverrfaglige team11"},"Sør-Øst RHF","J: Tverrfaglige team",11,null,""]
[{"$f":"Database!$B1378&Database!$C1378&Database!$D1378","v":"Sør-Øst RHFJ: Tverrfaglige team12"},"Sør-Øst RHF","J: Tverrfaglige team",12,null,""]
[{"$f":"Database!$B1379&Database!$C1379&Database!$D1379","v":"Sør-Øst RHFJ: Tverrfaglige team13"},"Sør-Øst RHF","J: Tverrfaglige team",13,null,""]
[{"$f":"Database!$B1380&Database!$C1380&Database!$D1380","v":"Sør-Øst RHFJ: Tverrfaglige team14"},"Sør-Øst RHF","J: Tverrfaglige team",14,null,""]
[{"$f":"Database!$B1381&Database!$C1381&Database!$D1381","v":"Sør-Øst RHFJ: Tverrfaglige team15"},"Sør-Øst RHF","J: Tverrfaglige team",15,null,""]
[{"$f":"Database!$B1382&Database!$C1382&Database!$D1382","v":"Sør-Øst RHFJ: Tverrfaglige team16"},"Sør-Øst RHF","J: Tverrfaglige team",16,null,""]
[{"$f":"Database!$B1383&Database!$C1383&Database!$D1383","v":"Sør-Øst RHFJ: Tverrfaglige team17"},"Sør-Øst RHF","J: Tverrfaglige team",17,null,""]
[{"$f":"Database!$B1384&Database!$C1384&Database!$D1384","v":"Sør-Øst RHFJ: Tverrfaglige team18"},"Sør-Øst RHF","J: Tverrfaglige team",18,null,""]
[{"$f":"Database!$B1385&Database!$C1385&Database!$D1385","v":"Sør-Øst RHFJ: Tverrfaglige team19"},"Sør-Øst RHF","J: Tverrfaglige team",19,null,""]
[{"$f":"Database!$B1386&Database!$C1386&Database!$D1386","v":"Sør-Øst RHFJ: Tverrfaglige team20"},"Sør-Øst RHF","J: Tverrfaglige team",20,null,""]
[{"$f":"Database!$B1387&Database!$C1387&Database!$D1387","v":"Sør-Øst RHFJ: Tverrfaglige team21"},"Sør-Øst RHF","J: Tverrfaglige team",21,null,""]
[{"$f":"Database!$B1388&Database!$C1388&Database!$D1388","v":"Sør-Øst RHFJ: Tverrfaglige team22"},"Sør-Øst RHF","J: Tverrfaglige team",22,null,""]
[{"$f":"Database!$B1389&Database!$C1389&Database!$D1389","v":"Sør-Øst RHFJ: Tverrfaglige team23"},"Sør-Øst RHF","J: Tverrfaglige team",23,null,""]
[{"$f":"Database!$B1390&Database!$C1390&Database!$D1390","v":"Sør-Øst RHFJ: Tverrfaglige team24"},"Sør-Øst RHF","J: Tverrfaglige team",24,null,""]
[{"$f":"Database!$B1391&Database!$C1391&Database!$D1391","v":"Sør-Øst RHFJ: Tverrfaglige team25"},"Sør-Øst RHF","J: Tverrfaglige team",25,null,""]
[{"$f":"Database!$B1392&Database!$C1392&Database!$D1392","v":"Sør-Øst RHFJ: Tverrfaglige team26"},"Sør-Øst RHF","J: Tverrfaglige team",26,null,""]
[{"$f":"Database!$B1393&Database!$C1393&Database!$D1393","v":"Sør-Øst RHFJ: Tverrfaglige team27"},"Sør-Øst RHF","J: Tverrfaglige team",27,null,""]
[{"$f":"Database!$B1394&Database!$C1394&Database!$D1394","v":"Sør-Øst RHFJ: Tverrfaglige team28"},"Sør-Øst RHF","J: Tverrfaglige team",28,null,""]
[{"$f":"Database!$B1395&Database!$C1395&Database!$D1395","v":"Sør-Øst RHFJ: Tverrfaglige team29"},"Sør-Øst RHF","J: Tverrfaglige team",29,null,""]
[{"$f":"Database!$B1396&Database!$C1396&Database!$D1396","v":"Sør-Øst RHFJ: Tverrfaglige team30"},"Sør-Øst RHF","J: Tverrfaglige team",30,null,""]
[{"$f":"Database!$B1397&Database!$C1397&Database!$D1397","v":"Sør-Øst RHFJ: Tverrfaglige team31"},"Sør-Øst RHF","J: Tverrfaglige team",31,null,""]
[{"$f":"Database!$B1398&Database!$C1398&Database!$D1398","v":"Sør-Øst RHFJ: Tverrfaglige team32"},"Sør-Øst RHF","J: Tverrfaglige team",32,null,""]
[{"$f":"Database!$B1399&Database!$C1399&Database!$D1399","v":"Sør-Øst RHFJ: Tverrfaglige team33"},"Sør-Øst RHF","J: Tverrfaglige team",33,null,""]
[{"$f":"Database!$B1400&Database!$C1400&Database!$D1400","v":"Sør-Øst RHFJ: Tverrfaglige team34"},"Sør-Øst RHF","J: Tverrfaglige team",34,null,""]
[null,null,null,null,null,{"$f":"+IFERROR(VLOOKUP(Database2[[#This Row],[Leverandør]],Kontaktinfo[],4,FALSE),\"\")","v":""}]
[null,null,null,null,null,{"$f":"+IFERROR(VLOOKUP(Database2[[#This Row],[Leverandør]],Kontaktinfo[],4,FALSE),\"\")","v":""}]
[{"$f":"Database!$B1403&Database!$C1403&Database!$D1403","v":"1 - Velg område fra rullegardinen herA: Program og Prosjektgjennomføring1"},"1 - Velg område fra rullegardinen her","A: Program og Prosjektgjennomføring",1,null,{"$f":"+IFERROR(VLOOKUP(Database2[[#This Row],[Leverandør]],Kontaktinfo[],4,FALSE),\"\")","v":""}]
[{"$f":"Database!$B1404&Database!$C1404&Database!$D1404","v":"1 - Velg område fra rullegardinen herA: Program og Prosjektgjennomføring2"},"1 - Velg område fra rullegardinen her","A: Program og Prosjektgjennomføring",2,null,{"$f":"+IFERROR(VLOOKUP(Database2[[#This Row],[Leverandør]],Kontaktinfo[],4,FALSE),\"\")","v":""}]
[{"$f":"Database!$B1405&Database!$C1405&Database!$D1405","v":"1 - Velg område fra rullegardinen herA: Program og Prosjektgjennomføring3"},"1 - Velg område fra rullegardinen her","A: Program og Prosjektgjennomføring",3,null,{"$f":"+IFERROR(VLOOKUP(Database2[[#This Row],[Leverandør]],Kontaktinfo[],4,FALSE),\"\")","v":""}]
[{"$f":"Database!$B1406&Database!$C1406&Database!$D1406","v":"1 - Velg område fra rullegardinen herA: Program og Prosjektgjennomføring4"},"1 - Velg område fra rullegardinen her","A: Program og Prosjektgjennomføring",4,null,{"$f":"+IFERROR(VLOOKUP(Database2[[#This Row],[Leverandør]],Kontaktinfo[],4,FALSE),\"\")","v":""}]
[{"$f":"Database!$B1407&Database!$C1407&Database!$D1407","v":"1 - Velg område fra rullegardinen herA: Program og Prosjektgjennomføring5"},"1 - Velg område fra rullegardinen her","A: Program og Prosjektgjennomføring",5,null,{"$f":"+IFERROR(VLOOKUP(Database2[[#This Row],[Leverandør]],Kontaktinfo[],4,FALSE),\"\")","v":""}]
[{"$f":"Database!$B1408&Database!$C1408&Database!$D1408","v":"1 - Velg område fra rullegardinen herA: Program og Prosjektgjennomføring6"},"1 - Velg område fra rullegardinen her","A: Program og Prosjektgjennomføring",6,null,{"$f":"+IFERROR(VLOOKUP(Database2[[#This Row],[Leverandør]],Kontaktinfo[],4,FALSE),\"\")","v":""}]
[{"$f":"Database!$B1409&Database!$C1409&Database!$D1409","v":"1 - Velg område fra rullegardinen herA: Program og Prosjektgjennomføring7"},"1 - Velg område fra rullegardinen her","A: Program og Prosjektgjennomføring",7,null,{"$f":"+IFERROR(VLOOKUP(Database2[[#This Row],[Leverandør]],Kontaktinfo[],4,FALSE),\"\")","v":""}]
[{"$f":"Database!$B1410&Database!$C1410&Database!$D1410","v":"1 - Velg område fra rullegardinen herA: Program og Prosjektgjennomføring8"},"1 - Velg område fra rullegardinen her","A: Program og Prosjektgjennomføring",8,null,{"$f":"+IFERROR(VLOOKUP(Database2[[#This Row],[Leverandør]],Kontaktinfo[],4,FALSE),\"\")","v":""}]
[{"$f":"Database!$B1411&Database!$C1411&Database!$D1411","v":"1 - Velg område fra rullegardinen herA: Program og Prosjektgjennomføring9"},"1 - Velg område fra rullegardinen her","A: Program og Prosjektgjennomføring",9,null,{"$f":"+IFERROR(VLOOKUP(Database2[[#This Row],[Leverandør]],Kontaktinfo[],4,FALSE),\"\")","v":""}]
[{"$f":"Database!$B1412&Database!$C1412&Database!$D1412","v":"1 - Velg område fra rullegardinen herA: Program og Prosjektgjennomføring10"},"1 - Velg område fra rullegardinen her","A: Program og Prosjektgjennomføring",10,null,{"$f":"+IFERROR(VLOOKUP(Database2[[#This Row],[Leverandør]],Kontaktinfo[],4,FALSE),\"\")","v":""}]
[{"$f":"Database!$B1413&Database!$C1413&Database!$D1413","v":"1 - Velg område fra rullegardinen herA: Program og Prosjektgjennomføring11"},"1 - Velg område fra rullegardinen her","A: Program og Prosjektgjennomføring",11,null,{"$f":"+IFERROR(VLOOKUP(Database2[[#This Row],[Leverandør]],Kontaktinfo[],4,FALSE),\"\")","v":""}]
[{"$f":"Database!$B1414&Database!$C1414&Database!$D1414","v":"1 - Velg område fra rullegardinen herA: Program og Prosjektgjennomføring12"},"1 - Velg område fra rullegardinen her","A: Program og Prosjektgjennomføring",12,null,{"$f":"+IFERROR(VLOOKUP(Database2[[#This Row],[Leverandør]],Kontaktinfo[],4,FALSE),\"\")","v":""}]
[{"$f":"Database!$B1415&Database!$C1415&Database!$D1415","v":"1 - Velg område fra rullegardinen herA: Program og Prosjektgjennomføring13"},"1 - Velg område fra rullegardinen her","A: Program og Prosjektgjennomføring",13,null,{"$f":"+IFERROR(VLOOKUP(Database2[[#This Row],[Leverandør]],Kontaktinfo[],4,FALSE),\"\")","v":""}]
[{"$f":"Database!$B1416&Database!$C1416&Database!$D1416","v":"1 - Velg område fra rullegardinen herA: Program og Prosjektgjennomføring14"},"1 - Velg område fra rullegardinen her","A: Program og Prosjektgjennomføring",14,null,{"$f":"+IFERROR(VLOOKUP(Database2[[#This Row],[Leverandør]],Kontaktinfo[],4,FALSE),\"\")","v":""}]
[{"$f":"Database!$B1417&Database!$C1417&Database!$D1417","v":"1 - Velg område fra rullegardinen herA: Program og Prosjektgjennomføring15"},"1 - Velg område fra rullegardinen her","A: Program og Prosjektgjennomføring",15,null,{"$f":"+IFERROR(VLOOKUP(Database2[[#This Row],[Leverandør]],Kontaktinfo[],4,FALSE),\"\")","v":""}]
[{"$f":"Database!$B1418&Database!$C1418&Database!$D1418","v":"1 - Velg område fra rullegardinen herA: Program og Prosjektgjennomføring16"},"1 - Velg område fra rullegardinen her","A: Program og Prosjektgjennomføring",16,null,{"$f":"+IFERROR(VLOOKUP(Database2[[#This Row],[Leverandør]],Kontaktinfo[],4,FALSE),\"\")","v":""}]
[{"$f":"Database!$B1419&Database!$C1419&Database!$D1419","v":"1 - Velg område fra rullegardinen herA: Program og Prosjektgjennomføring17"},"1 - Velg område fra rullegardinen her","A: Program og Prosjektgjennomføring",17,null,{"$f":"+IFERROR(VLOOKUP(Database2[[#This Row],[Leverandør]],Kontaktinfo[],4,FALSE),\"\")","v":""}]
[{"$f":"Database!$B1420&Database!$C1420&Database!$D1420","v":"1 - Velg område fra rullegardinen herA: Program og Prosjektgjennomføring18"},"1 - Velg område fra rullegardinen her","A: Program og Prosjektgjennomføring",18,null,{"$f":"+IFERROR(VLOOKUP(Database2[[#This Row],[Leverandør]],Kontaktinfo[],4,FALSE),\"\")","v":""}]
[{"$f":"Database!$B1421&Database!$C1421&Database!$D1421","v":"1 - Velg område fra rullegardinen herA: Program og Prosjektgjennomføring19"},"1 - Velg område fra rullegardinen her","A: Program og Prosjektgjennomføring",19,null,{"$f":"+IFERROR(VLOOKUP(Database2[[#This Row],[Leverandør]],Kontaktinfo[],4,FALSE),\"\")","v":""}]
[{"$f":"Database!$B1422&Database!$C1422&Database!$D1422","v":"1 - Velg område fra rullegardinen herA: Program og Prosjektgjennomføring20"},"1 - Velg område fra rullegardinen her","A: Program og Prosjektgjennomføring",20,null,{"$f":"+IFERROR(VLOOKUP(Database2[[#This Row],[Leverandør]],Kontaktinfo[],4,FALSE),\"\")","v":""}]
[{"$f":"Database!$B1423&Database!$C1423&Database!$D1423","v":"1 - Velg område fra rullegardinen herA: Program og Prosjektgjennomføring21"},"1 - Velg område fra rullegardinen her","A: Program og Prosjektgjennomføring",21,null,{"$f":"+IFERROR(VLOOKUP(Database2[[#This Row],[Leverandør]],Kontaktinfo[],4,FALSE),\"\")","v":""}]
[{"$f":"Database!$B1424&Database!$C1424&Database!$D1424","v":"1 - Velg område fra rullegardinen herA: Program og Prosjektgjennomføring22"},"1 - Velg område fra rullegardinen her","A: Program og Prosjektgjennomføring",22,null,{"$f":"+IFERROR(VLOOKUP(Database2[[#This Row],[Leverandør]],Kontaktinfo[],4,FALSE),\"\")","v":""}]
[{"$f":"Database!$B1425&Database!$C1425&Database!$D1425","v":"1 - Velg område fra rullegardinen herA: Program og Prosjektgjennomføring23"},"1 - Velg område fra rullegardinen her","A: Program og Prosjektgjennomføring",23,null,{"$f":"+IFERROR(VLOOKUP(Database2[[#This Row],[Leverandør]],Kontaktinfo[],4,FALSE),\"\")","v":""}]
[{"$f":"Database!$B1426&Database!$C1426&Database!$D1426","v":"1 - Velg område fra rullegardinen herA: Program og Prosjektgjennomføring24"},"1 - Velg område fra rullegardinen her","A: Program og Prosjektgjennomføring",24,null,{"$f":"+IFERROR(VLOOKUP(Database2[[#This Row],[Leverandør]],Kontaktinfo[],4,FALSE),\"\")","v":""}]
[{"$f":"Database!$B1427&Database!$C1427&Database!$D1427","v":"1 - Velg område fra rullegardinen herA: Program og Prosjektgjennomføring25"},"1 - Velg område fra rullegardinen her","A: Program og Prosjektgjennomføring",25,null,{"$f":"+IFERROR(VLOOKUP(Database2[[#This Row],[Leverandør]],Kontaktinfo[],4,FALSE),\"\")","v":""}]
[{"$f":"Database!$B1428&Database!$C1428&Database!$D1428","v":"1 - Velg område fra rullegardinen herA: Program og Prosjektgjennomføring26"},"1 - Velg område fra rullegardinen her","A: Program og Prosjektgjennomføring",26,null,{"$f":"+IFERROR(VLOOKUP(Database2[[#This Row],[Leverandør]],Kontaktinfo[],4,FALSE),\"\")","v":""}]
[{"$f":"Database!$B1429&Database!$C1429&Database!$D1429","v":"1 - Velg område fra rullegardinen herA: Program og Prosjektgjennomføring27"},"1 - Velg område fra rullegardinen her","A: Program og Prosjektgjennomføring",27,null,{"$f":"+IFERROR(VLOOKUP(Database2[[#This Row],[Leverandør]],Kontaktinfo[],4,FALSE),\"\")","v":""}]
[{"$f":"Database!$B1430&Database!$C1430&Database!$D1430","v":"1 - Velg område fra rullegardinen herA: Program og Prosjektgjennomføring28"},"1 - Velg område fra rullegardinen her","A: Program og Prosjektgjennomføring",28,null,{"$f":"+IFERROR(VLOOKUP(Database2[[#This Row],[Leverandør]],Kontaktinfo[],4,FALSE),\"\")","v":""}]
[{"$f":"Database!$B1431&Database!$C1431&Database!$D1431","v":"1 - Velg område fra rullegardinen herA: Program og Prosjektgjennomføring29"},"1 - Velg område fra rullegardinen her","A: Program og Prosjektgjennomføring",29,null,{"$f":"+IFERROR(VLOOKUP(Database2[[#This Row],[Leverandør]],Kontaktinfo[],4,FALSE),\"\")","v":""}]
[{"$f":"Database!$B1432&Database!$C1432&Database!$D1432","v":"1 - Velg område fra rullegardinen herA: Program og Prosjektgjennomføring30"},"1 - Velg område fra rullegardinen her","A: Program og Prosjektgjennomføring",30,null,{"$f":"+IFERROR(VLOOKUP(Database2[[#This Row],[Leverandør]],Kontaktinfo[],4,FALSE),\"\")","v":""}]
[{"$f":"Database!$B1433&Database!$C1433&Database!$D1433","v":"1 - Velg område fra rullegardinen herA: Program og Prosjektgjennomføring31"},"1 - Velg område fra rullegardinen her","A: Program og Prosjektgjennomføring",31,null,{"$f":"+IFERROR(VLOOKUP(Database2[[#This Row],[Leverandør]],Kontaktinfo[],4,FALSE),\"\")","v":""}]
[{"$f":"Database!$B1434&Database!$C1434&Database!$D1434","v":"1 - Velg område fra rullegardinen herA: Program og Prosjektgjennomføring32"},"1 - Velg område fra rullegardinen her","A: Program og Prosjektgjennomføring",32,null,{"$f":"+IFERROR(VLOOKUP(Database2[[#This Row],[Leverandør]],Kontaktinfo[],4,FALSE),\"\")","v":""}]
[{"$f":"Database!$B1435&Database!$C1435&Database!$D1435","v":"1 - Velg område fra rullegardinen herA: Program og Prosjektgjennomføring33"},"1 - Velg område fra rullegardinen her","A: Program og Prosjektgjennomføring",33,null,{"$f":"+IFERROR(VLOOKUP(Database2[[#This Row],[Leverandør]],Kontaktinfo[],4,FALSE),\"\")","v":""}]
[{"$f":"Database!$B1436&Database!$C1436&Database!$D1436","v":"1 - Velg område fra rullegardinen herA: Program og Prosjektgjennomføring34"},"1 - Velg område fra rullegardinen her","A: Program og Prosjektgjennomføring",34,null,{"$f":"+IFERROR(VLOOKUP(Database2[[#This Row],[Leverandør]],Kontaktinfo[],4,FALSE),\"\")","v":""}]
[{"$f":"Database!$B1437&Database!$C1437&Database!$D1437","v":""},null,null,null,null,{"$f":"+IFERROR(VLOOKUP(Database2[[#This Row],[Leverandør]],Kontaktinfo[],4,FALSE),\"\")","v":""}]
[{"$f":"Database!$B1438&Database!$C1438&Database!$D1438","v":"1 - Velg område fra rullegardinen herB: Strategiplanlegging, rådgivning og innovasjon1"},"1 - Velg område fra rullegardinen her","B: Strategiplanlegging, rådgivning og innovasjon",1,null,{"$f":"+IFERROR(VLOOKUP(Database2[[#This Row],[Leverandør]],Kontaktinfo[],4,FALSE),\"\")","v":""}]
[{"$f":"Database!$B1439&Database!$C1439&Database!$D1439","v":"1 - Velg område fra rullegardinen herB: Strategiplanlegging, rådgivning og innovasjon2"},"1 - Velg område fra rullegardinen her","B: Strategiplanlegging, rådgivning og innovasjon",2,null,{"$f":"+IFERROR(VLOOKUP(Database2[[#This Row],[Leverandør]],Kontaktinfo[],4,FALSE),\"\")","v":""}]
[{"$f":"Database!$B1440&Database!$C1440&Database!$D1440","v":"1 - Velg område fra rullegardinen herB: Strategiplanlegging, rådgivning og innovasjon3"},"1 - Velg område fra rullegardinen her","B: Strategiplanlegging, rådgivning og innovasjon",3,null,{"$f":"+IFERROR(VLOOKUP(Database2[[#This Row],[Leverandør]],Kontaktinfo[],4,FALSE),\"\")","v":""}]
[{"$f":"Database!$B1441&Database!$C1441&Database!$D1441","v":"1 - Velg område fra rullegardinen herB: Strategiplanlegging, rådgivning og innovasjon4"},"1 - Velg område fra rullegardinen her","B: Strategiplanlegging, rådgivning og innovasjon",4,null,{"$f":"+IFERROR(VLOOKUP(Database2[[#This Row],[Leverandør]],Kontaktinfo[],4,FALSE),\"\")","v":""}]
[{"$f":"Database!$B1442&Database!$C1442&Database!$D1442","v":"1 - Velg område fra rullegardinen herB: Strategiplanlegging, rådgivning og innovasjon5"},"1 - Velg område fra rullegardinen her","B: Strategiplanlegging, rådgivning og innovasjon",5,null,{"$f":"+IFERROR(VLOOKUP(Database2[[#This Row],[Leverandør]],Kontaktinfo[],4,FALSE),\"\")","v":""}]
[{"$f":"Database!$B1443&Database!$C1443&Database!$D1443","v":"1 - Velg område fra rullegardinen herB: Strategiplanlegging, rådgivning og innovasjon6"},"1 - Velg område fra rullegardinen her","B: Strategiplanlegging, rådgivning og innovasjon",6,null,{"$f":"+IFERROR(VLOOKUP(Database2[[#This Row],[Leverandør]],Kontaktinfo[],4,FALSE),\"\")","v":""}]
[{"$f":"Database!$B1444&Database!$C1444&Database!$D1444","v":"1 - Velg område fra rullegardinen herB: Strategiplanlegging, rådgivning og innovasjon7"},"1 - Velg område fra rullegardinen her","B: Strategiplanlegging, rådgivning og innovasjon",7,null,{"$f":"+IFERROR(VLOOKUP(Database2[[#This Row],[Leverandør]],Kontaktinfo[],4,FALSE),\"\")","v":""}]
[{"$f":"Database!$B1445&Database!$C1445&Database!$D1445","v":"1 - Velg område fra rullegardinen herB: Strategiplanlegging, rådgivning og innovasjon8"},"1 - Velg område fra rullegardinen her","B: Strategiplanlegging, rådgivning og innovasjon",8,null,{"$f":"+IFERROR(VLOOKUP(Database2[[#This Row],[Leverandør]],Kontaktinfo[],4,FALSE),\"\")","v":""}]
[{"$f":"Database!$B1446&Database!$C1446&Database!$D1446","v":"1 - Velg område fra rullegardinen herB: Strategiplanlegging, rådgivning og innovasjon9"},"1 - Velg område fra rullegardinen her","B: Strategiplanlegging, rådgivning og innovasjon",9,null,{"$f":"+IFERROR(VLOOKUP(Database2[[#This Row],[Leverandør]],Kontaktinfo[],4,FALSE),\"\")","v":""}]
[{"$f":"Database!$B1447&Database!$C1447&Database!$D1447","v":"1 - Velg område fra rullegardinen herB: Strategiplanlegging, rådgivning og innovasjon10"},"1 - Velg område fra rullegardinen her","B: Strategiplanlegging, rådgivning og innovasjon",10,null,{"$f":"+IFERROR(VLOOKUP(Database2[[#This Row],[Leverandør]],Kontaktinfo[],4,FALSE),\"\")","v":""}]
[{"$f":"Database!$B1448&Database!$C1448&Database!$D1448","v":"1 - Velg område fra rullegardinen herB: Strategiplanlegging, rådgivning og innovasjon11"},"1 - Velg område fra rullegardinen her","B: Strategiplanlegging, rådgivning og innovasjon",11,null,{"$f":"+IFERROR(VLOOKUP(Database2[[#This Row],[Leverandør]],Kontaktinfo[],4,FALSE),\"\")","v":""}]
[{"$f":"Database!$B1449&Database!$C1449&Database!$D1449","v":"1 - Velg område fra rullegardinen herB: Strategiplanlegging, rådgivning og innovasjon12"},"1 - Velg område fra rullegardinen her","B: Strategiplanlegging, rådgivning og innovasjon",12,null,{"$f":"+IFERROR(VLOOKUP(Database2[[#This Row],[Leverandør]],Kontaktinfo[],4,FALSE),\"\")","v":""}]
[{"$f":"Database!$B1450&Database!$C1450&Database!$D1450","v":"1 - Velg område fra rullegardinen herB: Strategiplanlegging, rådgivning og innovasjon13"},"1 - Velg område fra rullegardinen her","B: Strategiplanlegging, rådgivning og innovasjon",13,null,{"$f":"+IFERROR(VLOOKUP(Database2[[#This Row],[Leverandør]],Kontaktinfo[],4,FALSE),\"\")","v":""}]
[{"$f":"Database!$B1451&Database!$C1451&Database!$D1451","v":"1 - Velg område fra rullegardinen herB: Strategiplanlegging, rådgivning og innovasjon14"},"1 - Velg område fra rullegardinen her","B: Strategiplanlegging, rådgivning og innovasjon",14,null,{"$f":"+IFERROR(VLOOKUP(Database2[[#This Row],[Leverandør]],Kontaktinfo[],4,FALSE),\"\")","v":""}]
[{"$f":"Database!$B1452&Database!$C1452&Database!$D1452","v":"1 - Velg område fra rullegardinen herB: Strategiplanlegging, rådgivning og innovasjon15"},"1 - Velg område fra rullegardinen her","B: Strategiplanlegging, rådgivning og innovasjon",15,null,{"$f":"+IFERROR(VLOOKUP(Database2[[#This Row],[Leverandør]],Kontaktinfo[],4,FALSE),\"\")","v":""}]
[{"$f":"Database!$B1453&Database!$C1453&Database!$D1453","v":"1 - Velg område fra rullegardinen herB: Strategiplanlegging, rådgivning og innovasjon16"},"1 - Velg område fra rullegardinen her","B: Strategiplanlegging, rådgivning og innovasjon",16,null,{"$f":"+IFERROR(VLOOKUP(Database2[[#This Row],[Leverandør]],Kontaktinfo[],4,FALSE),\"\")","v":""}]
[{"$f":"Database!$B1454&Database!$C1454&Database!$D1454","v":"1 - Velg område fra rullegardinen herB: Strategiplanlegging, rådgivning og innovasjon17"},"1 - Velg område fra rullegardinen her","B: Strategiplanlegging, rådgivning og innovasjon",17,null,{"$f":"+IFERROR(VLOOKUP(Database2[[#This Row],[Leverandør]],Kontaktinfo[],4,FALSE),\"\")","v":""}]
[{"$f":"Database!$B1455&Database!$C1455&Database!$D1455","v":"1 - Velg område fra rullegardinen herB: Strategiplanlegging, rådgivning og innovasjon18"},"1 - Velg område fra rullegardinen her","B: Strategiplanlegging, rådgivning og innovasjon",18,null,{"$f":"+IFERROR(VLOOKUP(Database2[[#This Row],[Leverandør]],Kontaktinfo[],4,FALSE),\"\")","v":""}]
[{"$f":"Database!$B1456&Database!$C1456&Database!$D1456","v":"1 - Velg område fra rullegardinen herB: Strategiplanlegging, rådgivning og innovasjon19"},"1 - Velg område fra rullegardinen her","B: Strategiplanlegging, rådgivning og innovasjon",19,null,{"$f":"+IFERROR(VLOOKUP(Database2[[#This Row],[Leverandør]],Kontaktinfo[],4,FALSE),\"\")","v":""}]
[{"$f":"Database!$B1457&Database!$C1457&Database!$D1457","v":"1 - Velg område fra rullegardinen herB: Strategiplanlegging, rådgivning og innovasjon20"},"1 - Velg område fra rullegardinen her","B: Strategiplanlegging, rådgivning og innovasjon",20,null,{"$f":"+IFERROR(VLOOKUP(Database2[[#This Row],[Leverandør]],Kontaktinfo[],4,FALSE),\"\")","v":""}]
[{"$f":"Database!$B1458&Database!$C1458&Database!$D1458","v":"1 - Velg område fra rullegardinen herB: Strategiplanlegging, rådgivning og innovasjon21"},"1 - Velg område fra rullegardinen her","B: Strategiplanlegging, rådgivning og innovasjon",21,null,{"$f":"+IFERROR(VLOOKUP(Database2[[#This Row],[Leverandør]],Kontaktinfo[],4,FALSE),\"\")","v":""}]
[{"$f":"Database!$B1459&Database!$C1459&Database!$D1459","v":"1 - Velg område fra rullegardinen herB: Strategiplanlegging, rådgivning og innovasjon22"},"1 - Velg område fra rullegardinen her","B: Strategiplanlegging, rådgivning og innovasjon",22,null,{"$f":"+IFERROR(VLOOKUP(Database2[[#This Row],[Leverandør]],Kontaktinfo[],4,FALSE),\"\")","v":""}]
[{"$f":"Database!$B1460&Database!$C1460&Database!$D1460","v":"1 - Velg område fra rullegardinen herB: Strategiplanlegging, rådgivning og innovasjon23"},"1 - Velg område fra rullegardinen her","B: Strategiplanlegging, rådgivning og innovasjon",23,null,{"$f":"+IFERROR(VLOOKUP(Database2[[#This Row],[Leverandør]],Kontaktinfo[],4,FALSE),\"\")","v":""}]
[{"$f":"Database!$B1461&Database!$C1461&Database!$D1461","v":"1 - Velg område fra rullegardinen herB: Strategiplanlegging, rådgivning og innovasjon24"},"1 - Velg område fra rullegardinen her","B: Strategiplanlegging, rådgivning og innovasjon",24,null,{"$f":"+IFERROR(VLOOKUP(Database2[[#This Row],[Leverandør]],Kontaktinfo[],4,FALSE),\"\")","v":""}]
[{"$f":"Database!$B1462&Database!$C1462&Database!$D1462","v":"1 - Velg område fra rullegardinen herB: Strategiplanlegging, rådgivning og innovasjon25"},"1 - Velg område fra rullegardinen her","B: Strategiplanlegging, rådgivning og innovasjon",25,null,{"$f":"+IFERROR(VLOOKUP(Database2[[#This Row],[Leverandør]],Kontaktinfo[],4,FALSE),\"\")","v":""}]
[{"$f":"Database!$B1463&Database!$C1463&Database!$D1463","v":"1 - Velg område fra rullegardinen herB: Strategiplanlegging, rådgivning og innovasjon26"},"1 - Velg område fra rullegardinen her","B: Strategiplanlegging, rådgivning og innovasjon",26,null,{"$f":"+IFERROR(VLOOKUP(Database2[[#This Row],[Leverandør]],Kontaktinfo[],4,FALSE),\"\")","v":""}]
[{"$f":"Database!$B1464&Database!$C1464&Database!$D1464","v":"1 - Velg område fra rullegardinen herB: Strategiplanlegging, rådgivning og innovasjon27"},"1 - Velg område fra rullegardinen her","B: Strategiplanlegging, rådgivning og innovasjon",27,null,{"$f":"+IFERROR(VLOOKUP(Database2[[#This Row],[Leverandør]],Kontaktinfo[],4,FALSE),\"\")","v":""}]
[{"$f":"Database!$B1465&Database!$C1465&Database!$D1465","v":"1 - Velg område fra rullegardinen herB: Strategiplanlegging, rådgivning og innovasjon28"},"1 - Velg område fra rullegardinen her","B: Strategiplanlegging, rådgivning og innovasjon",28,null,{"$f":"+IFERROR(VLOOKUP(Database2[[#This Row],[Leverandør]],Kontaktinfo[],4,FALSE),\"\")","v":""}]
[{"$f":"Database!$B1466&Database!$C1466&Database!$D1466","v":"1 - Velg område fra rullegardinen herB: Strategiplanlegging, rådgivning og innovasjon29"},"1 - Velg område fra rullegardinen her","B: Strategiplanlegging, rådgivning og innovasjon",29,null,{"$f":"+IFERROR(VLOOKUP(Database2[[#This Row],[Leverandør]],Kontaktinfo[],4,FALSE),\"\")","v":""}]
[{"$f":"Database!$B1467&Database!$C1467&Database!$D1467","v":"1 - Velg område fra rullegardinen herB: Strategiplanlegging, rådgivning og innovasjon30"},"1 - Velg område fra rullegardinen her","B: Strategiplanlegging, rådgivning og innovasjon",30,null,{"$f":"+IFERROR(VLOOKUP(Database2[[#This Row],[Leverandør]],Kontaktinfo[],4,FALSE),\"\")","v":""}]
[{"$f":"Database!$B1468&Database!$C1468&Database!$D1468","v":"1 - Velg område fra rullegardinen herB: Strategiplanlegging, rådgivning og innovasjon31"},"1 - Velg område fra rullegardinen her","B: Strategiplanlegging, rådgivning og innovasjon",31,null,{"$f":"+IFERROR(VLOOKUP(Database2[[#This Row],[Leverandør]],Kontaktinfo[],4,FALSE),\"\")","v":""}]
[{"$f":"Database!$B1469&Database!$C1469&Database!$D1469","v":"1 - Velg område fra rullegardinen herB: Strategiplanlegging, rådgivning og innovasjon32"},"1 - Velg område fra rullegardinen her","B: Strategiplanlegging, rådgivning og innovasjon",32,null,{"$f":"+IFERROR(VLOOKUP(Database2[[#This Row],[Leverandør]],Kontaktinfo[],4,FALSE),\"\")","v":""}]
[{"$f":"Database!$B1470&Database!$C1470&Database!$D1470","v":"1 - Velg område fra rullegardinen herB: Strategiplanlegging, rådgivning og innovasjon33"},"1 - Velg område fra rullegardinen her","B: Strategiplanlegging, rådgivning og innovasjon",33,null,{"$f":"+IFERROR(VLOOKUP(Database2[[#This Row],[Leverandør]],Kontaktinfo[],4,FALSE),\"\")","v":""}]
[{"$f":"Database!$B1471&Database!$C1471&Database!$D1471","v":"1 - Velg område fra rullegardinen herB: Strategiplanlegging, rådgivning og innovasjon34"},"1 - Velg område fra rullegardinen her","B: Strategiplanlegging, rådgivning og innovasjon",34,null,{"$f":"+IFERROR(VLOOKUP(Database2[[#This Row],[Leverandør]],Kontaktinfo[],4,FALSE),\"\")","v":""}]
[{"$f":"Database!$B1472&Database!$C1472&Database!$D1472","v":""},null,null,null,null,{"$f":"+IFERROR(VLOOKUP(Database2[[#This Row],[Leverandør]],Kontaktinfo[],4,FALSE),\"\")","v":""}]
[{"$f":"Database!$B1473&Database!$C1473&Database!$D1473","v":"1 - Velg område fra rullegardinen herC: Arkitektur1"},"1 - Velg område fra rullegardinen her","C: Arkitektur",1,null,{"$f":"+IFERROR(VLOOKUP(Database2[[#This Row],[Leverandør]],Kontaktinfo[],4,FALSE),\"\")","v":""}]
[{"$f":"Database!$B1474&Database!$C1474&Database!$D1474","v":"1 - Velg område fra rullegardinen herC: Arkitektur2"},"1 - Velg område fra rullegardinen her","C: Arkitektur",2,null,{"$f":"+IFERROR(VLOOKUP(Database2[[#This Row],[Leverandør]],Kontaktinfo[],4,FALSE),\"\")","v":""}]
[{"$f":"Database!$B1475&Database!$C1475&Database!$D1475","v":"1 - Velg område fra rullegardinen herC: Arkitektur3"},"1 - Velg område fra rullegardinen her","C: Arkitektur",3,null,{"$f":"+IFERROR(VLOOKUP(Database2[[#This Row],[Leverandør]],Kontaktinfo[],4,FALSE),\"\")","v":""}]
[{"$f":"Database!$B1476&Database!$C1476&Database!$D1476","v":"1 - Velg område fra rullegardinen herC: Arkitektur4"},"1 - Velg område fra rullegardinen her","C: Arkitektur",4,null,{"$f":"+IFERROR(VLOOKUP(Database2[[#This Row],[Leverandør]],Kontaktinfo[],4,FALSE),\"\")","v":""}]
[{"$f":"Database!$B1477&Database!$C1477&Database!$D1477","v":"1 - Velg område fra rullegardinen herC: Arkitektur5"},"1 - Velg område fra rullegardinen her","C: Arkitektur",5,null,{"$f":"+IFERROR(VLOOKUP(Database2[[#This Row],[Leverandør]],Kontaktinfo[],4,FALSE),\"\")","v":""}]
[{"$f":"Database!$B1478&Database!$C1478&Database!$D1478","v":"1 - Velg område fra rullegardinen herC: Arkitektur6"},"1 - Velg område fra rullegardinen her","C: Arkitektur",6,null,{"$f":"+IFERROR(VLOOKUP(Database2[[#This Row],[Leverandør]],Kontaktinfo[],4,FALSE),\"\")","v":""}]
[{"$f":"Database!$B1479&Database!$C1479&Database!$D1479","v":"1 - Velg område fra rullegardinen herC: Arkitektur7"},"1 - Velg område fra rullegardinen her","C: Arkitektur",7,null,{"$f":"+IFERROR(VLOOKUP(Database2[[#This Row],[Leverandør]],Kontaktinfo[],4,FALSE),\"\")","v":""}]
[{"$f":"Database!$B1480&Database!$C1480&Database!$D1480","v":"1 - Velg område fra rullegardinen herC: Arkitektur8"},"1 - Velg område fra rullegardinen her","C: Arkitektur",8,null,{"$f":"+IFERROR(VLOOKUP(Database2[[#This Row],[Leverandør]],Kontaktinfo[],4,FALSE),\"\")","v":""}]
[{"$f":"Database!$B1481&Database!$C1481&Database!$D1481","v":"1 - Velg område fra rullegardinen herC: Arkitektur9"},"1 - Velg område fra rullegardinen her","C: Arkitektur",9,null,{"$f":"+IFERROR(VLOOKUP(Database2[[#This Row],[Leverandør]],Kontaktinfo[],4,FALSE),\"\")","v":""}]
[{"$f":"Database!$B1482&Database!$C1482&Database!$D1482","v":"1 - Velg område fra rullegardinen herC: Arkitektur10"},"1 - Velg område fra rullegardinen her","C: Arkitektur",10,null,{"$f":"+IFERROR(VLOOKUP(Database2[[#This Row],[Leverandør]],Kontaktinfo[],4,FALSE),\"\")","v":""}]
[{"$f":"Database!$B1483&Database!$C1483&Database!$D1483","v":"1 - Velg område fra rullegardinen herC: Arkitektur11"},"1 - Velg område fra rullegardinen her","C: Arkitektur",11,null,{"$f":"+IFERROR(VLOOKUP(Database2[[#This Row],[Leverandør]],Kontaktinfo[],4,FALSE),\"\")","v":""}]
[{"$f":"Database!$B1484&Database!$C1484&Database!$D1484","v":"1 - Velg område fra rullegardinen herC: Arkitektur12"},"1 - Velg område fra rullegardinen her","C: Arkitektur",12,null,{"$f":"+IFERROR(VLOOKUP(Database2[[#This Row],[Leverandør]],Kontaktinfo[],4,FALSE),\"\")","v":""}]
[{"$f":"Database!$B1485&Database!$C1485&Database!$D1485","v":"1 - Velg område fra rullegardinen herC: Arkitektur13"},"1 - Velg område fra rullegardinen her","C: Arkitektur",13,null,{"$f":"+IFERROR(VLOOKUP(Database2[[#This Row],[Leverandør]],Kontaktinfo[],4,FALSE),\"\")","v":""}]
[{"$f":"Database!$B1486&Database!$C1486&Database!$D1486","v":"1 - Velg område fra rullegardinen herC: Arkitektur14"},"1 - Velg område fra rullegardinen her","C: Arkitektur",14,null,{"$f":"+IFERROR(VLOOKUP(Database2[[#This Row],[Leverandør]],Kontaktinfo[],4,FALSE),\"\")","v":""}]
[{"$f":"Database!$B1487&Database!$C1487&Database!$D1487","v":"1 - Velg område fra rullegardinen herC: Arkitektur15"},"1 - Velg område fra rullegardinen her","C: Arkitektur",15,null,{"$f":"+IFERROR(VLOOKUP(Database2[[#This Row],[Leverandør]],Kontaktinfo[],4,FALSE),\"\")","v":""}]
[{"$f":"Database!$B1488&Database!$C1488&Database!$D1488","v":"1 - Velg område fra rullegardinen herC: Arkitektur16"},"1 - Velg område fra rullegardinen her","C: Arkitektur",16,null,{"$f":"+IFERROR(VLOOKUP(Database2[[#This Row],[Leverandør]],Kontaktinfo[],4,FALSE),\"\")","v":""}]
[{"$f":"Database!$B1489&Database!$C1489&Database!$D1489","v":"1 - Velg område fra rullegardinen herC: Arkitektur17"},"1 - Velg område fra rullegardinen her","C: Arkitektur",17,null,{"$f":"+IFERROR(VLOOKUP(Database2[[#This Row],[Leverandør]],Kontaktinfo[],4,FALSE),\"\")","v":""}]
[{"$f":"Database!$B1490&Database!$C1490&Database!$D1490","v":"1 - Velg område fra rullegardinen herC: Arkitektur18"},"1 - Velg område fra rullegardinen her","C: Arkitektur",18,null,{"$f":"+IFERROR(VLOOKUP(Database2[[#This Row],[Leverandør]],Kontaktinfo[],4,FALSE),\"\")","v":""}]
[{"$f":"Database!$B1491&Database!$C1491&Database!$D1491","v":"1 - Velg område fra rullegardinen herC: Arkitektur19"},"1 - Velg område fra rullegardinen her","C: Arkitektur",19,null,{"$f":"+IFERROR(VLOOKUP(Database2[[#This Row],[Leverandør]],Kontaktinfo[],4,FALSE),\"\")","v":""}]
[{"$f":"Database!$B1492&Database!$C1492&Database!$D1492","v":"1 - Velg område fra rullegardinen herC: Arkitektur20"},"1 - Velg område fra rullegardinen her","C: Arkitektur",20,null,{"$f":"+IFERROR(VLOOKUP(Database2[[#This Row],[Leverandør]],Kontaktinfo[],4,FALSE),\"\")","v":""}]
[{"$f":"Database!$B1493&Database!$C1493&Database!$D1493","v":"1 - Velg område fra rullegardinen herC: Arkitektur21"},"1 - Velg område fra rullegardinen her","C: Arkitektur",21,null,{"$f":"+IFERROR(VLOOKUP(Database2[[#This Row],[Leverandør]],Kontaktinfo[],4,FALSE),\"\")","v":""}]
[{"$f":"Database!$B1494&Database!$C1494&Database!$D1494","v":"1 - Velg område fra rullegardinen herC: Arkitektur22"},"1 - Velg område fra rullegardinen her","C: Arkitektur",22,null,{"$f":"+IFERROR(VLOOKUP(Database2[[#This Row],[Leverandør]],Kontaktinfo[],4,FALSE),\"\")","v":""}]
[{"$f":"Database!$B1495&Database!$C1495&Database!$D1495","v":"1 - Velg område fra rullegardinen herC: Arkitektur23"},"1 - Velg område fra rullegardinen her","C: Arkitektur",23,null,{"$f":"+IFERROR(VLOOKUP(Database2[[#This Row],[Leverandør]],Kontaktinfo[],4,FALSE),\"\")","v":""}]
[{"$f":"Database!$B1496&Database!$C1496&Database!$D1496","v":"1 - Velg område fra rullegardinen herC: Arkitektur24"},"1 - Velg område fra rullegardinen her","C: Arkitektur",24,null,{"$f":"+IFERROR(VLOOKUP(Database2[[#This Row],[Leverandør]],Kontaktinfo[],4,FALSE),\"\")","v":""}]
[{"$f":"Database!$B1497&Database!$C1497&Database!$D1497","v":"1 - Velg område fra rullegardinen herC: Arkitektur25"},"1 - Velg område fra rullegardinen her","C: Arkitektur",25,null,{"$f":"+IFERROR(VLOOKUP(Database2[[#This Row],[Leverandør]],Kontaktinfo[],4,FALSE),\"\")","v":""}]
[{"$f":"Database!$B1498&Database!$C1498&Database!$D1498","v":"1 - Velg område fra rullegardinen herC: Arkitektur26"},"1 - Velg område fra rullegardinen her","C: Arkitektur",26,null,{"$f":"+IFERROR(VLOOKUP(Database2[[#This Row],[Leverandør]],Kontaktinfo[],4,FALSE),\"\")","v":""}]
[{"$f":"Database!$B1499&Database!$C1499&Database!$D1499","v":"1 - Velg område fra rullegardinen herC: Arkitektur27"},"1 - Velg område fra rullegardinen her","C: Arkitektur",27,null,{"$f":"+IFERROR(VLOOKUP(Database2[[#This Row],[Leverandør]],Kontaktinfo[],4,FALSE),\"\")","v":""}]
[{"$f":"Database!$B1500&Database!$C1500&Database!$D1500","v":"1 - Velg område fra rullegardinen herC: Arkitektur28"},"1 - Velg område fra rullegardinen her","C: Arkitektur",28,null,{"$f":"+IFERROR(VLOOKUP(Database2[[#This Row],[Leverandør]],Kontaktinfo[],4,FALSE),\"\")","v":""}]
[{"$f":"Database!$B1501&Database!$C1501&Database!$D1501","v":"1 - Velg område fra rullegardinen herC: Arkitektur29"},"1 - Velg område fra rullegardinen her","C: Arkitektur",29,null,{"$f":"+IFERROR(VLOOKUP(Database2[[#This Row],[Leverandør]],Kontaktinfo[],4,FALSE),\"\")","v":""}]
[{"$f":"Database!$B1502&Database!$C1502&Database!$D1502","v":"1 - Velg område fra rullegardinen herC: Arkitektur30"},"1 - Velg område fra rullegardinen her","C: Arkitektur",30,null,{"$f":"+IFERROR(VLOOKUP(Database2[[#This Row],[Leverandør]],Kontaktinfo[],4,FALSE),\"\")","v":""}]
[{"$f":"Database!$B1503&Database!$C1503&Database!$D1503","v":"1 - Velg område fra rullegardinen herC: Arkitektur31"},"1 - Velg område fra rullegardinen her","C: Arkitektur",31,null,{"$f":"+IFERROR(VLOOKUP(Database2[[#This Row],[Leverandør]],Kontaktinfo[],4,FALSE),\"\")","v":""}]
[{"$f":"Database!$B1504&Database!$C1504&Database!$D1504","v":"1 - Velg område fra rullegardinen herC: Arkitektur32"},"1 - Velg område fra rullegardinen her","C: Arkitektur",32,null,{"$f":"+IFERROR(VLOOKUP(Database2[[#This Row],[Leverandør]],Kontaktinfo[],4,FALSE),\"\")","v":""}]
[{"$f":"Database!$B1505&Database!$C1505&Database!$D1505","v":"1 - Velg område fra rullegardinen herC: Arkitektur33"},"1 - Velg område fra rullegardinen her","C: Arkitektur",33,null,{"$f":"+IFERROR(VLOOKUP(Database2[[#This Row],[Leverandør]],Kontaktinfo[],4,FALSE),\"\")","v":""}]
[{"$f":"Database!$B1506&Database!$C1506&Database!$D1506","v":"1 - Velg område fra rullegardinen herC: Arkitektur34"},"1 - Velg område fra rullegardinen her","C: Arkitektur",34,null,{"$f":"+IFERROR(VLOOKUP(Database2[[#This Row],[Leverandør]],Kontaktinfo[],4,FALSE),\"\")","v":""}]
[{"$f":"Database!$B1507&Database!$C1507&Database!$D1507","v":""},null,null,null,null,{"$f":"+IFERROR(VLOOKUP(Database2[[#This Row],[Leverandør]],Kontaktinfo[],4,FALSE),\"\")","v":""}]
[{"$f":"Database!$B1508&Database!$C1508&Database!$D1508","v":"1 - Velg område fra rullegardinen herD: Informasjonssikkerhet og ROS-analyser1"},"1 - Velg område fra rullegardinen her","D: Informasjonssikkerhet og ROS-analyser",1,null,{"$f":"+IFERROR(VLOOKUP(Database2[[#This Row],[Leverandør]],Kontaktinfo[],4,FALSE),\"\")","v":""}]
[{"$f":"Database!$B1509&Database!$C1509&Database!$D1509","v":"1 - Velg område fra rullegardinen herD: Informasjonssikkerhet og ROS-analyser2"},"1 - Velg område fra rullegardinen her","D: Informasjonssikkerhet og ROS-analyser",2,null,{"$f":"+IFERROR(VLOOKUP(Database2[[#This Row],[Leverandør]],Kontaktinfo[],4,FALSE),\"\")","v":""}]
[{"$f":"Database!$B1510&Database!$C1510&Database!$D1510","v":"1 - Velg område fra rullegardinen herD: Informasjonssikkerhet og ROS-analyser3"},"1 - Velg område fra rullegardinen her","D: Informasjonssikkerhet og ROS-analyser",3,null,{"$f":"+IFERROR(VLOOKUP(Database2[[#This Row],[Leverandør]],Kontaktinfo[],4,FALSE),\"\")","v":""}]
[{"$f":"Database!$B1511&Database!$C1511&Database!$D1511","v":"1 - Velg område fra rullegardinen herD: Informasjonssikkerhet og ROS-analyser4"},"1 - Velg område fra rullegardinen her","D: Informasjonssikkerhet og ROS-analyser",4,null,{"$f":"+IFERROR(VLOOKUP(Database2[[#This Row],[Leverandør]],Kontaktinfo[],4,FALSE),\"\")","v":""}]
[{"$f":"Database!$B1512&Database!$C1512&Database!$D1512","v":"1 - Velg område fra rullegardinen herD: Informasjonssikkerhet og ROS-analyser5"},"1 - Velg område fra rullegardinen her","D: Informasjonssikkerhet og ROS-analyser",5,null,{"$f":"+IFERROR(VLOOKUP(Database2[[#This Row],[Leverandør]],Kontaktinfo[],4,FALSE),\"\")","v":""}]
[{"$f":"Database!$B1513&Database!$C1513&Database!$D1513","v":"1 - Velg område fra rullegardinen herD: Informasjonssikkerhet og ROS-analyser6"},"1 - Velg område fra rullegardinen her","D: Informasjonssikkerhet og ROS-analyser",6,null,{"$f":"+IFERROR(VLOOKUP(Database2[[#This Row],[Leverandør]],Kontaktinfo[],4,FALSE),\"\")","v":""}]
[{"$f":"Database!$B1514&Database!$C1514&Database!$D1514","v":"1 - Velg område fra rullegardinen herD: Informasjonssikkerhet og ROS-analyser7"},"1 - Velg område fra rullegardinen her","D: Informasjonssikkerhet og ROS-analyser",7,null,{"$f":"+IFERROR(VLOOKUP(Database2[[#This Row],[Leverandør]],Kontaktinfo[],4,FALSE),\"\")","v":""}]
[{"$f":"Database!$B1515&Database!$C1515&Database!$D1515","v":"1 - Velg område fra rullegardinen herD: Informasjonssikkerhet og ROS-analyser8"},"1 - Velg område fra rullegardinen her","D: Informasjonssikkerhet og ROS-analyser",8,null,{"$f":"+IFERROR(VLOOKUP(Database2[[#This Row],[Leverandør]],Kontaktinfo[],4,FALSE),\"\")","v":""}]
[{"$f":"Database!$B1516&Database!$C1516&Database!$D1516","v":"1 - Velg område fra rullegardinen herD: Informasjonssikkerhet og ROS-analyser9"},"1 - Velg område fra rullegardinen her","D: Informasjonssikkerhet og ROS-analyser",9,null,{"$f":"+IFERROR(VLOOKUP(Database2[[#This Row],[Leverandør]],Kontaktinfo[],4,FALSE),\"\")","v":""}]
[{"$f":"Database!$B1517&Database!$C1517&Database!$D1517","v":"1 - Velg område fra rullegardinen herD: Informasjonssikkerhet og ROS-analyser10"},"1 - Velg område fra rullegardinen her","D: Informasjonssikkerhet og ROS-analyser",10,null,{"$f":"+IFERROR(VLOOKUP(Database2[[#This Row],[Leverandør]],Kontaktinfo[],4,FALSE),\"\")","v":""}]
[{"$f":"Database!$B1518&Database!$C1518&Database!$D1518","v":"1 - Velg område fra rullegardinen herD: Informasjonssikkerhet og ROS-analyser11"},"1 - Velg område fra rullegardinen her","D: Informasjonssikkerhet og ROS-analyser",11,null,{"$f":"+IFERROR(VLOOKUP(Database2[[#This Row],[Leverandør]],Kontaktinfo[],4,FALSE),\"\")","v":""}]
[{"$f":"Database!$B1519&Database!$C1519&Database!$D1519","v":"1 - Velg område fra rullegardinen herD: Informasjonssikkerhet og ROS-analyser12"},"1 - Velg område fra rullegardinen her","D: Informasjonssikkerhet og ROS-analyser",12,null,{"$f":"+IFERROR(VLOOKUP(Database2[[#This Row],[Leverandør]],Kontaktinfo[],4,FALSE),\"\")","v":""}]
[{"$f":"Database!$B1520&Database!$C1520&Database!$D1520","v":"1 - Velg område fra rullegardinen herD: Informasjonssikkerhet og ROS-analyser13"},"1 - Velg område fra rullegardinen her","D: Informasjonssikkerhet og ROS-analyser",13,null,{"$f":"+IFERROR(VLOOKUP(Database2[[#This Row],[Leverandør]],Kontaktinfo[],4,FALSE),\"\")","v":""}]
[{"$f":"Database!$B1521&Database!$C1521&Database!$D1521","v":"1 - Velg område fra rullegardinen herD: Informasjonssikkerhet og ROS-analyser14"},"1 - Velg område fra rullegardinen her","D: Informasjonssikkerhet og ROS-analyser",14,null,{"$f":"+IFERROR(VLOOKUP(Database2[[#This Row],[Leverandør]],Kontaktinfo[],4,FALSE),\"\")","v":""}]
[{"$f":"Database!$B1522&Database!$C1522&Database!$D1522","v":"1 - Velg område fra rullegardinen herD: Informasjonssikkerhet og ROS-analyser15"},"1 - Velg område fra rullegardinen her","D: Informasjonssikkerhet og ROS-analyser",15,null,{"$f":"+IFERROR(VLOOKUP(Database2[[#This Row],[Leverandør]],Kontaktinfo[],4,FALSE),\"\")","v":""}]
[{"$f":"Database!$B1523&Database!$C1523&Database!$D1523","v":"1 - Velg område fra rullegardinen herD: Informasjonssikkerhet og ROS-analyser16"},"1 - Velg område fra rullegardinen her","D: Informasjonssikkerhet og ROS-analyser",16,null,{"$f":"+IFERROR(VLOOKUP(Database2[[#This Row],[Leverandør]],Kontaktinfo[],4,FALSE),\"\")","v":""}]
[{"$f":"Database!$B1524&Database!$C1524&Database!$D1524","v":"1 - Velg område fra rullegardinen herD: Informasjonssikkerhet og ROS-analyser17"},"1 - Velg område fra rullegardinen her","D: Informasjonssikkerhet og ROS-analyser",17,null,{"$f":"+IFERROR(VLOOKUP(Database2[[#This Row],[Leverandør]],Kontaktinfo[],4,FALSE),\"\")","v":""}]
[{"$f":"Database!$B1525&Database!$C1525&Database!$D1525","v":"1 - Velg område fra rullegardinen herD: Informasjonssikkerhet og ROS-analyser18"},"1 - Velg område fra rullegardinen her","D: Informasjonssikkerhet og ROS-analyser",18,null,{"$f":"+IFERROR(VLOOKUP(Database2[[#This Row],[Leverandør]],Kontaktinfo[],4,FALSE),\"\")","v":""}]
[{"$f":"Database!$B1526&Database!$C1526&Database!$D1526","v":"1 - Velg område fra rullegardinen herD: Informasjonssikkerhet og ROS-analyser19"},"1 - Velg område fra rullegardinen her","D: Informasjonssikkerhet og ROS-analyser",19,null,{"$f":"+IFERROR(VLOOKUP(Database2[[#This Row],[Leverandør]],Kontaktinfo[],4,FALSE),\"\")","v":""}]
[{"$f":"Database!$B1527&Database!$C1527&Database!$D1527","v":"1 - Velg område fra rullegardinen herD: Informasjonssikkerhet og ROS-analyser20"},"1 - Velg område fra rullegardinen her","D: Informasjonssikkerhet og ROS-analyser",20,null,{"$f":"+IFERROR(VLOOKUP(Database2[[#This Row],[Leverandør]],Kontaktinfo[],4,FALSE),\"\")","v":""}]
[{"$f":"Database!$B1528&Database!$C1528&Database!$D1528","v":"1 - Velg område fra rullegardinen herD: Informasjonssikkerhet og ROS-analyser21"},"1 - Velg område fra rullegardinen her","D: Informasjonssikkerhet og ROS-analyser",21,null,{"$f":"+IFERROR(VLOOKUP(Database2[[#This Row],[Leverandør]],Kontaktinfo[],4,FALSE),\"\")","v":""}]
[{"$f":"Database!$B1529&Database!$C1529&Database!$D1529","v":"1 - Velg område fra rullegardinen herD: Informasjonssikkerhet og ROS-analyser22"},"1 - Velg område fra rullegardinen her","D: Informasjonssikkerhet og ROS-analyser",22,null,{"$f":"+IFERROR(VLOOKUP(Database2[[#This Row],[Leverandør]],Kontaktinfo[],4,FALSE),\"\")","v":""}]
[{"$f":"Database!$B1530&Database!$C1530&Database!$D1530","v":"1 - Velg område fra rullegardinen herD: Informasjonssikkerhet og ROS-analyser23"},"1 - Velg område fra rullegardinen her","D: Informasjonssikkerhet og ROS-analyser",23,null,{"$f":"+IFERROR(VLOOKUP(Database2[[#This Row],[Leverandør]],Kontaktinfo[],4,FALSE),\"\")","v":""}]
[{"$f":"Database!$B1531&Database!$C1531&Database!$D1531","v":"1 - Velg område fra rullegardinen herD: Informasjonssikkerhet og ROS-analyser24"},"1 - Velg område fra rullegardinen her","D: Informasjonssikkerhet og ROS-analyser",24,null,{"$f":"+IFERROR(VLOOKUP(Database2[[#This Row],[Leverandør]],Kontaktinfo[],4,FALSE),\"\")","v":""}]
[{"$f":"Database!$B1532&Database!$C1532&Database!$D1532","v":"1 - Velg område fra rullegardinen herD: Informasjonssikkerhet og ROS-analyser25"},"1 - Velg område fra rullegardinen her","D: Informasjonssikkerhet og ROS-analyser",25,null,{"$f":"+IFERROR(VLOOKUP(Database2[[#This Row],[Leverandør]],Kontaktinfo[],4,FALSE),\"\")","v":""}]
[{"$f":"Database!$B1533&Database!$C1533&Database!$D1533","v":"1 - Velg område fra rullegardinen herD: Informasjonssikkerhet og ROS-analyser26"},"1 - Velg område fra rullegardinen her","D: Informasjonssikkerhet og ROS-analyser",26,null,{"$f":"+IFERROR(VLOOKUP(Database2[[#This Row],[Leverandør]],Kontaktinfo[],4,FALSE),\"\")","v":""}]
[{"$f":"Database!$B1534&Database!$C1534&Database!$D1534","v":"1 - Velg område fra rullegardinen herD: Informasjonssikkerhet og ROS-analyser27"},"1 - Velg område fra rullegardinen her","D: Informasjonssikkerhet og ROS-analyser",27,null,{"$f":"+IFERROR(VLOOKUP(Database2[[#This Row],[Leverandør]],Kontaktinfo[],4,FALSE),\"\")","v":""}]
[{"$f":"Database!$B1535&Database!$C1535&Database!$D1535","v":"1 - Velg område fra rullegardinen herD: Informasjonssikkerhet og ROS-analyser28"},"1 - Velg område fra rullegardinen her","D: Informasjonssikkerhet og ROS-analyser",28,null,{"$f":"+IFERROR(VLOOKUP(Database2[[#This Row],[Leverandør]],Kontaktinfo[],4,FALSE),\"\")","v":""}]
[{"$f":"Database!$B1536&Database!$C1536&Database!$D1536","v":"1 - Velg område fra rullegardinen herD: Informasjonssikkerhet og ROS-analyser29"},"1 - Velg område fra rullegardinen her","D: Informasjonssikkerhet og ROS-analyser",29,null,{"$f":"+IFERROR(VLOOKUP(Database2[[#This Row],[Leverandør]],Kontaktinfo[],4,FALSE),\"\")","v":""}]
[{"$f":"Database!$B1537&Database!$C1537&Database!$D1537","v":"1 - Velg område fra rullegardinen herD: Informasjonssikkerhet og ROS-analyser30"},"1 - Velg område fra rullegardinen her","D: Informasjonssikkerhet og ROS-analyser",30,null,{"$f":"+IFERROR(VLOOKUP(Database2[[#This Row],[Leverandør]],Kontaktinfo[],4,FALSE),\"\")","v":""}]
[{"$f":"Database!$B1538&Database!$C1538&Database!$D1538","v":"1 - Velg område fra rullegardinen herD: Informasjonssikkerhet og ROS-analyser31"},"1 - Velg område fra rullegardinen her","D: Informasjonssikkerhet og ROS-analyser",31,null,{"$f":"+IFERROR(VLOOKUP(Database2[[#This Row],[Leverandør]],Kontaktinfo[],4,FALSE),\"\")","v":""}]
[{"$f":"Database!$B1539&Database!$C1539&Database!$D1539","v":"1 - Velg område fra rullegardinen herD: Informasjonssikkerhet og ROS-analyser32"},"1 - Velg område fra rullegardinen her","D: Informasjonssikkerhet og ROS-analyser",32,null,{"$f":"+IFERROR(VLOOKUP(Database2[[#This Row],[Leverandør]],Kontaktinfo[],4,FALSE),\"\")","v":""}]
[{"$f":"Database!$B1540&Database!$C1540&Database!$D1540","v":"1 - Velg område fra rullegardinen herD: Informasjonssikkerhet og ROS-analyser33"},"1 - Velg område fra rullegardinen her","D: Informasjonssikkerhet og ROS-analyser",33,null,{"$f":"+IFERROR(VLOOKUP(Database2[[#This Row],[Leverandør]],Kontaktinfo[],4,FALSE),\"\")","v":""}]
[{"$f":"Database!$B1541&Database!$C1541&Database!$D1541","v":"1 - Velg område fra rullegardinen herD: Informasjonssikkerhet og ROS-analyser34"},"1 - Velg område fra rullegardinen her","D: Informasjonssikkerhet og ROS-analyser",34,null,{"$f":"+IFERROR(VLOOKUP(Database2[[#This Row],[Leverandør]],Kontaktinfo[],4,FALSE),\"\")","v":""}]
[{"$f":"Database!$B1542&Database!$C1542&Database!$D1542","v":""},null,null,null,null,{"$f":"+IFERROR(VLOOKUP(Database2[[#This Row],[Leverandør]],Kontaktinfo[],4,FALSE),\"\")","v":""}]
[{"$f":"Database!$B1543&Database!$C1543&Database!$D1543","v":"1 - Velg område fra rullegardinen herE: Test og release1"},"1 - Velg område fra rullegardinen her","E: Test og release",1,null,{"$f":"+IFERROR(VLOOKUP(Database2[[#This Row],[Leverandør]],Kontaktinfo[],4,FALSE),\"\")","v":""}]
[{"$f":"Database!$B1544&Database!$C1544&Database!$D1544","v":"1 - Velg område fra rullegardinen herE: Test og release2"},"1 - Velg område fra rullegardinen her","E: Test og release",2,null,{"$f":"+IFERROR(VLOOKUP(Database2[[#This Row],[Leverandør]],Kontaktinfo[],4,FALSE),\"\")","v":""}]
[{"$f":"Database!$B1545&Database!$C1545&Database!$D1545","v":"1 - Velg område fra rullegardinen herE: Test og release3"},"1 - Velg område fra rullegardinen her","E: Test og release",3,null,{"$f":"+IFERROR(VLOOKUP(Database2[[#This Row],[Leverandør]],Kontaktinfo[],4,FALSE),\"\")","v":""}]
[{"$f":"Database!$B1546&Database!$C1546&Database!$D1546","v":"1 - Velg område fra rullegardinen herE: Test og release4"},"1 - Velg område fra rullegardinen her","E: Test og release",4,null,{"$f":"+IFERROR(VLOOKUP(Database2[[#This Row],[Leverandør]],Kontaktinfo[],4,FALSE),\"\")","v":""}]
[{"$f":"Database!$B1547&Database!$C1547&Database!$D1547","v":"1 - Velg område fra rullegardinen herE: Test og release5"},"1 - Velg område fra rullegardinen her","E: Test og release",5,null,{"$f":"+IFERROR(VLOOKUP(Database2[[#This Row],[Leverandør]],Kontaktinfo[],4,FALSE),\"\")","v":""}]
[{"$f":"Database!$B1548&Database!$C1548&Database!$D1548","v":"1 - Velg område fra rullegardinen herE: Test og release6"},"1 - Velg område fra rullegardinen her","E: Test og release",6,null,{"$f":"+IFERROR(VLOOKUP(Database2[[#This Row],[Leverandør]],Kontaktinfo[],4,FALSE),\"\")","v":""}]
[{"$f":"Database!$B1549&Database!$C1549&Database!$D1549","v":"1 - Velg område fra rullegardinen herE: Test og release7"},"1 - Velg område fra rullegardinen her","E: Test og release",7,null,{"$f":"+IFERROR(VLOOKUP(Database2[[#This Row],[Leverandør]],Kontaktinfo[],4,FALSE),\"\")","v":""}]
[{"$f":"Database!$B1550&Database!$C1550&Database!$D1550","v":"1 - Velg område fra rullegardinen herE: Test og release8"},"1 - Velg område fra rullegardinen her","E: Test og release",8,null,{"$f":"+IFERROR(VLOOKUP(Database2[[#This Row],[Leverandør]],Kontaktinfo[],4,FALSE),\"\")","v":""}]
[{"$f":"Database!$B1551&Database!$C1551&Database!$D1551","v":"1 - Velg område fra rullegardinen herE: Test og release9"},"1 - Velg område fra rullegardinen her","E: Test og release",9,null,{"$f":"+IFERROR(VLOOKUP(Database2[[#This Row],[Leverandør]],Kontaktinfo[],4,FALSE),\"\")","v":""}]
[{"$f":"Database!$B1552&Database!$C1552&Database!$D1552","v":"1 - Velg område fra rullegardinen herE: Test og release10"},"1 - Velg område fra rullegardinen her","E: Test og release",10,null,{"$f":"+IFERROR(VLOOKUP(Database2[[#This Row],[Leverandør]],Kontaktinfo[],4,FALSE),\"\")","v":""}]
[{"$f":"Database!$B1553&Database!$C1553&Database!$D1553","v":"1 - Velg område fra rullegardinen herE: Test og release11"},"1 - Velg område fra rullegardinen her","E: Test og release",11,null,{"$f":"+IFERROR(VLOOKUP(Database2[[#This Row],[Leverandør]],Kontaktinfo[],4,FALSE),\"\")","v":""}]
[{"$f":"Database!$B1554&Database!$C1554&Database!$D1554","v":"1 - Velg område fra rullegardinen herE: Test og release12"},"1 - Velg område fra rullegardinen her","E: Test og release",12,null,{"$f":"+IFERROR(VLOOKUP(Database2[[#This Row],[Leverandør]],Kontaktinfo[],4,FALSE),\"\")","v":""}]
[{"$f":"Database!$B1555&Database!$C1555&Database!$D1555","v":"1 - Velg område fra rullegardinen herE: Test og release13"},"1 - Velg område fra rullegardinen her","E: Test og release",13,null,{"$f":"+IFERROR(VLOOKUP(Database2[[#This Row],[Leverandør]],Kontaktinfo[],4,FALSE),\"\")","v":""}]
[{"$f":"Database!$B1556&Database!$C1556&Database!$D1556","v":"1 - Velg område fra rullegardinen herE: Test og release14"},"1 - Velg område fra rullegardinen her","E: Test og release",14,null,{"$f":"+IFERROR(VLOOKUP(Database2[[#This Row],[Leverandør]],Kontaktinfo[],4,FALSE),\"\")","v":""}]
[{"$f":"Database!$B1557&Database!$C1557&Database!$D1557","v":"1 - Velg område fra rullegardinen herE: Test og release15"},"1 - Velg område fra rullegardinen her","E: Test og release",15,null,{"$f":"+IFERROR(VLOOKUP(Database2[[#This Row],[Leverandør]],Kontaktinfo[],4,FALSE),\"\")","v":""}]
[{"$f":"Database!$B1558&Database!$C1558&Database!$D1558","v":"1 - Velg område fra rullegardinen herE: Test og release16"},"1 - Velg område fra rullegardinen her","E: Test og release",16,null,{"$f":"+IFERROR(VLOOKUP(Database2[[#This Row],[Leverandør]],Kontaktinfo[],4,FALSE),\"\")","v":""}]
[{"$f":"Database!$B1559&Database!$C1559&Database!$D1559","v":"1 - Velg område fra rullegardinen herE: Test og release17"},"1 - Velg område fra rullegardinen her","E: Test og release",17,null,{"$f":"+IFERROR(VLOOKUP(Database2[[#This Row],[Leverandør]],Kontaktinfo[],4,FALSE),\"\")","v":""}]
[{"$f":"Database!$B1560&Database!$C1560&Database!$D1560","v":"1 - Velg område fra rullegardinen herE: Test og release18"},"1 - Velg område fra rullegardinen her","E: Test og release",18,null,{"$f":"+IFERROR(VLOOKUP(Database2[[#This Row],[Leverandør]],Kontaktinfo[],4,FALSE),\"\")","v":""}]
[{"$f":"Database!$B1561&Database!$C1561&Database!$D1561","v":"1 - Velg område fra rullegardinen herE: Test og release19"},"1 - Velg område fra rullegardinen her","E: Test og release",19,null,{"$f":"+IFERROR(VLOOKUP(Database2[[#This Row],[Leverandør]],Kontaktinfo[],4,FALSE),\"\")","v":""}]
[{"$f":"Database!$B1562&Database!$C1562&Database!$D1562","v":"1 - Velg område fra rullegardinen herE: Test og release20"},"1 - Velg område fra rullegardinen her","E: Test og release",20,null,{"$f":"+IFERROR(VLOOKUP(Database2[[#This Row],[Leverandør]],Kontaktinfo[],4,FALSE),\"\")","v":""}]
[{"$f":"Database!$B1563&Database!$C1563&Database!$D1563","v":"1 - Velg område fra rullegardinen herE: Test og release21"},"1 - Velg område fra rullegardinen her","E: Test og release",21,null,{"$f":"+IFERROR(VLOOKUP(Database2[[#This Row],[Leverandør]],Kontaktinfo[],4,FALSE),\"\")","v":""}]
[{"$f":"Database!$B1564&Database!$C1564&Database!$D1564","v":"1 - Velg område fra rullegardinen herE: Test og release22"},"1 - Velg område fra rullegardinen her","E: Test og release",22,null,{"$f":"+IFERROR(VLOOKUP(Database2[[#This Row],[Leverandør]],Kontaktinfo[],4,FALSE),\"\")","v":""}]
[{"$f":"Database!$B1565&Database!$C1565&Database!$D1565","v":"1 - Velg område fra rullegardinen herE: Test og release23"},"1 - Velg område fra rullegardinen her","E: Test og release",23,null,{"$f":"+IFERROR(VLOOKUP(Database2[[#This Row],[Leverandør]],Kontaktinfo[],4,FALSE),\"\")","v":""}]
[{"$f":"Database!$B1566&Database!$C1566&Database!$D1566","v":"1 - Velg område fra rullegardinen herE: Test og release24"},"1 - Velg område fra rullegardinen her","E: Test og release",24,null,{"$f":"+IFERROR(VLOOKUP(Database2[[#This Row],[Leverandør]],Kontaktinfo[],4,FALSE),\"\")","v":""}]
[{"$f":"Database!$B1567&Database!$C1567&Database!$D1567","v":"1 - Velg område fra rullegardinen herE: Test og release25"},"1 - Velg område fra rullegardinen her","E: Test og release",25,null,{"$f":"+IFERROR(VLOOKUP(Database2[[#This Row],[Leverandør]],Kontaktinfo[],4,FALSE),\"\")","v":""}]
[{"$f":"Database!$B1568&Database!$C1568&Database!$D1568","v":"1 - Velg område fra rullegardinen herE: Test og release26"},"1 - Velg område fra rullegardinen her","E: Test og release",26,null,{"$f":"+IFERROR(VLOOKUP(Database2[[#This Row],[Leverandør]],Kontaktinfo[],4,FALSE),\"\")","v":""}]
[{"$f":"Database!$B1569&Database!$C1569&Database!$D1569","v":"1 - Velg område fra rullegardinen herE: Test og release27"},"1 - Velg område fra rullegardinen her","E: Test og release",27,null,{"$f":"+IFERROR(VLOOKUP(Database2[[#This Row],[Leverandør]],Kontaktinfo[],4,FALSE),\"\")","v":""}]
[{"$f":"Database!$B1570&Database!$C1570&Database!$D1570","v":"1 - Velg område fra rullegardinen herE: Test og release28"},"1 - Velg område fra rullegardinen her","E: Test og release",28,null,{"$f":"+IFERROR(VLOOKUP(Database2[[#This Row],[Leverandør]],Kontaktinfo[],4,FALSE),\"\")","v":""}]
[{"$f":"Database!$B1571&Database!$C1571&Database!$D1571","v":"1 - Velg område fra rullegardinen herE: Test og release29"},"1 - Velg område fra rullegardinen her","E: Test og release",29,null,{"$f":"+IFERROR(VLOOKUP(Database2[[#This Row],[Leverandør]],Kontaktinfo[],4,FALSE),\"\")","v":""}]
[{"$f":"Database!$B1572&Database!$C1572&Database!$D1572","v":"1 - Velg område fra rullegardinen herE: Test og release30"},"1 - Velg område fra rullegardinen her","E: Test og release",30,null,{"$f":"+IFERROR(VLOOKUP(Database2[[#This Row],[Leverandør]],Kontaktinfo[],4,FALSE),\"\")","v":""}]
[{"$f":"Database!$B1573&Database!$C1573&Database!$D1573","v":"1 - Velg område fra rullegardinen herE: Test og release31"},"1 - Velg område fra rullegardinen her","E: Test og release",31,null,{"$f":"+IFERROR(VLOOKUP(Database2[[#This Row],[Leverandør]],Kontaktinfo[],4,FALSE),\"\")","v":""}]
[{"$f":"Database!$B1574&Database!$C1574&Database!$D1574","v":"1 - Velg område fra rullegardinen herE: Test og release32"},"1 - Velg område fra rullegardinen her","E: Test og release",32,null,{"$f":"+IFERROR(VLOOKUP(Database2[[#This Row],[Leverandør]],Kontaktinfo[],4,FALSE),\"\")","v":""}]
[{"$f":"Database!$B1575&Database!$C1575&Database!$D1575","v":"1 - Velg område fra rullegardinen herE: Test og release33"},"1 - Velg område fra rullegardinen her","E: Test og release",33,null,{"$f":"+IFERROR(VLOOKUP(Database2[[#This Row],[Leverandør]],Kontaktinfo[],4,FALSE),\"\")","v":""}]
[{"$f":"Database!$B1576&Database!$C1576&Database!$D1576","v":"1 - Velg område fra rullegardinen herE: Test og release34"},"1 - Velg område fra rullegardinen her","E: Test og release",34,null,{"$f":"+IFERROR(VLOOKUP(Database2[[#This Row],[Leverandør]],Kontaktinfo[],4,FALSE),\"\")","v":""}]
[{"$f":"Database!$B1577&Database!$C1577&Database!$D1577","v":""},null,null,null,null,{"$f":"+IFERROR(VLOOKUP(Database2[[#This Row],[Leverandør]],Kontaktinfo[],4,FALSE),\"\")","v":""}]
[{"$f":"Database!$B1578&Database!$C1578&Database!$D1578","v":"1 - Velg område fra rullegardinen herF: Systemutvikling1"},"1 - Velg område fra rullegardinen her","F: Systemutvikling",1,null,{"$f":"+IFERROR(VLOOKUP(Database2[[#This Row],[Leverandør]],Kontaktinfo[],4,FALSE),\"\")","v":""}]
[{"$f":"Database!$B1579&Database!$C1579&Database!$D1579","v":"1 - Velg område fra rullegardinen herF: Systemutvikling2"},"1 - Velg område fra rullegardinen her","F: Systemutvikling",2,null,{"$f":"+IFERROR(VLOOKUP(Database2[[#This Row],[Leverandør]],Kontaktinfo[],4,FALSE),\"\")","v":""}]
[{"$f":"Database!$B1580&Database!$C1580&Database!$D1580","v":"1 - Velg område fra rullegardinen herF: Systemutvikling3"},"1 - Velg område fra rullegardinen her","F: Systemutvikling",3,null,{"$f":"+IFERROR(VLOOKUP(Database2[[#This Row],[Leverandør]],Kontaktinfo[],4,FALSE),\"\")","v":""}]
[{"$f":"Database!$B1581&Database!$C1581&Database!$D1581","v":"1 - Velg område fra rullegardinen herF: Systemutvikling4"},"1 - Velg område fra rullegardinen her","F: Systemutvikling",4,null,{"$f":"+IFERROR(VLOOKUP(Database2[[#This Row],[Leverandør]],Kontaktinfo[],4,FALSE),\"\")","v":""}]
[{"$f":"Database!$B1582&Database!$C1582&Database!$D1582","v":"1 - Velg område fra rullegardinen herF: Systemutvikling5"},"1 - Velg område fra rullegardinen her","F: Systemutvikling",5,null,{"$f":"+IFERROR(VLOOKUP(Database2[[#This Row],[Leverandør]],Kontaktinfo[],4,FALSE),\"\")","v":""}]
[{"$f":"Database!$B1583&Database!$C1583&Database!$D1583","v":"1 - Velg område fra rullegardinen herF: Systemutvikling6"},"1 - Velg område fra rullegardinen her","F: Systemutvikling",6,null,{"$f":"+IFERROR(VLOOKUP(Database2[[#This Row],[Leverandør]],Kontaktinfo[],4,FALSE),\"\")","v":""}]
[{"$f":"Database!$B1584&Database!$C1584&Database!$D1584","v":"1 - Velg område fra rullegardinen herF: Systemutvikling7"},"1 - Velg område fra rullegardinen her","F: Systemutvikling",7,null,{"$f":"+IFERROR(VLOOKUP(Database2[[#This Row],[Leverandør]],Kontaktinfo[],4,FALSE),\"\")","v":""}]
[{"$f":"Database!$B1585&Database!$C1585&Database!$D1585","v":"1 - Velg område fra rullegardinen herF: Systemutvikling8"},"1 - Velg område fra rullegardinen her","F: Systemutvikling",8,null,{"$f":"+IFERROR(VLOOKUP(Database2[[#This Row],[Leverandør]],Kontaktinfo[],4,FALSE),\"\")","v":""}]
[{"$f":"Database!$B1586&Database!$C1586&Database!$D1586","v":"1 - Velg område fra rullegardinen herF: Systemutvikling9"},"1 - Velg område fra rullegardinen her","F: Systemutvikling",9,null,{"$f":"+IFERROR(VLOOKUP(Database2[[#This Row],[Leverandør]],Kontaktinfo[],4,FALSE),\"\")","v":""}]
[{"$f":"Database!$B1587&Database!$C1587&Database!$D1587","v":"1 - Velg område fra rullegardinen herF: Systemutvikling10"},"1 - Velg område fra rullegardinen her","F: Systemutvikling",10,null,{"$f":"+IFERROR(VLOOKUP(Database2[[#This Row],[Leverandør]],Kontaktinfo[],4,FALSE),\"\")","v":""}]
[{"$f":"Database!$B1588&Database!$C1588&Database!$D1588","v":"1 - Velg område fra rullegardinen herF: Systemutvikling11"},"1 - Velg område fra rullegardinen her","F: Systemutvikling",11,null,{"$f":"+IFERROR(VLOOKUP(Database2[[#This Row],[Leverandør]],Kontaktinfo[],4,FALSE),\"\")","v":""}]
[{"$f":"Database!$B1589&Database!$C1589&Database!$D1589","v":"1 - Velg område fra rullegardinen herF: Systemutvikling12"},"1 - Velg område fra rullegardinen her","F: Systemutvikling",12,null,{"$f":"+IFERROR(VLOOKUP(Database2[[#This Row],[Leverandør]],Kontaktinfo[],4,FALSE),\"\")","v":""}]
[{"$f":"Database!$B1590&Database!$C1590&Database!$D1590","v":"1 - Velg område fra rullegardinen herF: Systemutvikling13"},"1 - Velg område fra rullegardinen her","F: Systemutvikling",13,null,{"$f":"+IFERROR(VLOOKUP(Database2[[#This Row],[Leverandør]],Kontaktinfo[],4,FALSE),\"\")","v":""}]
[{"$f":"Database!$B1591&Database!$C1591&Database!$D1591","v":"1 - Velg område fra rullegardinen herF: Systemutvikling14"},"1 - Velg område fra rullegardinen her","F: Systemutvikling",14,null,{"$f":"+IFERROR(VLOOKUP(Database2[[#This Row],[Leverandør]],Kontaktinfo[],4,FALSE),\"\")","v":""}]
[{"$f":"Database!$B1592&Database!$C1592&Database!$D1592","v":"1 - Velg område fra rullegardinen herF: Systemutvikling15"},"1 - Velg område fra rullegardinen her","F: Systemutvikling",15,null,{"$f":"+IFERROR(VLOOKUP(Database2[[#This Row],[Leverandør]],Kontaktinfo[],4,FALSE),\"\")","v":""}]
[{"$f":"Database!$B1593&Database!$C1593&Database!$D1593","v":"1 - Velg område fra rullegardinen herF: Systemutvikling16"},"1 - Velg område fra rullegardinen her","F: Systemutvikling",16,null,{"$f":"+IFERROR(VLOOKUP(Database2[[#This Row],[Leverandør]],Kontaktinfo[],4,FALSE),\"\")","v":""}]
[{"$f":"Database!$B1594&Database!$C1594&Database!$D1594","v":"1 - Velg område fra rullegardinen herF: Systemutvikling17"},"1 - Velg område fra rullegardinen her","F: Systemutvikling",17,null,{"$f":"+IFERROR(VLOOKUP(Database2[[#This Row],[Leverandør]],Kontaktinfo[],4,FALSE),\"\")","v":""}]
[{"$f":"Database!$B1595&Database!$C1595&Database!$D1595","v":"1 - Velg område fra rullegardinen herF: Systemutvikling18"},"1 - Velg område fra rullegardinen her","F: Systemutvikling",18,null,{"$f":"+IFERROR(VLOOKUP(Database2[[#This Row],[Leverandør]],Kontaktinfo[],4,FALSE),\"\")","v":""}]
[{"$f":"Database!$B1596&Database!$C1596&Database!$D1596","v":"1 - Velg område fra rullegardinen herF: Systemutvikling19"},"1 - Velg område fra rullegardinen her","F: Systemutvikling",19,null,{"$f":"+IFERROR(VLOOKUP(Database2[[#This Row],[Leverandør]],Kontaktinfo[],4,FALSE),\"\")","v":""}]
[{"$f":"Database!$B1597&Database!$C1597&Database!$D1597","v":"1 - Velg område fra rullegardinen herF: Systemutvikling20"},"1 - Velg område fra rullegardinen her","F: Systemutvikling",20,null,{"$f":"+IFERROR(VLOOKUP(Database2[[#This Row],[Leverandør]],Kontaktinfo[],4,FALSE),\"\")","v":""}]
[{"$f":"Database!$B1598&Database!$C1598&Database!$D1598","v":"1 - Velg område fra rullegardinen herF: Systemutvikling21"},"1 - Velg område fra rullegardinen her","F: Systemutvikling",21,null,{"$f":"+IFERROR(VLOOKUP(Database2[[#This Row],[Leverandør]],Kontaktinfo[],4,FALSE),\"\")","v":""}]
[{"$f":"Database!$B1599&Database!$C1599&Database!$D1599","v":"1 - Velg område fra rullegardinen herF: Systemutvikling22"},"1 - Velg område fra rullegardinen her","F: Systemutvikling",22,null,{"$f":"+IFERROR(VLOOKUP(Database2[[#This Row],[Leverandør]],Kontaktinfo[],4,FALSE),\"\")","v":""}]
[{"$f":"Database!$B1600&Database!$C1600&Database!$D1600","v":"1 - Velg område fra rullegardinen herF: Systemutvikling23"},"1 - Velg område fra rullegardinen her","F: Systemutvikling",23,null,{"$f":"+IFERROR(VLOOKUP(Database2[[#This Row],[Leverandør]],Kontaktinfo[],4,FALSE),\"\")","v":""}]
[{"$f":"Database!$B1601&Database!$C1601&Database!$D1601","v":"1 - Velg område fra rullegardinen herF: Systemutvikling24"},"1 - Velg område fra rullegardinen her","F: Systemutvikling",24,null,{"$f":"+IFERROR(VLOOKUP(Database2[[#This Row],[Leverandør]],Kontaktinfo[],4,FALSE),\"\")","v":""}]
[{"$f":"Database!$B1602&Database!$C1602&Database!$D1602","v":"1 - Velg område fra rullegardinen herF: Systemutvikling25"},"1 - Velg område fra rullegardinen her","F: Systemutvikling",25,null,{"$f":"+IFERROR(VLOOKUP(Database2[[#This Row],[Leverandør]],Kontaktinfo[],4,FALSE),\"\")","v":""}]
[{"$f":"Database!$B1603&Database!$C1603&Database!$D1603","v":"1 - Velg område fra rullegardinen herF: Systemutvikling26"},"1 - Velg område fra rullegardinen her","F: Systemutvikling",26,null,{"$f":"+IFERROR(VLOOKUP(Database2[[#This Row],[Leverandør]],Kontaktinfo[],4,FALSE),\"\")","v":""}]
[{"$f":"Database!$B1604&Database!$C1604&Database!$D1604","v":"1 - Velg område fra rullegardinen herF: Systemutvikling27"},"1 - Velg område fra rullegardinen her","F: Systemutvikling",27,null,{"$f":"+IFERROR(VLOOKUP(Database2[[#This Row],[Leverandør]],Kontaktinfo[],4,FALSE),\"\")","v":""}]
[{"$f":"Database!$B1605&Database!$C1605&Database!$D1605","v":"1 - Velg område fra rullegardinen herF: Systemutvikling28"},"1 - Velg område fra rullegardinen her","F: Systemutvikling",28,null,{"$f":"+IFERROR(VLOOKUP(Database2[[#This Row],[Leverandør]],Kontaktinfo[],4,FALSE),\"\")","v":""}]
[{"$f":"Database!$B1606&Database!$C1606&Database!$D1606","v":"1 - Velg område fra rullegardinen herF: Systemutvikling29"},"1 - Velg område fra rullegardinen her","F: Systemutvikling",29,null,{"$f":"+IFERROR(VLOOKUP(Database2[[#This Row],[Leverandør]],Kontaktinfo[],4,FALSE),\"\")","v":""}]
[{"$f":"Database!$B1607&Database!$C1607&Database!$D1607","v":"1 - Velg område fra rullegardinen herF: Systemutvikling30"},"1 - Velg område fra rullegardinen her","F: Systemutvikling",30,null,{"$f":"+IFERROR(VLOOKUP(Database2[[#This Row],[Leverandør]],Kontaktinfo[],4,FALSE),\"\")","v":""}]
[{"$f":"Database!$B1608&Database!$C1608&Database!$D1608","v":"1 - Velg område fra rullegardinen herF: Systemutvikling31"},"1 - Velg område fra rullegardinen her","F: Systemutvikling",31,null,{"$f":"+IFERROR(VLOOKUP(Database2[[#This Row],[Leverandør]],Kontaktinfo[],4,FALSE),\"\")","v":""}]
[{"$f":"Database!$B1609&Database!$C1609&Database!$D1609","v":"1 - Velg område fra rullegardinen herF: Systemutvikling32"},"1 - Velg område fra rullegardinen her","F: Systemutvikling",32,null,{"$f":"+IFERROR(VLOOKUP(Database2[[#This Row],[Leverandør]],Kontaktinfo[],4,FALSE),\"\")","v":""}]
[{"$f":"Database!$B1610&Database!$C1610&Database!$D1610","v":"1 - Velg område fra rullegardinen herF: Systemutvikling33"},"1 - Velg område fra rullegardinen her","F: Systemutvikling",33,null,{"$f":"+IFERROR(VLOOKUP(Database2[[#This Row],[Leverandør]],Kontaktinfo[],4,FALSE),\"\")","v":""}]
[{"$f":"Database!$B1611&Database!$C1611&Database!$D1611","v":"1 - Velg område fra rullegardinen herF: Systemutvikling34"},"1 - Velg område fra rullegardinen her","F: Systemutvikling",34,null,{"$f":"+IFERROR(VLOOKUP(Database2[[#This Row],[Leverandør]],Kontaktinfo[],4,FALSE),\"\")","v":""}]
[{"$f":"Database!$B1612&Database!$C1612&Database!$D1612","v":""},null,null,null,null,{"$f":"+IFERROR(VLOOKUP(Database2[[#This Row],[Leverandør]],Kontaktinfo[],4,FALSE),\"\")","v":""}]
[{"$f":"Database!$B1613&Database!$C1613&Database!$D1613","v":"1 - Velg område fra rullegardinen herG: Applikasjonsforvaltning, drift og forvaltning av IT-systemer og plattformer1"},"1 - Velg område fra rullegardinen her","G: Applikasjonsforvaltning, drift og forvaltning av IT-systemer og plattformer",1,null,{"$f":"+IFERROR(VLOOKUP(Database2[[#This Row],[Leverandør]],Kontaktinfo[],4,FALSE),\"\")","v":""}]
[{"$f":"Database!$B1614&Database!$C1614&Database!$D1614","v":"1 - Velg område fra rullegardinen herG: Applikasjonsforvaltning, drift og forvaltning av IT-systemer og plattformer2"},"1 - Velg område fra rullegardinen her","G: Applikasjonsforvaltning, drift og forvaltning av IT-systemer og plattformer",2,null,{"$f":"+IFERROR(VLOOKUP(Database2[[#This Row],[Leverandør]],Kontaktinfo[],4,FALSE),\"\")","v":""}]
[{"$f":"Database!$B1615&Database!$C1615&Database!$D1615","v":"1 - Velg område fra rullegardinen herG: Applikasjonsforvaltning, drift og forvaltning av IT-systemer og plattformer3"},"1 - Velg område fra rullegardinen her","G: Applikasjonsforvaltning, drift og forvaltning av IT-systemer og plattformer",3,null,{"$f":"+IFERROR(VLOOKUP(Database2[[#This Row],[Leverandør]],Kontaktinfo[],4,FALSE),\"\")","v":""}]
[{"$f":"Database!$B1616&Database!$C1616&Database!$D1616","v":"1 - Velg område fra rullegardinen herG: Applikasjonsforvaltning, drift og forvaltning av IT-systemer og plattformer4"},"1 - Velg område fra rullegardinen her","G: Applikasjonsforvaltning, drift og forvaltning av IT-systemer og plattformer",4,null,{"$f":"+IFERROR(VLOOKUP(Database2[[#This Row],[Leverandør]],Kontaktinfo[],4,FALSE),\"\")","v":""}]
[{"$f":"Database!$B1617&Database!$C1617&Database!$D1617","v":"1 - Velg område fra rullegardinen herG: Applikasjonsforvaltning, drift og forvaltning av IT-systemer og plattformer5"},"1 - Velg område fra rullegardinen her","G: Applikasjonsforvaltning, drift og forvaltning av IT-systemer og plattformer",5,null,{"$f":"+IFERROR(VLOOKUP(Database2[[#This Row],[Leverandør]],Kontaktinfo[],4,FALSE),\"\")","v":""}]
[{"$f":"Database!$B1618&Database!$C1618&Database!$D1618","v":"1 - Velg område fra rullegardinen herG: Applikasjonsforvaltning, drift og forvaltning av IT-systemer og plattformer6"},"1 - Velg område fra rullegardinen her","G: Applikasjonsforvaltning, drift og forvaltning av IT-systemer og plattformer",6,null,{"$f":"+IFERROR(VLOOKUP(Database2[[#This Row],[Leverandør]],Kontaktinfo[],4,FALSE),\"\")","v":""}]
[{"$f":"Database!$B1619&Database!$C1619&Database!$D1619","v":"1 - Velg område fra rullegardinen herG: Applikasjonsforvaltning, drift og forvaltning av IT-systemer og plattformer7"},"1 - Velg område fra rullegardinen her","G: Applikasjonsforvaltning, drift og forvaltning av IT-systemer og plattformer",7,null,{"$f":"+IFERROR(VLOOKUP(Database2[[#This Row],[Leverandør]],Kontaktinfo[],4,FALSE),\"\")","v":""}]
[{"$f":"Database!$B1620&Database!$C1620&Database!$D1620","v":"1 - Velg område fra rullegardinen herG: Applikasjonsforvaltning, drift og forvaltning av IT-systemer og plattformer8"},"1 - Velg område fra rullegardinen her","G: Applikasjonsforvaltning, drift og forvaltning av IT-systemer og plattformer",8,null,{"$f":"+IFERROR(VLOOKUP(Database2[[#This Row],[Leverandør]],Kontaktinfo[],4,FALSE),\"\")","v":""}]
[{"$f":"Database!$B1621&Database!$C1621&Database!$D1621","v":"1 - Velg område fra rullegardinen herG: Applikasjonsforvaltning, drift og forvaltning av IT-systemer og plattformer9"},"1 - Velg område fra rullegardinen her","G: Applikasjonsforvaltning, drift og forvaltning av IT-systemer og plattformer",9,null,{"$f":"+IFERROR(VLOOKUP(Database2[[#This Row],[Leverandør]],Kontaktinfo[],4,FALSE),\"\")","v":""}]
[{"$f":"Database!$B1622&Database!$C1622&Database!$D1622","v":"1 - Velg område fra rullegardinen herG: Applikasjonsforvaltning, drift og forvaltning av IT-systemer og plattformer10"},"1 - Velg område fra rullegardinen her","G: Applikasjonsforvaltning, drift og forvaltning av IT-systemer og plattformer",10,null,{"$f":"+IFERROR(VLOOKUP(Database2[[#This Row],[Leverandør]],Kontaktinfo[],4,FALSE),\"\")","v":""}]
[{"$f":"Database!$B1623&Database!$C1623&Database!$D1623","v":"1 - Velg område fra rullegardinen herG: Applikasjonsforvaltning, drift og forvaltning av IT-systemer og plattformer11"},"1 - Velg område fra rullegardinen her","G: Applikasjonsforvaltning, drift og forvaltning av IT-systemer og plattformer",11,null,{"$f":"+IFERROR(VLOOKUP(Database2[[#This Row],[Leverandør]],Kontaktinfo[],4,FALSE),\"\")","v":""}]
[{"$f":"Database!$B1624&Database!$C1624&Database!$D1624","v":"1 - Velg område fra rullegardinen herG: Applikasjonsforvaltning, drift og forvaltning av IT-systemer og plattformer12"},"1 - Velg område fra rullegardinen her","G: Applikasjonsforvaltning, drift og forvaltning av IT-systemer og plattformer",12,null,{"$f":"+IFERROR(VLOOKUP(Database2[[#This Row],[Leverandør]],Kontaktinfo[],4,FALSE),\"\")","v":""}]
[{"$f":"Database!$B1625&Database!$C1625&Database!$D1625","v":"1 - Velg område fra rullegardinen herG: Applikasjonsforvaltning, drift og forvaltning av IT-systemer og plattformer13"},"1 - Velg område fra rullegardinen her","G: Applikasjonsforvaltning, drift og forvaltning av IT-systemer og plattformer",13,null,{"$f":"+IFERROR(VLOOKUP(Database2[[#This Row],[Leverandør]],Kontaktinfo[],4,FALSE),\"\")","v":""}]
[{"$f":"Database!$B1626&Database!$C1626&Database!$D1626","v":"1 - Velg område fra rullegardinen herG: Applikasjonsforvaltning, drift og forvaltning av IT-systemer og plattformer14"},"1 - Velg område fra rullegardinen her","G: Applikasjonsforvaltning, drift og forvaltning av IT-systemer og plattformer",14,null,{"$f":"+IFERROR(VLOOKUP(Database2[[#This Row],[Leverandør]],Kontaktinfo[],4,FALSE),\"\")","v":""}]
[{"$f":"Database!$B1627&Database!$C1627&Database!$D1627","v":"1 - Velg område fra rullegardinen herG: Applikasjonsforvaltning, drift og forvaltning av IT-systemer og plattformer15"},"1 - Velg område fra rullegardinen her","G: Applikasjonsforvaltning, drift og forvaltning av IT-systemer og plattformer",15,null,{"$f":"+IFERROR(VLOOKUP(Database2[[#This Row],[Leverandør]],Kontaktinfo[],4,FALSE),\"\")","v":""}]
[{"$f":"Database!$B1628&Database!$C1628&Database!$D1628","v":"1 - Velg område fra rullegardinen herG: Applikasjonsforvaltning, drift og forvaltning av IT-systemer og plattformer16"},"1 - Velg område fra rullegardinen her","G: Applikasjonsforvaltning, drift og forvaltning av IT-systemer og plattformer",16,null,{"$f":"+IFERROR(VLOOKUP(Database2[[#This Row],[Leverandør]],Kontaktinfo[],4,FALSE),\"\")","v":""}]
[{"$f":"Database!$B1629&Database!$C1629&Database!$D1629","v":"1 - Velg område fra rullegardinen herG: Applikasjonsforvaltning, drift og forvaltning av IT-systemer og plattformer17"},"1 - Velg område fra rullegardinen her","G: Applikasjonsforvaltning, drift og forvaltning av IT-systemer og plattformer",17,null,{"$f":"+IFERROR(VLOOKUP(Database2[[#This Row],[Leverandør]],Kontaktinfo[],4,FALSE),\"\")","v":""}]
[{"$f":"Database!$B1630&Database!$C1630&Database!$D1630","v":"1 - Velg område fra rullegardinen herG: Applikasjonsforvaltning, drift og forvaltning av IT-systemer og plattformer18"},"1 - Velg område fra rullegardinen her","G: Applikasjonsforvaltning, drift og forvaltning av IT-systemer og plattformer",18,null,{"$f":"+IFERROR(VLOOKUP(Database2[[#This Row],[Leverandør]],Kontaktinfo[],4,FALSE),\"\")","v":""}]
[{"$f":"Database!$B1631&Database!$C1631&Database!$D1631","v":"1 - Velg område fra rullegardinen herG: Applikasjonsforvaltning, drift og forvaltning av IT-systemer og plattformer19"},"1 - Velg område fra rullegardinen her","G: Applikasjonsforvaltning, drift og forvaltning av IT-systemer og plattformer",19,null,{"$f":"+IFERROR(VLOOKUP(Database2[[#This Row],[Leverandør]],Kontaktinfo[],4,FALSE),\"\")","v":""}]
[{"$f":"Database!$B1632&Database!$C1632&Database!$D1632","v":"1 - Velg område fra rullegardinen herG: Applikasjonsforvaltning, drift og forvaltning av IT-systemer og plattformer20"},"1 - Velg område fra rullegardinen her","G: Applikasjonsforvaltning, drift og forvaltning av IT-systemer og plattformer",20,null,{"$f":"+IFERROR(VLOOKUP(Database2[[#This Row],[Leverandør]],Kontaktinfo[],4,FALSE),\"\")","v":""}]
[{"$f":"Database!$B1633&Database!$C1633&Database!$D1633","v":"1 - Velg område fra rullegardinen herG: Applikasjonsforvaltning, drift og forvaltning av IT-systemer og plattformer21"},"1 - Velg område fra rullegardinen her","G: Applikasjonsforvaltning, drift og forvaltning av IT-systemer og plattformer",21,null,{"$f":"+IFERROR(VLOOKUP(Database2[[#This Row],[Leverandør]],Kontaktinfo[],4,FALSE),\"\")","v":""}]
[{"$f":"Database!$B1634&Database!$C1634&Database!$D1634","v":"1 - Velg område fra rullegardinen herG: Applikasjonsforvaltning, drift og forvaltning av IT-systemer og plattformer22"},"1 - Velg område fra rullegardinen her","G: Applikasjonsforvaltning, drift og forvaltning av IT-systemer og plattformer",22,null,{"$f":"+IFERROR(VLOOKUP(Database2[[#This Row],[Leverandør]],Kontaktinfo[],4,FALSE),\"\")","v":""}]
[{"$f":"Database!$B1635&Database!$C1635&Database!$D1635","v":"1 - Velg område fra rullegardinen herG: Applikasjonsforvaltning, drift og forvaltning av IT-systemer og plattformer23"},"1 - Velg område fra rullegardinen her","G: Applikasjonsforvaltning, drift og forvaltning av IT-systemer og plattformer",23,null,{"$f":"+IFERROR(VLOOKUP(Database2[[#This Row],[Leverandør]],Kontaktinfo[],4,FALSE),\"\")","v":""}]
[{"$f":"Database!$B1636&Database!$C1636&Database!$D1636","v":"1 - Velg område fra rullegardinen herG: Applikasjonsforvaltning, drift og forvaltning av IT-systemer og plattformer24"},"1 - Velg område fra rullegardinen her","G: Applikasjonsforvaltning, drift og forvaltning av IT-systemer og plattformer",24,null,{"$f":"+IFERROR(VLOOKUP(Database2[[#This Row],[Leverandør]],Kontaktinfo[],4,FALSE),\"\")","v":""}]
[{"$f":"Database!$B1637&Database!$C1637&Database!$D1637","v":"1 - Velg område fra rullegardinen herG: Applikasjonsforvaltning, drift og forvaltning av IT-systemer og plattformer25"},"1 - Velg område fra rullegardinen her","G: Applikasjonsforvaltning, drift og forvaltning av IT-systemer og plattformer",25,null,{"$f":"+IFERROR(VLOOKUP(Database2[[#This Row],[Leverandør]],Kontaktinfo[],4,FALSE),\"\")","v":""}]
[{"$f":"Database!$B1638&Database!$C1638&Database!$D1638","v":"1 - Velg område fra rullegardinen herG: Applikasjonsforvaltning, drift og forvaltning av IT-systemer og plattformer26"},"1 - Velg område fra rullegardinen her","G: Applikasjonsforvaltning, drift og forvaltning av IT-systemer og plattformer",26,null,{"$f":"+IFERROR(VLOOKUP(Database2[[#This Row],[Leverandør]],Kontaktinfo[],4,FALSE),\"\")","v":""}]
[{"$f":"Database!$B1639&Database!$C1639&Database!$D1639","v":"1 - Velg område fra rullegardinen herG: Applikasjonsforvaltning, drift og forvaltning av IT-systemer og plattformer27"},"1 - Velg område fra rullegardinen her","G: Applikasjonsforvaltning, drift og forvaltning av IT-systemer og plattformer",27,null,{"$f":"+IFERROR(VLOOKUP(Database2[[#This Row],[Leverandør]],Kontaktinfo[],4,FALSE),\"\")","v":""}]
[{"$f":"Database!$B1640&Database!$C1640&Database!$D1640","v":"1 - Velg område fra rullegardinen herG: Applikasjonsforvaltning, drift og forvaltning av IT-systemer og plattformer28"},"1 - Velg område fra rullegardinen her","G: Applikasjonsforvaltning, drift og forvaltning av IT-systemer og plattformer",28,null,{"$f":"+IFERROR(VLOOKUP(Database2[[#This Row],[Leverandør]],Kontaktinfo[],4,FALSE),\"\")","v":""}]
[{"$f":"Database!$B1641&Database!$C1641&Database!$D1641","v":"1 - Velg område fra rullegardinen herG: Applikasjonsforvaltning, drift og forvaltning av IT-systemer og plattformer29"},"1 - Velg område fra rullegardinen her","G: Applikasjonsforvaltning, drift og forvaltning av IT-systemer og plattformer",29,null,{"$f":"+IFERROR(VLOOKUP(Database2[[#This Row],[Leverandør]],Kontaktinfo[],4,FALSE),\"\")","v":""}]
[{"$f":"Database!$B1642&Database!$C1642&Database!$D1642","v":"1 - Velg område fra rullegardinen herG: Applikasjonsforvaltning, drift og forvaltning av IT-systemer og plattformer30"},"1 - Velg område fra rullegardinen her","G: Applikasjonsforvaltning, drift og forvaltning av IT-systemer og plattformer",30,null,{"$f":"+IFERROR(VLOOKUP(Database2[[#This Row],[Leverandør]],Kontaktinfo[],4,FALSE),\"\")","v":""}]
[{"$f":"Database!$B1643&Database!$C1643&Database!$D1643","v":"1 - Velg område fra rullegardinen herG: Applikasjonsforvaltning, drift og forvaltning av IT-systemer og plattformer31"},"1 - Velg område fra rullegardinen her","G: Applikasjonsforvaltning, drift og forvaltning av IT-systemer og plattformer",31,null,{"$f":"+IFERROR(VLOOKUP(Database2[[#This Row],[Leverandør]],Kontaktinfo[],4,FALSE),\"\")","v":""}]
[{"$f":"Database!$B1644&Database!$C1644&Database!$D1644","v":"1 - Velg område fra rullegardinen herG: Applikasjonsforvaltning, drift og forvaltning av IT-systemer og plattformer32"},"1 - Velg område fra rullegardinen her","G: Applikasjonsforvaltning, drift og forvaltning av IT-systemer og plattformer",32,null,{"$f":"+IFERROR(VLOOKUP(Database2[[#This Row],[Leverandør]],Kontaktinfo[],4,FALSE),\"\")","v":""}]
[{"$f":"Database!$B1645&Database!$C1645&Database!$D1645","v":"1 - Velg område fra rullegardinen herG: Applikasjonsforvaltning, drift og forvaltning av IT-systemer og plattformer33"},"1 - Velg område fra rullegardinen her","G: Applikasjonsforvaltning, drift og forvaltning av IT-systemer og plattformer",33,null,{"$f":"+IFERROR(VLOOKUP(Database2[[#This Row],[Leverandør]],Kontaktinfo[],4,FALSE),\"\")","v":""}]
[{"$f":"Database!$B1646&Database!$C1646&Database!$D1646","v":"1 - Velg område fra rullegardinen herG: Applikasjonsforvaltning, drift og forvaltning av IT-systemer og plattformer34"},"1 - Velg område fra rullegardinen her","G: Applikasjonsforvaltning, drift og forvaltning av IT-systemer og plattformer",34,null,{"$f":"+IFERROR(VLOOKUP(Database2[[#This Row],[Leverandør]],Kontaktinfo[],4,FALSE),\"\")","v":""}]
[{"$f":"Database!$B1647&Database!$C1647&Database!$D1647","v":""},null,null,null,null,{"$f":"+IFERROR(VLOOKUP(Database2[[#This Row],[Leverandør]],Kontaktinfo[],4,FALSE),\"\")","v":""}]
[{"$f":"Database!$B1648&Database!$C1648&Database!$D1648","v":"1 - Velg område fra rullegardinen herH: Nettverk1"},"1 - Velg område fra rullegardinen her","H: Nettverk",1,null,{"$f":"+IFERROR(VLOOKUP(Database2[[#This Row],[Leverandør]],Kontaktinfo[],4,FALSE),\"\")","v":""}]
[{"$f":"Database!$B1649&Database!$C1649&Database!$D1649","v":"1 - Velg område fra rullegardinen herH: Nettverk2"},"1 - Velg område fra rullegardinen her","H: Nettverk",2,null,{"$f":"+IFERROR(VLOOKUP(Database2[[#This Row],[Leverandør]],Kontaktinfo[],4,FALSE),\"\")","v":""}]
[{"$f":"Database!$B1650&Database!$C1650&Database!$D1650","v":"1 - Velg område fra rullegardinen herH: Nettverk3"},"1 - Velg område fra rullegardinen her","H: Nettverk",3,null,{"$f":"+IFERROR(VLOOKUP(Database2[[#This Row],[Leverandør]],Kontaktinfo[],4,FALSE),\"\")","v":""}]
[{"$f":"Database!$B1651&Database!$C1651&Database!$D1651","v":"1 - Velg område fra rullegardinen herH: Nettverk4"},"1 - Velg område fra rullegardinen her","H: Nettverk",4,null,{"$f":"+IFERROR(VLOOKUP(Database2[[#This Row],[Leverandør]],Kontaktinfo[],4,FALSE),\"\")","v":""}]
[{"$f":"Database!$B1652&Database!$C1652&Database!$D1652","v":"1 - Velg område fra rullegardinen herH: Nettverk5"},"1 - Velg område fra rullegardinen her","H: Nettverk",5,null,{"$f":"+IFERROR(VLOOKUP(Database2[[#This Row],[Leverandør]],Kontaktinfo[],4,FALSE),\"\")","v":""}]
[{"$f":"Database!$B1653&Database!$C1653&Database!$D1653","v":"1 - Velg område fra rullegardinen herH: Nettverk6"},"1 - Velg område fra rullegardinen her","H: Nettverk",6,null,{"$f":"+IFERROR(VLOOKUP(Database2[[#This Row],[Leverandør]],Kontaktinfo[],4,FALSE),\"\")","v":""}]
[{"$f":"Database!$B1654&Database!$C1654&Database!$D1654","v":"1 - Velg område fra rullegardinen herH: Nettverk7"},"1 - Velg område fra rullegardinen her","H: Nettverk",7,null,{"$f":"+IFERROR(VLOOKUP(Database2[[#This Row],[Leverandør]],Kontaktinfo[],4,FALSE),\"\")","v":""}]
[{"$f":"Database!$B1655&Database!$C1655&Database!$D1655","v":"1 - Velg område fra rullegardinen herH: Nettverk8"},"1 - Velg område fra rullegardinen her","H: Nettverk",8,null,{"$f":"+IFERROR(VLOOKUP(Database2[[#This Row],[Leverandør]],Kontaktinfo[],4,FALSE),\"\")","v":""}]
[{"$f":"Database!$B1656&Database!$C1656&Database!$D1656","v":"1 - Velg område fra rullegardinen herH: Nettverk9"},"1 - Velg område fra rullegardinen her","H: Nettverk",9,null,{"$f":"+IFERROR(VLOOKUP(Database2[[#This Row],[Leverandør]],Kontaktinfo[],4,FALSE),\"\")","v":""}]
[{"$f":"Database!$B1657&Database!$C1657&Database!$D1657","v":"1 - Velg område fra rullegardinen herH: Nettverk10"},"1 - Velg område fra rullegardinen her","H: Nettverk",10,null,{"$f":"+IFERROR(VLOOKUP(Database2[[#This Row],[Leverandør]],Kontaktinfo[],4,FALSE),\"\")","v":""}]
[{"$f":"Database!$B1658&Database!$C1658&Database!$D1658","v":"1 - Velg område fra rullegardinen herH: Nettverk11"},"1 - Velg område fra rullegardinen her","H: Nettverk",11,null,{"$f":"+IFERROR(VLOOKUP(Database2[[#This Row],[Leverandør]],Kontaktinfo[],4,FALSE),\"\")","v":""}]
[{"$f":"Database!$B1659&Database!$C1659&Database!$D1659","v":"1 - Velg område fra rullegardinen herH: Nettverk12"},"1 - Velg område fra rullegardinen her","H: Nettverk",12,null,{"$f":"+IFERROR(VLOOKUP(Database2[[#This Row],[Leverandør]],Kontaktinfo[],4,FALSE),\"\")","v":""}]
[{"$f":"Database!$B1660&Database!$C1660&Database!$D1660","v":"1 - Velg område fra rullegardinen herH: Nettverk13"},"1 - Velg område fra rullegardinen her","H: Nettverk",13,null,{"$f":"+IFERROR(VLOOKUP(Database2[[#This Row],[Leverandør]],Kontaktinfo[],4,FALSE),\"\")","v":""}]
[{"$f":"Database!$B1661&Database!$C1661&Database!$D1661","v":"1 - Velg område fra rullegardinen herH: Nettverk14"},"1 - Velg område fra rullegardinen her","H: Nettverk",14,null,{"$f":"+IFERROR(VLOOKUP(Database2[[#This Row],[Leverandør]],Kontaktinfo[],4,FALSE),\"\")","v":""}]
[{"$f":"Database!$B1662&Database!$C1662&Database!$D1662","v":"1 - Velg område fra rullegardinen herH: Nettverk15"},"1 - Velg område fra rullegardinen her","H: Nettverk",15,null,{"$f":"+IFERROR(VLOOKUP(Database2[[#This Row],[Leverandør]],Kontaktinfo[],4,FALSE),\"\")","v":""}]
[{"$f":"Database!$B1663&Database!$C1663&Database!$D1663","v":"1 - Velg område fra rullegardinen herH: Nettverk16"},"1 - Velg område fra rullegardinen her","H: Nettverk",16,null,{"$f":"+IFERROR(VLOOKUP(Database2[[#This Row],[Leverandør]],Kontaktinfo[],4,FALSE),\"\")","v":""}]
[{"$f":"Database!$B1664&Database!$C1664&Database!$D1664","v":"1 - Velg område fra rullegardinen herH: Nettverk17"},"1 - Velg område fra rullegardinen her","H: Nettverk",17,null,{"$f":"+IFERROR(VLOOKUP(Database2[[#This Row],[Leverandør]],Kontaktinfo[],4,FALSE),\"\")","v":""}]
[{"$f":"Database!$B1665&Database!$C1665&Database!$D1665","v":"1 - Velg område fra rullegardinen herH: Nettverk18"},"1 - Velg område fra rullegardinen her","H: Nettverk",18,null,{"$f":"+IFERROR(VLOOKUP(Database2[[#This Row],[Leverandør]],Kontaktinfo[],4,FALSE),\"\")","v":""}]
[{"$f":"Database!$B1666&Database!$C1666&Database!$D1666","v":"1 - Velg område fra rullegardinen herH: Nettverk19"},"1 - Velg område fra rullegardinen her","H: Nettverk",19,null,{"$f":"+IFERROR(VLOOKUP(Database2[[#This Row],[Leverandør]],Kontaktinfo[],4,FALSE),\"\")","v":""}]
[{"$f":"Database!$B1667&Database!$C1667&Database!$D1667","v":"1 - Velg område fra rullegardinen herH: Nettverk20"},"1 - Velg område fra rullegardinen her","H: Nettverk",20,null,{"$f":"+IFERROR(VLOOKUP(Database2[[#This Row],[Leverandør]],Kontaktinfo[],4,FALSE),\"\")","v":""}]
[{"$f":"Database!$B1668&Database!$C1668&Database!$D1668","v":"1 - Velg område fra rullegardinen herH: Nettverk21"},"1 - Velg område fra rullegardinen her","H: Nettverk",21,null,{"$f":"+IFERROR(VLOOKUP(Database2[[#This Row],[Leverandør]],Kontaktinfo[],4,FALSE),\"\")","v":""}]
[{"$f":"Database!$B1669&Database!$C1669&Database!$D1669","v":"1 - Velg område fra rullegardinen herH: Nettverk22"},"1 - Velg område fra rullegardinen her","H: Nettverk",22,null,{"$f":"+IFERROR(VLOOKUP(Database2[[#This Row],[Leverandør]],Kontaktinfo[],4,FALSE),\"\")","v":""}]
[{"$f":"Database!$B1670&Database!$C1670&Database!$D1670","v":"1 - Velg område fra rullegardinen herH: Nettverk23"},"1 - Velg område fra rullegardinen her","H: Nettverk",23,null,{"$f":"+IFERROR(VLOOKUP(Database2[[#This Row],[Leverandør]],Kontaktinfo[],4,FALSE),\"\")","v":""}]
[{"$f":"Database!$B1671&Database!$C1671&Database!$D1671","v":"1 - Velg område fra rullegardinen herH: Nettverk24"},"1 - Velg område fra rullegardinen her","H: Nettverk",24,null,{"$f":"+IFERROR(VLOOKUP(Database2[[#This Row],[Leverandør]],Kontaktinfo[],4,FALSE),\"\")","v":""}]
[{"$f":"Database!$B1672&Database!$C1672&Database!$D1672","v":"1 - Velg område fra rullegardinen herH: Nettverk25"},"1 - Velg område fra rullegardinen her","H: Nettverk",25,null,{"$f":"+IFERROR(VLOOKUP(Database2[[#This Row],[Leverandør]],Kontaktinfo[],4,FALSE),\"\")","v":""}]
[{"$f":"Database!$B1673&Database!$C1673&Database!$D1673","v":"1 - Velg område fra rullegardinen herH: Nettverk26"},"1 - Velg område fra rullegardinen her","H: Nettverk",26,null,{"$f":"+IFERROR(VLOOKUP(Database2[[#This Row],[Leverandør]],Kontaktinfo[],4,FALSE),\"\")","v":""}]
[{"$f":"Database!$B1674&Database!$C1674&Database!$D1674","v":"1 - Velg område fra rullegardinen herH: Nettverk27"},"1 - Velg område fra rullegardinen her","H: Nettverk",27,null,{"$f":"+IFERROR(VLOOKUP(Database2[[#This Row],[Leverandør]],Kontaktinfo[],4,FALSE),\"\")","v":""}]
[{"$f":"Database!$B1675&Database!$C1675&Database!$D1675","v":"1 - Velg område fra rullegardinen herH: Nettverk28"},"1 - Velg område fra rullegardinen her","H: Nettverk",28,null,{"$f":"+IFERROR(VLOOKUP(Database2[[#This Row],[Leverandør]],Kontaktinfo[],4,FALSE),\"\")","v":""}]
[{"$f":"Database!$B1676&Database!$C1676&Database!$D1676","v":"1 - Velg område fra rullegardinen herH: Nettverk29"},"1 - Velg område fra rullegardinen her","H: Nettverk",29,null,{"$f":"+IFERROR(VLOOKUP(Database2[[#This Row],[Leverandør]],Kontaktinfo[],4,FALSE),\"\")","v":""}]
[{"$f":"Database!$B1677&Database!$C1677&Database!$D1677","v":"1 - Velg område fra rullegardinen herH: Nettverk30"},"1 - Velg område fra rullegardinen her","H: Nettverk",30,null,{"$f":"+IFERROR(VLOOKUP(Database2[[#This Row],[Leverandør]],Kontaktinfo[],4,FALSE),\"\")","v":""}]
[{"$f":"Database!$B1678&Database!$C1678&Database!$D1678","v":"1 - Velg område fra rullegardinen herH: Nettverk31"},"1 - Velg område fra rullegardinen her","H: Nettverk",31,null,{"$f":"+IFERROR(VLOOKUP(Database2[[#This Row],[Leverandør]],Kontaktinfo[],4,FALSE),\"\")","v":""}]
[{"$f":"Database!$B1679&Database!$C1679&Database!$D1679","v":"1 - Velg område fra rullegardinen herH: Nettverk32"},"1 - Velg område fra rullegardinen her","H: Nettverk",32,null,{"$f":"+IFERROR(VLOOKUP(Database2[[#This Row],[Leverandør]],Kontaktinfo[],4,FALSE),\"\")","v":""}]
[{"$f":"Database!$B1680&Database!$C1680&Database!$D1680","v":"1 - Velg område fra rullegardinen herH: Nettverk33"},"1 - Velg område fra rullegardinen her","H: Nettverk",33,null,{"$f":"+IFERROR(VLOOKUP(Database2[[#This Row],[Leverandør]],Kontaktinfo[],4,FALSE),\"\")","v":""}]
[{"$f":"Database!$B1681&Database!$C1681&Database!$D1681","v":"1 - Velg område fra rullegardinen herH: Nettverk34"},"1 - Velg område fra rullegardinen her","H: Nettverk",34,null,{"$f":"+IFERROR(VLOOKUP(Database2[[#This Row],[Leverandør]],Kontaktinfo[],4,FALSE),\"\")","v":""}]
[{"$f":"Database!$B1682&Database!$C1682&Database!$D1682","v":""},null,null,null,null,{"$f":"+IFERROR(VLOOKUP(Database2[[#This Row],[Leverandør]],Kontaktinfo[],4,FALSE),\"\")","v":""}]
[{"$f":"Database!$B1683&Database!$C1683&Database!$D1683","v":"1 - Velg område fra rullegardinen herI: Telekommunikasjon1"},"1 - Velg område fra rullegardinen her","I: Telekommunikasjon",1,null,{"$f":"+IFERROR(VLOOKUP(Database2[[#This Row],[Leverandør]],Kontaktinfo[],4,FALSE),\"\")","v":""}]
[{"$f":"Database!$B1684&Database!$C1684&Database!$D1684","v":"1 - Velg område fra rullegardinen herI: Telekommunikasjon2"},"1 - Velg område fra rullegardinen her","I: Telekommunikasjon",2,null,{"$f":"+IFERROR(VLOOKUP(Database2[[#This Row],[Leverandør]],Kontaktinfo[],4,FALSE),\"\")","v":""}]
[{"$f":"Database!$B1685&Database!$C1685&Database!$D1685","v":"1 - Velg område fra rullegardinen herI: Telekommunikasjon3"},"1 - Velg område fra rullegardinen her","I: Telekommunikasjon",3,null,{"$f":"+IFERROR(VLOOKUP(Database2[[#This Row],[Leverandør]],Kontaktinfo[],4,FALSE),\"\")","v":""}]
[{"$f":"Database!$B1686&Database!$C1686&Database!$D1686","v":"1 - Velg område fra rullegardinen herI: Telekommunikasjon4"},"1 - Velg område fra rullegardinen her","I: Telekommunikasjon",4,null,{"$f":"+IFERROR(VLOOKUP(Database2[[#This Row],[Leverandør]],Kontaktinfo[],4,FALSE),\"\")","v":""}]
[{"$f":"Database!$B1687&Database!$C1687&Database!$D1687","v":"1 - Velg område fra rullegardinen herI: Telekommunikasjon5"},"1 - Velg område fra rullegardinen her","I: Telekommunikasjon",5,null,{"$f":"+IFERROR(VLOOKUP(Database2[[#This Row],[Leverandør]],Kontaktinfo[],4,FALSE),\"\")","v":""}]
[{"$f":"Database!$B1688&Database!$C1688&Database!$D1688","v":"1 - Velg område fra rullegardinen herI: Telekommunikasjon6"},"1 - Velg område fra rullegardinen her","I: Telekommunikasjon",6,null,{"$f":"+IFERROR(VLOOKUP(Database2[[#This Row],[Leverandør]],Kontaktinfo[],4,FALSE),\"\")","v":""}]
[{"$f":"Database!$B1689&Database!$C1689&Database!$D1689","v":"1 - Velg område fra rullegardinen herI: Telekommunikasjon7"},"1 - Velg område fra rullegardinen her","I: Telekommunikasjon",7,null,{"$f":"+IFERROR(VLOOKUP(Database2[[#This Row],[Leverandør]],Kontaktinfo[],4,FALSE),\"\")","v":""}]
[{"$f":"Database!$B1690&Database!$C1690&Database!$D1690","v":"1 - Velg område fra rullegardinen herI: Telekommunikasjon8"},"1 - Velg område fra rullegardinen her","I: Telekommunikasjon",8,null,{"$f":"+IFERROR(VLOOKUP(Database2[[#This Row],[Leverandør]],Kontaktinfo[],4,FALSE),\"\")","v":""}]
[{"$f":"Database!$B1691&Database!$C1691&Database!$D1691","v":"1 - Velg område fra rullegardinen herI: Telekommunikasjon9"},"1 - Velg område fra rullegardinen her","I: Telekommunikasjon",9,null,{"$f":"+IFERROR(VLOOKUP(Database2[[#This Row],[Leverandør]],Kontaktinfo[],4,FALSE),\"\")","v":""}]
[{"$f":"Database!$B1692&Database!$C1692&Database!$D1692","v":"1 - Velg område fra rullegardinen herI: Telekommunikasjon10"},"1 - Velg område fra rullegardinen her","I: Telekommunikasjon",10,null,{"$f":"+IFERROR(VLOOKUP(Database2[[#This Row],[Leverandør]],Kontaktinfo[],4,FALSE),\"\")","v":""}]
[{"$f":"Database!$B1693&Database!$C1693&Database!$D1693","v":"1 - Velg område fra rullegardinen herI: Telekommunikasjon11"},"1 - Velg område fra rullegardinen her","I: Telekommunikasjon",11,null,{"$f":"+IFERROR(VLOOKUP(Database2[[#This Row],[Leverandør]],Kontaktinfo[],4,FALSE),\"\")","v":""}]
[{"$f":"Database!$B1694&Database!$C1694&Database!$D1694","v":"1 - Velg område fra rullegardinen herI: Telekommunikasjon12"},"1 - Velg område fra rullegardinen her","I: Telekommunikasjon",12,null,{"$f":"+IFERROR(VLOOKUP(Database2[[#This Row],[Leverandør]],Kontaktinfo[],4,FALSE),\"\")","v":""}]
[{"$f":"Database!$B1695&Database!$C1695&Database!$D1695","v":"1 - Velg område fra rullegardinen herI: Telekommunikasjon13"},"1 - Velg område fra rullegardinen her","I: Telekommunikasjon",13,null,{"$f":"+IFERROR(VLOOKUP(Database2[[#This Row],[Leverandør]],Kontaktinfo[],4,FALSE),\"\")","v":""}]
[{"$f":"Database!$B1696&Database!$C1696&Database!$D1696","v":"1 - Velg område fra rullegardinen herI: Telekommunikasjon14"},"1 - Velg område fra rullegardinen her","I: Telekommunikasjon",14,null,{"$f":"+IFERROR(VLOOKUP(Database2[[#This Row],[Leverandør]],Kontaktinfo[],4,FALSE),\"\")","v":""}]
[{"$f":"Database!$B1697&Database!$C1697&Database!$D1697","v":"1 - Velg område fra rullegardinen herI: Telekommunikasjon15"},"1 - Velg område fra rullegardinen her","I: Telekommunikasjon",15,null,{"$f":"+IFERROR(VLOOKUP(Database2[[#This Row],[Leverandør]],Kontaktinfo[],4,FALSE),\"\")","v":""}]
[{"$f":"Database!$B1698&Database!$C1698&Database!$D1698","v":"1 - Velg område fra rullegardinen herI: Telekommunikasjon16"},"1 - Velg område fra rullegardinen her","I: Telekommunikasjon",16,null,{"$f":"+IFERROR(VLOOKUP(Database2[[#This Row],[Leverandør]],Kontaktinfo[],4,FALSE),\"\")","v":""}]
[{"$f":"Database!$B1699&Database!$C1699&Database!$D1699","v":"1 - Velg område fra rullegardinen herI: Telekommunikasjon17"},"1 - Velg område fra rullegardinen her","I: Telekommunikasjon",17,null,{"$f":"+IFERROR(VLOOKUP(Database2[[#This Row],[Leverandør]],Kontaktinfo[],4,FALSE),\"\")","v":""}]
[{"$f":"Database!$B1700&Database!$C1700&Database!$D1700","v":"1 - Velg område fra rullegardinen herI: Telekommunikasjon18"},"1 - Velg område fra rullegardinen her","I: Telekommunikasjon",18,null,{"$f":"+IFERROR(VLOOKUP(Database2[[#This Row],[Leverandør]],Kontaktinfo[],4,FALSE),\"\")","v":""}]
[{"$f":"Database!$B1701&Database!$C1701&Database!$D1701","v":"1 - Velg område fra rullegardinen herI: Telekommunikasjon19"},"1 - Velg område fra rullegardinen her","I: Telekommunikasjon",19,null,{"$f":"+IFERROR(VLOOKUP(Database2[[#This Row],[Leverandør]],Kontaktinfo[],4,FALSE),\"\")","v":""}]
[{"$f":"Database!$B1702&Database!$C1702&Database!$D1702","v":"1 - Velg område fra rullegardinen herI: Telekommunikasjon20"},"1 - Velg område fra rullegardinen her","I: Telekommunikasjon",20,null,{"$f":"+IFERROR(VLOOKUP(Database2[[#This Row],[Leverandør]],Kontaktinfo[],4,FALSE),\"\")","v":""}]
[{"$f":"Database!$B1703&Database!$C1703&Database!$D1703","v":"1 - Velg område fra rullegardinen herI: Telekommunikasjon21"},"1 - Velg område fra rullegardinen her","I: Telekommunikasjon",21,null,{"$f":"+IFERROR(VLOOKUP(Database2[[#This Row],[Leverandør]],Kontaktinfo[],4,FALSE),\"\")","v":""}]
[{"$f":"Database!$B1704&Database!$C1704&Database!$D1704","v":"1 - Velg område fra rullegardinen herI: Telekommunikasjon22"},"1 - Velg område fra rullegardinen her","I: Telekommunikasjon",22,null,{"$f":"+IFERROR(VLOOKUP(Database2[[#This Row],[Leverandør]],Kontaktinfo[],4,FALSE),\"\")","v":""}]
[{"$f":"Database!$B1705&Database!$C1705&Database!$D1705","v":"1 - Velg område fra rullegardinen herI: Telekommunikasjon23"},"1 - Velg område fra rullegardinen her","I: Telekommunikasjon",23,null,{"$f":"+IFERROR(VLOOKUP(Database2[[#This Row],[Leverandør]],Kontaktinfo[],4,FALSE),\"\")","v":""}]
[{"$f":"Database!$B1706&Database!$C1706&Database!$D1706","v":"1 - Velg område fra rullegardinen herI: Telekommunikasjon24"},"1 - Velg område fra rullegardinen her","I: Telekommunikasjon",24,null,{"$f":"+IFERROR(VLOOKUP(Database2[[#This Row],[Leverandør]],Kontaktinfo[],4,FALSE),\"\")","v":""}]
[{"$f":"Database!$B1707&Database!$C1707&Database!$D1707","v":"1 - Velg område fra rullegardinen herI: Telekommunikasjon25"},"1 - Velg område fra rullegardinen her","I: Telekommunikasjon",25,null,{"$f":"+IFERROR(VLOOKUP(Database2[[#This Row],[Leverandør]],Kontaktinfo[],4,FALSE),\"\")","v":""}]
[{"$f":"Database!$B1708&Database!$C1708&Database!$D1708","v":"1 - Velg område fra rullegardinen herI: Telekommunikasjon26"},"1 - Velg område fra rullegardinen her","I: Telekommunikasjon",26,null,{"$f":"+IFERROR(VLOOKUP(Database2[[#This Row],[Leverandør]],Kontaktinfo[],4,FALSE),\"\")","v":""}]
[{"$f":"Database!$B1709&Database!$C1709&Database!$D1709","v":"1 - Velg område fra rullegardinen herI: Telekommunikasjon27"},"1 - Velg område fra rullegardinen her","I: Telekommunikasjon",27,null,{"$f":"+IFERROR(VLOOKUP(Database2[[#This Row],[Leverandør]],Kontaktinfo[],4,FALSE),\"\")","v":""}]
[{"$f":"Database!$B1710&Database!$C1710&Database!$D1710","v":"1 - Velg område fra rullegardinen herI: Telekommunikasjon28"},"1 - Velg område fra rullegardinen her","I: Telekommunikasjon",28,null,{"$f":"+IFERROR(VLOOKUP(Database2[[#This Row],[Leverandør]],Kontaktinfo[],4,FALSE),\"\")","v":""}]
[{"$f":"Database!$B1711&Database!$C1711&Database!$D1711","v":"1 - Velg område fra rullegardinen herI: Telekommunikasjon29"},"1 - Velg område fra rullegardinen her","I: Telekommunikasjon",29,null,{"$f":"+IFERROR(VLOOKUP(Database2[[#This Row],[Leverandør]],Kontaktinfo[],4,FALSE),\"\")","v":""}]
[{"$f":"Database!$B1712&Database!$C1712&Database!$D1712","v":"1 - Velg område fra rullegardinen herI: Telekommunikasjon30"},"1 - Velg område fra rullegardinen her","I: Telekommunikasjon",30,null,{"$f":"+IFERROR(VLOOKUP(Database2[[#This Row],[Leverandør]],Kontaktinfo[],4,FALSE),\"\")","v":""}]
[{"$f":"Database!$B1713&Database!$C1713&Database!$D1713","v":"1 - Velg område fra rullegardinen herI: Telekommunikasjon31"},"1 - Velg område fra rullegardinen her","I: Telekommunikasjon",31,null,{"$f":"+IFERROR(VLOOKUP(Database2[[#This Row],[Leverandør]],Kontaktinfo[],4,FALSE),\"\")","v":""}]
[{"$f":"Database!$B1714&Database!$C1714&Database!$D1714","v":"1 - Velg område fra rullegardinen herI: Telekommunikasjon32"},"1 - Velg område fra rullegardinen her","I: Telekommunikasjon",32,null,{"$f":"+IFERROR(VLOOKUP(Database2[[#This Row],[Leverandør]],Kontaktinfo[],4,FALSE),\"\")","v":""}]
[{"$f":"Database!$B1715&Database!$C1715&Database!$D1715","v":"1 - Velg område fra rullegardinen herI: Telekommunikasjon33"},"1 - Velg område fra rullegardinen her","I: Telekommunikasjon",33,null,{"$f":"+IFERROR(VLOOKUP(Database2[[#This Row],[Leverandør]],Kontaktinfo[],4,FALSE),\"\")","v":""}]
[{"$f":"Database!$B1716&Database!$C1716&Database!$D1716","v":"1 - Velg område fra rullegardinen herI: Telekommunikasjon34"},"1 - Velg område fra rullegardinen her","I: Telekommunikasjon",34,null,{"$f":"+IFERROR(VLOOKUP(Database2[[#This Row],[Leverandør]],Kontaktinfo[],4,FALSE),\"\")","v":""}]
[{"$f":"Database!$B1717&Database!$C1717&Database!$D1717","v":""},null,null,null,null,{"$f":"+IFERROR(VLOOKUP(Database2[[#This Row],[Leverandør]],Kontaktinfo[],4,FALSE),\"\")","v":""}]
[{"$f":"Database!$B1718&Database!$C1718&Database!$D1718","v":"1 - Velg område fra rullegardinen herJ: Tverrfaglige team1"},"1 - Velg område fra rullegardinen her","J: Tverrfaglige team",1,null,{"$f":"+IFERROR(VLOOKUP(Database2[[#This Row],[Leverandør]],Kontaktinfo[],4,FALSE),\"\")","v":""}]
[{"$f":"Database!$B1719&Database!$C1719&Database!$D1719","v":"1 - Velg område fra rullegardinen herJ: Tverrfaglige team2"},"1 - Velg område fra rullegardinen her","J: Tverrfaglige team",2,null,{"$f":"+IFERROR(VLOOKUP(Database2[[#This Row],[Leverandør]],Kontaktinfo[],4,FALSE),\"\")","v":""}]
[{"$f":"Database!$B1720&Database!$C1720&Database!$D1720","v":"1 - Velg område fra rullegardinen herJ: Tverrfaglige team3"},"1 - Velg område fra rullegardinen her","J: Tverrfaglige team",3,null,{"$f":"+IFERROR(VLOOKUP(Database2[[#This Row],[Leverandør]],Kontaktinfo[],4,FALSE),\"\")","v":""}]
[{"$f":"Database!$B1721&Database!$C1721&Database!$D1721","v":"1 - Velg område fra rullegardinen herJ: Tverrfaglige team4"},"1 - Velg område fra rullegardinen her","J: Tverrfaglige team",4,null,{"$f":"+IFERROR(VLOOKUP(Database2[[#This Row],[Leverandør]],Kontaktinfo[],4,FALSE),\"\")","v":""}]
[{"$f":"Database!$B1722&Database!$C1722&Database!$D1722","v":"1 - Velg område fra rullegardinen herJ: Tverrfaglige team5"},"1 - Velg område fra rullegardinen her","J: Tverrfaglige team",5,null,{"$f":"+IFERROR(VLOOKUP(Database2[[#This Row],[Leverandør]],Kontaktinfo[],4,FALSE),\"\")","v":""}]
[{"$f":"Database!$B1723&Database!$C1723&Database!$D1723","v":"1 - Velg område fra rullegardinen herJ: Tverrfaglige team6"},"1 - Velg område fra rullegardinen her","J: Tverrfaglige team",6,null,{"$f":"+IFERROR(VLOOKUP(Database2[[#This Row],[Leverandør]],Kontaktinfo[],4,FALSE),\"\")","v":""}]
[{"$f":"Database!$B1724&Database!$C1724&Database!$D1724","v":"1 - Velg område fra rullegardinen herJ: Tverrfaglige team7"},"1 - Velg område fra rullegardinen her","J: Tverrfaglige team",7,null,{"$f":"+IFERROR(VLOOKUP(Database2[[#This Row],[Leverandør]],Kontaktinfo[],4,FALSE),\"\")","v":""}]
[{"$f":"Database!$B1725&Database!$C1725&Database!$D1725","v":"1 - Velg område fra rullegardinen herJ: Tverrfaglige team8"},"1 - Velg område fra rullegardinen her","J: Tverrfaglige team",8,null,{"$f":"+IFERROR(VLOOKUP(Database2[[#This Row],[Leverandør]],Kontaktinfo[],4,FALSE),\"\")","v":""}]
[{"$f":"Database!$B1726&Database!$C1726&Database!$D1726","v":"1 - Velg område fra rullegardinen herJ: Tverrfaglige team9"},"1 - Velg område fra rullegardinen her","J: Tverrfaglige team",9,null,{"$f":"+IFERROR(VLOOKUP(Database2[[#This Row],[Leverandør]],Kontaktinfo[],4,FALSE),\"\")","v":""}]
[{"$f":"Database!$B1727&Database!$C1727&Database!$D1727","v":"1 - Velg område fra rullegardinen herJ: Tverrfaglige team10"},"1 - Velg område fra rullegardinen her","J: Tverrfaglige team",10,null,{"$f":"+IFERROR(VLOOKUP(Database2[[#This Row],[Leverandør]],Kontaktinfo[],4,FALSE),\"\")","v":""}]
[{"$f":"Database!$B1728&Database!$C1728&Database!$D1728","v":"1 - Velg område fra rullegardinen herJ: Tverrfaglige team11"},"1 - Velg område fra rullegardinen her","J: Tverrfaglige team",11,null,{"$f":"+IFERROR(VLOOKUP(Database2[[#This Row],[Leverandør]],Kontaktinfo[],4,FALSE),\"\")","v":""}]
[{"$f":"Database!$B1729&Database!$C1729&Database!$D1729","v":"1 - Velg område fra rullegardinen herJ: Tverrfaglige team12"},"1 - Velg område fra rullegardinen her","J: Tverrfaglige team",12,null,{"$f":"+IFERROR(VLOOKUP(Database2[[#This Row],[Leverandør]],Kontaktinfo[],4,FALSE),\"\")","v":""}]
[{"$f":"Database!$B1730&Database!$C1730&Database!$D1730","v":"1 - Velg område fra rullegardinen herJ: Tverrfaglige team13"},"1 - Velg område fra rullegardinen her","J: Tverrfaglige team",13,null,{"$f":"+IFERROR(VLOOKUP(Database2[[#This Row],[Leverandør]],Kontaktinfo[],4,FALSE),\"\")","v":""}]
[{"$f":"Database!$B1731&Database!$C1731&Database!$D1731","v":"1 - Velg område fra rullegardinen herJ: Tverrfaglige team14"},"1 - Velg område fra rullegardinen her","J: Tverrfaglige team",14,null,{"$f":"+IFERROR(VLOOKUP(Database2[[#This Row],[Leverandør]],Kontaktinfo[],4,FALSE),\"\")","v":""}]
[{"$f":"Database!$B1732&Database!$C1732&Database!$D1732","v":"1 - Velg område fra rullegardinen herJ: Tverrfaglige team15"},"1 - Velg område fra rullegardinen her","J: Tverrfaglige team",15,null,{"$f":"+IFERROR(VLOOKUP(Database2[[#This Row],[Leverandør]],Kontaktinfo[],4,FALSE),\"\")","v":""}]
[{"$f":"Database!$B1733&Database!$C1733&Database!$D1733","v":"1 - Velg område fra rullegardinen herJ: Tverrfaglige team16"},"1 - Velg område fra rullegardinen her","J: Tverrfaglige team",16,null,{"$f":"+IFERROR(VLOOKUP(Database2[[#This Row],[Leverandør]],Kontaktinfo[],4,FALSE),\"\")","v":""}]
[{"$f":"Database!$B1734&Database!$C1734&Database!$D1734","v":"1 - Velg område fra rullegardinen herJ: Tverrfaglige team17"},"1 - Velg område fra rullegardinen her","J: Tverrfaglige team",17,null,{"$f":"+IFERROR(VLOOKUP(Database2[[#This Row],[Leverandør]],Kontaktinfo[],4,FALSE),\"\")","v":""}]
[{"$f":"Database!$B1735&Database!$C1735&Database!$D1735","v":"1 - Velg område fra rullegardinen herJ: Tverrfaglige team18"},"1 - Velg område fra rullegardinen her","J: Tverrfaglige team",18,null,{"$f":"+IFERROR(VLOOKUP(Database2[[#This Row],[Leverandør]],Kontaktinfo[],4,FALSE),\"\")","v":""}]
[{"$f":"Database!$B1736&Database!$C1736&Database!$D1736","v":"1 - Velg område fra rullegardinen herJ: Tverrfaglige team19"},"1 - Velg område fra rullegardinen her","J: Tverrfaglige team",19,null,{"$f":"+IFERROR(VLOOKUP(Database2[[#This Row],[Leverandør]],Kontaktinfo[],4,FALSE),\"\")","v":""}]
[{"$f":"Database!$B1737&Database!$C1737&Database!$D1737","v":"1 - Velg område fra rullegardinen herJ: Tverrfaglige team20"},"1 - Velg område fra rullegardinen her","J: Tverrfaglige team",20,null,{"$f":"+IFERROR(VLOOKUP(Database2[[#This Row],[Leverandør]],Kontaktinfo[],4,FALSE),\"\")","v":""}]
[{"$f":"Database!$B1738&Database!$C1738&Database!$D1738","v":"1 - Velg område fra rullegardinen herJ: Tverrfaglige team21"},"1 - Velg område fra rullegardinen her","J: Tverrfaglige team",21,null,{"$f":"+IFERROR(VLOOKUP(Database2[[#This Row],[Leverandør]],Kontaktinfo[],4,FALSE),\"\")","v":""}]
[{"$f":"Database!$B1739&Database!$C1739&Database!$D1739","v":"1 - Velg område fra rullegardinen herJ: Tverrfaglige team22"},"1 - Velg område fra rullegardinen her","J: Tverrfaglige team",22,null,{"$f":"+IFERROR(VLOOKUP(Database2[[#This Row],[Leverandør]],Kontaktinfo[],4,FALSE),\"\")","v":""}]
[{"$f":"Database!$B1740&Database!$C1740&Database!$D1740","v":"1 - Velg område fra rullegardinen herJ: Tverrfaglige team23"},"1 - Velg område fra rullegardinen her","J: Tverrfaglige team",23,null,{"$f":"+IFERROR(VLOOKUP(Database2[[#This Row],[Leverandør]],Kontaktinfo[],4,FALSE),\"\")","v":""}]
[{"$f":"Database!$B1741&Database!$C1741&Database!$D1741","v":"1 - Velg område fra rullegardinen herJ: Tverrfaglige team24"},"1 - Velg område fra rullegardinen her","J: Tverrfaglige team",24,null,{"$f":"+IFERROR(VLOOKUP(Database2[[#This Row],[Leverandør]],Kontaktinfo[],4,FALSE),\"\")","v":""}]
[{"$f":"Database!$B1742&Database!$C1742&Database!$D1742","v":"1 - Velg område fra rullegardinen herJ: Tverrfaglige team25"},"1 - Velg område fra rullegardinen her","J: Tverrfaglige team",25,null,{"$f":"+IFERROR(VLOOKUP(Database2[[#This Row],[Leverandør]],Kontaktinfo[],4,FALSE),\"\")","v":""}]
[{"$f":"Database!$B1743&Database!$C1743&Database!$D1743","v":"1 - Velg område fra rullegardinen herJ: Tverrfaglige team26"},"1 - Velg område fra rullegardinen her","J: Tverrfaglige team",26,null,{"$f":"+IFERROR(VLOOKUP(Database2[[#This Row],[Leverandør]],Kontaktinfo[],4,FALSE),\"\")","v":""}]
[{"$f":"Database!$B1744&Database!$C1744&Database!$D1744","v":"1 - Velg område fra rullegardinen herJ: Tverrfaglige team27"},"1 - Velg område fra rullegardinen her","J: Tverrfaglige team",27,null,{"$f":"+IFERROR(VLOOKUP(Database2[[#This Row],[Leverandør]],Kontaktinfo[],4,FALSE),\"\")","v":""}]
[{"$f":"Database!$B1745&Database!$C1745&Database!$D1745","v":"1 - Velg område fra rullegardinen herJ: Tverrfaglige team28"},"1 - Velg område fra rullegardinen her","J: Tverrfaglige team",28,null,{"$f":"+IFERROR(VLOOKUP(Database2[[#This Row],[Leverandør]],Kontaktinfo[],4,FALSE),\"\")","v":""}]
[{"$f":"Database!$B1746&Database!$C1746&Database!$D1746","v":"1 - Velg område fra rullegardinen herJ: Tverrfaglige team29"},"1 - Velg område fra rullegardinen her","J: Tverrfaglige team",29,null,{"$f":"+IFERROR(VLOOKUP(Database2[[#This Row],[Leverandør]],Kontaktinfo[],4,FALSE),\"\")","v":""}]
[{"$f":"Database!$B1747&Database!$C1747&Database!$D1747","v":"1 - Velg område fra rullegardinen herJ: Tverrfaglige team30"},"1 - Velg område fra rullegardinen her","J: Tverrfaglige team",30,null,{"$f":"+IFERROR(VLOOKUP(Database2[[#This Row],[Leverandør]],Kontaktinfo[],4,FALSE),\"\")","v":""}]
[{"$f":"Database!$B1748&Database!$C1748&Database!$D1748","v":"1 - Velg område fra rullegardinen herJ: Tverrfaglige team31"},"1 - Velg område fra rullegardinen her","J: Tverrfaglige team",31,null,{"$f":"+IFERROR(VLOOKUP(Database2[[#This Row],[Leverandør]],Kontaktinfo[],4,FALSE),\"\")","v":""}]
[{"$f":"Database!$B1749&Database!$C1749&Database!$D1749","v":"1 - Velg område fra rullegardinen herJ: Tverrfaglige team32"},"1 - Velg område fra rullegardinen her","J: Tverrfaglige team",32,null,{"$f":"+IFERROR(VLOOKUP(Database2[[#This Row],[Leverandør]],Kontaktinfo[],4,FALSE),\"\")","v":""}]
[{"$f":"Database!$B1750&Database!$C1750&Database!$D1750","v":"1 - Velg område fra rullegardinen herJ: Tverrfaglige team33"},"1 - Velg område fra rullegardinen her","J: Tverrfaglige team",33,null,{"$f":"+IFERROR(VLOOKUP(Database2[[#This Row],[Leverandør]],Kontaktinfo[],4,FALSE),\"\")","v":""}]
[{"$f":"Database!$B1751&Database!$C1751&Database!$D1751","v":"1 - Velg område fra rullegardinen herJ: Tverrfaglige team34"},"1 - Velg område fra rullegardinen her","J: Tverrfaglige team",34,null,{"$f":"+IFERROR(VLOOKUP(Database2[[#This Row],[Leverandør]],Kontaktinfo[],4,FALSE),\"\")","v":""}]
[{"$f":"Database!$B1752&Database!$C1752&Database!$D1752","v":""},null,null,null,null,{"$f":"+IFERROR(VLOOKUP(Database2[[#This Row],[Leverandør]],Kontaktinfo[],4,FALSE),\"\")","v":""}]
[{"$f":"Database!$B1753&Database!$C1753&Database!$D1753","v":""},null,null,null,null,{"$f":"+IFERROR(VLOOKUP(Database2[[#This Row],[Leverandør]],Kontaktinfo[],4,FALSE),\"\")","v":""}]
[{"$f":"Database!$B1754&Database!$C1754&Database!$D1754","v":""},null,null,null,null,{"$f":"+IFERROR(VLOOKUP(Database2[[#This Row],[Leverandør]],Kontaktinfo[],4,FALSE),\"\")","v":""}]
[{"$f":"Database!$B1755&Database!$C1755&Database!$D1755","v":""},null,null,null,null,{"$f":"+IFERROR(VLOOKUP(Database2[[#This Row],[Leverandør]],Kontaktinfo[],4,FALSE),\"\")","v":""}]
["1 - Velg område fra rullegardinen her2 - Velg delområde fra rullegardinen her1",null,null,null,null,{"$f":"+IFERROR(VLOOKUP(Database2[[#This Row],[Leverandør]],Kontaktinfo[],4,FALSE),\"\")","v":""}]
["1 - Velg område fra rullegardinen her2 - Velg delområde fra rullegardinen her2",null,null,null,null,{"$f":"+IFERROR(VLOOKUP(Database2[[#This Row],[Leverandør]],Kontaktinfo[],4,FALSE),\"\")","v":""}]
["1 - Velg område fra rullegardinen her2 - Velg delområde fra rullegardinen her3",null,null,null,null,{"$f":"+IFERROR(VLOOKUP(Database2[[#This Row],[Leverandør]],Kontaktinfo[],4,FALSE),\"\")","v":""}]
["1 - Velg område fra rullegardinen her2 - Velg delområde fra rullegardinen her4",null,null,null,null,{"$f":"+IFERROR(VLOOKUP(Database2[[#This Row],[Leverandør]],Kontaktinfo[],4,FALSE),\"\")","v":""}]
["1 - Velg område fra rullegardinen her2 - Velg delområde fra rullegardinen her5",null,null,null,null,{"$f":"+IFERROR(VLOOKUP(Database2[[#This Row],[Leverandør]],Kontaktinfo[],4,FALSE),\"\")","v":""}]
["1 - Velg område fra rullegardinen her2 - Velg delområde fra rullegardinen her6",null,null,null,null,{"$f":"+IFERROR(VLOOKUP(Database2[[#This Row],[Leverandør]],Kontaktinfo[],4,FALSE),\"\")","v":""}]
["1 - Velg område fra rullegardinen her2 - Velg delområde fra rullegardinen her7",null,null,null,null,{"$f":"+IFERROR(VLOOKUP(Database2[[#This Row],[Leverandør]],Kontaktinfo[],4,FALSE),\"\")","v":""}]
["1 - Velg område fra rullegardinen her2 - Velg delområde fra rullegardinen her8",null,null,null,null,{"$f":"+IFERROR(VLOOKUP(Database2[[#This Row],[Leverandør]],Kontaktinfo[],4,FALSE),\"\")","v":""}]
["1 - Velg område fra rullegardinen her2 - Velg delområde fra rullegardinen her9",null,null,null,null,{"$f":"+IFERROR(VLOOKUP(Database2[[#This Row],[Leverandør]],Kontaktinfo[],4,FALSE),\"\")","v":""}]
["1 - Velg område fra rullegardinen her2 - Velg delområde fra rullegardinen her10",null,null,null,null,{"$f":"+IFERROR(VLOOKUP(Database2[[#This Row],[Leverandør]],Kontaktinfo[],4,FALSE),\"\")","v":""}]
["1 - Velg område fra rullegardinen her2 - Velg delområde fra rullegardinen her11",null,null,null,null,{"$f":"+IFERROR(VLOOKUP(Database2[[#This Row],[Leverandør]],Kontaktinfo[],4,FALSE),\"\")","v":""}]
["1 - Velg område fra rullegardinen her2 - Velg delområde fra rullegardinen her12",null,null,null,null,{"$f":"+IFERROR(VLOOKUP(Database2[[#This Row],[Leverandør]],Kontaktinfo[],4,FALSE),\"\")","v":""}]
["1 - Velg område fra rullegardinen her2 - Velg delområde fra rullegardinen her13",null,null,null,null,{"$f":"+IFERROR(VLOOKUP(Database2[[#This Row],[Leverandør]],Kontaktinfo[],4,FALSE),\"\")","v":""}]
["1 - Velg område fra rullegardinen her2 - Velg delområde fra rullegardinen her14",null,null,null,null,{"$f":"+IFERROR(VLOOKUP(Database2[[#This Row],[Leverandør]],Kontaktinfo[],4,FALSE),\"\")","v":""}]
["1 - Velg område fra rullegardinen her2 - Velg delområde fra rullegardinen her15",null,null,null,null,{"$f":"+IFERROR(VLOOKUP(Database2[[#This Row],[Leverandør]],Kontaktinfo[],4,FALSE),\"\")","v":""}]
["1 - Velg område fra rullegardinen her2 - Velg delområde fra rullegardinen her16",null,null,null,null,{"$f":"+IFERROR(VLOOKUP(Database2[[#This Row],[Leverandør]],Kontaktinfo[],4,FALSE),\"\")","v":""}]
["1 - Velg område fra rullegardinen her2 - Velg delområde fra rullegardinen her17",null,null,null,null,{"$f":"+IFERROR(VLOOKUP(Database2[[#This Row],[Leverandør]],Kontaktinfo[],4,FALSE),\"\")","v":""}]
["1 - Velg område fra rullegardinen her2 - Velg delområde fra rullegardinen her18",null,null,null,null,{"$f":"+IFERROR(VLOOKUP(Database2[[#This Row],[Leverandør]],Kontaktinfo[],4,FALSE),\"\")","v":""}]
["1 - Velg område fra rullegardinen her2 - Velg delområde fra rullegardinen her19",null,null,null,null,{"$f":"+IFERROR(VLOOKUP(Database2[[#This Row],[Leverandør]],Kontaktinfo[],4,FALSE),\"\")","v":""}]
["1 - Velg område fra rullegardinen her2 - Velg delområde fra rullegardinen her20",null,null,null,null,{"$f":"+IFERROR(VLOOKUP(Database2[[#This Row],[Leverandør]],Kontaktinfo[],4,FALSE),\"\")","v":""}]
["1 - Velg område fra rullegardinen her2 - Velg delområde fra rullegardinen her21",null,null,null,null,{"$f":"+IFERROR(VLOOKUP(Database2[[#This Row],[Leverandør]],Kontaktinfo[],4,FALSE),\"\")","v":""}]
["1 - Velg område fra rullegardinen her2 - Velg delområde fra rullegardinen her22",null,null,null,null,{"$f":"+IFERROR(VLOOKUP(Database2[[#This Row],[Leverandør]],Kontaktinfo[],4,FALSE),\"\")","v":""}]
["1 - Velg område fra rullegardinen her2 - Velg delområde fra rullegardinen her23",null,null,null,null,{"$f":"+IFERROR(VLOOKUP(Database2[[#This Row],[Leverandør]],Kontaktinfo[],4,FALSE),\"\")","v":""}]
["1 - Velg område fra rullegardinen her2 - Velg delområde fra rullegardinen her24",null,null,null,null,{"$f":"+IFERROR(VLOOKUP(Database2[[#This Row],[Leverandør]],Kontaktinfo[],4,FALSE),\"\")","v":""}]
["1 - Velg område fra rullegardinen her2 - Velg delområde fra rullegardinen her25",null,null,null,null,{"$f":"+IFERROR(VLOOKUP(Database2[[#This Row],[Leverandør]],Kontaktinfo[],4,FALSE),\"\")","v":""}]
["1 - Velg område fra rullegardinen her2 - Velg delområde fra rullegardinen her26",null,null,null,null,{"$f":"+IFERROR(VLOOKUP(Database2[[#This Row],[Leverandør]],Kontaktinfo[],4,FALSE),\"\")","v":""}]
["1 - Velg område fra rullegardinen her2 - Velg delområde fra rullegardinen her27",null,null,null,null,{"$f":"+IFERROR(VLOOKUP(Database2[[#This Row],[Leverandør]],Kontaktinfo[],4,FALSE),\"\")","v":""}]
["1 - Velg område fra rullegardinen her2 - Velg delområde fra rullegardinen her28",null,null,null,null,{"$f":"+IFERROR(VLOOKUP(Database2[[#This Row],[Leverandør]],Kontaktinfo[],4,FALSE),\"\")","v":""}]
["1 - Velg område fra rullegardinen her2 - Velg delområde fra rullegardinen her29",null,null,null,null,{"$f":"+IFERROR(VLOOKUP(Database2[[#This Row],[Leverandør]],Kontaktinfo[],4,FALSE),\"\")","v":""}]
["1 - Velg område fra rullegardinen her2 - Velg delområde fra rullegardinen her30",null,null,null,null,{"$f":"+IFERROR(VLOOKUP(Database2[[#This Row],[Leverandør]],Kontaktinfo[],4,FALSE),\"\")","v":""}]
["1 - Velg område fra rullegardinen her2 - Velg delområde fra rullegardinen her31",null,null,null,null,{"$f":"+IFERROR(VLOOKUP(Database2[[#This Row],[Leverandør]],Kontaktinfo[],4,FALSE),\"\")","v":""}]
["1 - Velg område fra rullegardinen her2 - Velg delområde fra rullegardinen her32",null,null,null,null,{"$f":"+IFERROR(VLOOKUP(Database2[[#This Row],[Leverandør]],Kontaktinfo[],4,FALSE),\"\")","v":""}]
["1 - Velg område fra rullegardinen her2 - Velg delområde fra rullegardinen her33",null,null,null,null,{"$f":"+IFERROR(VLOOKUP(Database2[[#This Row],[Leverandør]],Kontaktinfo[],4,FALSE),\"\")","v":""}]
["1 - Velg område fra rullegardinen her2 - Velg delområde fra rullegardinen her34",null,null,null,null,{"$f":"+IFERROR(VLOOKUP(Database2[[#This Row],[Leverandør]],Kontaktinfo[],4,FALSE),\"\")","v":""}]
[null,null,null,null,null,{"$f":"+IFERROR(VLOOKUP(Database2[[#This Row],[Leverandør]],Kontaktinfo[],4,FALSE),\"\")","v":""}]
["Nord RHF2 - Velg delområde fra rullegardinen her1",null,null,null,null,{"$f":"+IFERROR(VLOOKUP(Database2[[#This Row],[Leverandør]],Kontaktinfo[],4,FALSE),\"\")","v":""}]
["Nord RHF2 - Velg delområde fra rullegardinen her2",null,null,null,null,{"$f":"+IFERROR(VLOOKUP(Database2[[#This Row],[Leverandør]],Kontaktinfo[],4,FALSE),\"\")","v":""}]
["Nord RHF2 - Velg delområde fra rullegardinen her3",null,null,null,null,{"$f":"+IFERROR(VLOOKUP(Database2[[#This Row],[Leverandør]],Kontaktinfo[],4,FALSE),\"\")","v":""}]
["Nord RHF2 - Velg delområde fra rullegardinen her4",null,null,null,null,{"$f":"+IFERROR(VLOOKUP(Database2[[#This Row],[Leverandør]],Kontaktinfo[],4,FALSE),\"\")","v":""}]
["Nord RHF2 - Velg delområde fra rullegardinen her5",null,null,null,null,{"$f":"+IFERROR(VLOOKUP(Database2[[#This Row],[Leverandør]],Kontaktinfo[],4,FALSE),\"\")","v":""}]
["Nord RHF2 - Velg delområde fra rullegardinen her6",null,null,null,null,{"$f":"+IFERROR(VLOOKUP(Database2[[#This Row],[Leverandør]],Kontaktinfo[],4,FALSE),\"\")","v":""}]
["Nord RHF2 - Velg delområde fra rullegardinen her7",null,null,null,null,{"$f":"+IFERROR(VLOOKUP(Database2[[#This Row],[Leverandør]],Kontaktinfo[],4,FALSE),\"\")","v":""}]
["Nord RHF2 - Velg delområde fra rullegardinen her8",null,null,null,null,{"$f":"+IFERROR(VLOOKUP(Database2[[#This Row],[Leverandør]],Kontaktinfo[],4,FALSE),\"\")","v":""}]
["Nord RHF2 - Velg delområde fra rullegardinen her9",null,null,null,null,{"$f":"+IFERROR(VLOOKUP(Database2[[#This Row],[Leverandør]],Kontaktinfo[],4,FALSE),\"\")","v":""}]
["Nord RHF2 - Velg delområde fra rullegardinen her10",null,null,null,null,{"$f":"+IFERROR(VLOOKUP(Database2[[#This Row],[Leverandør]],Kontaktinfo[],4,FALSE),\"\")","v":""}]
["Nord RHF2 - Velg delområde fra rullegardinen her11",null,null,null,null,{"$f":"+IFERROR(VLOOKUP(Database2[[#This Row],[Leverandør]],Kontaktinfo[],4,FALSE),\"\")","v":""}]
["Nord RHF2 - Velg delområde fra rullegardinen her12",null,null,null,null,{"$f":"+IFERROR(VLOOKUP(Database2[[#This Row],[Leverandør]],Kontaktinfo[],4,FALSE),\"\")","v":""}]
["Nord RHF2 - Velg delområde fra rullegardinen her13",null,null,null,null,{"$f":"+IFERROR(VLOOKUP(Database2[[#This Row],[Leverandør]],Kontaktinfo[],4,FALSE),\"\")","v":""}]
["Nord RHF2 - Velg delområde fra rullegardinen her14",null,null,null,null,{"$f":"+IFERROR(VLOOKUP(Database2[[#This Row],[Leverandør]],Kontaktinfo[],4,FALSE),\"\")","v":""}]
["Nord RHF2 - Velg delområde fra rullegardinen her15",null,null,null,null,{"$f":"+IFERROR(VLOOKUP(Database2[[#This Row],[Leverandør]],Kontaktinfo[],4,FALSE),\"\")","v":""}]
["Nord RHF2 - Velg delområde fra rullegardinen her16",null,null,null,null,{"$f":"+IFERROR(VLOOKUP(Database2[[#This Row],[Leverandør]],Kontaktinfo[],4,FALSE),\"\")","v":""}]
["Nord RHF2 - Velg delområde fra rullegardinen her17",null,null,null,null,{"$f":"+IFERROR(VLOOKUP(Database2[[#This Row],[Leverandør]],Kontaktinfo[],4,FALSE),\"\")","v":""}]
["Nord RHF2 - Velg delområde fra rullegardinen her18",null,null,null,null,{"$f":"+IFERROR(VLOOKUP(Database2[[#This Row],[Leverandør]],Kontaktinfo[],4,FALSE),\"\")","v":""}]
["Nord RHF2 - Velg delområde fra rullegardinen her19",null,null,null,null,{"$f":"+IFERROR(VLOOKUP(Database2[[#This Row],[Leverandør]],Kontaktinfo[],4,FALSE),\"\")","v":""}]
["Nord RHF2 - Velg delområde fra rullegardinen her20",null,null,null,null,{"$f":"+IFERROR(VLOOKUP(Database2[[#This Row],[Leverandør]],Kontaktinfo[],4,FALSE),\"\")","v":""}]
["Nord RHF2 - Velg delområde fra rullegardinen her21",null,null,null,null,{"$f":"+IFERROR(VLOOKUP(Database2[[#This Row],[Leverandør]],Kontaktinfo[],4,FALSE),\"\")","v":""}]
["Nord RHF2 - Velg delområde fra rullegardinen her22",null,null,null,null,{"$f":"+IFERROR(VLOOKUP(Database2[[#This Row],[Leverandør]],Kontaktinfo[],4,FALSE),\"\")","v":""}]
["Nord RHF2 - Velg delområde fra rullegardinen her23",null,null,null,null,{"$f":"+IFERROR(VLOOKUP(Database2[[#This Row],[Leverandør]],Kontaktinfo[],4,FALSE),\"\")","v":""}]
["Nord RHF2 - Velg delområde fra rullegardinen her24",null,null,null,null,{"$f":"+IFERROR(VLOOKUP(Database2[[#This Row],[Leverandør]],Kontaktinfo[],4,FALSE),\"\")","v":""}]
["Nord RHF2 - Velg delområde fra rullegardinen her25",null,null,null,null,{"$f":"+IFERROR(VLOOKUP(Database2[[#This Row],[Leverandør]],Kontaktinfo[],4,FALSE),\"\")","v":""}]
["Nord RHF2 - Velg delområde fra rullegardinen her26",null,null,null,null,{"$f":"+IFERROR(VLOOKUP(Database2[[#This Row],[Leverandør]],Kontaktinfo[],4,FALSE),\"\")","v":""}]
["Nord RHF2 - Velg delområde fra rullegardinen her27",null,null,null,null,{"$f":"+IFERROR(VLOOKUP(Database2[[#This Row],[Leverandør]],Kontaktinfo[],4,FALSE),\"\")","v":""}]
["Nord RHF2 - Velg delområde fra rullegardinen her28",null,null,null,null,{"$f":"+IFERROR(VLOOKUP(Database2[[#This Row],[Leverandør]],Kontaktinfo[],4,FALSE),\"\")","v":""}]
["Nord RHF2 - Velg delområde fra rullegardinen her29",null,null,null,null,{"$f":"+IFERROR(VLOOKUP(Database2[[#This Row],[Leverandør]],Kontaktinfo[],4,FALSE),\"\")","v":""}]
["Nord RHF2 - Velg delområde fra rullegardinen her30",null,null,null,null,{"$f":"+IFERROR(VLOOKUP(Database2[[#This Row],[Leverandør]],Kontaktinfo[],4,FALSE),\"\")","v":""}]
["Nord RHF2 - Velg delområde fra rullegardinen her31",null,null,null,null,{"$f":"+IFERROR(VLOOKUP(Database2[[#This Row],[Leverandør]],Kontaktinfo[],4,FALSE),\"\")","v":""}]
["Nord RHF2 - Velg delområde fra rullegardinen her32",null,null,null,null,{"$f":"+IFERROR(VLOOKUP(Database2[[#This Row],[Leverandør]],Kontaktinfo[],4,FALSE),\"\")","v":""}]
["Nord RHF2 - Velg delområde fra rullegardinen her33",null,null,null,null,{"$f":"+IFERROR(VLOOKUP(Database2[[#This Row],[Leverandør]],Kontaktinfo[],4,FALSE),\"\")","v":""}]
["Nord RHF2 - Velg delområde fra rullegardinen her34",null,null,null,null,{"$f":"+IFERROR(VLOOKUP(Database2[[#This Row],[Leverandør]],Kontaktinfo[],4,FALSE),\"\")","v":""}]
[{"$f":"Database!$B1825&Database!$C1825&Database!$D1825","v":""},null,null,null,null,{"$f":"+IFERROR(VLOOKUP(Database2[[#This Row],[Leverandør]],Kontaktinfo[],4,FALSE),\"\")","v":""}]
["Midt-Norge RHF2 - Velg delområde fra rullegardinen her1",null,null,null,null,{"$f":"+IFERROR(VLOOKUP(Database2[[#This Row],[Leverandør]],Kontaktinfo[],4,FALSE),\"\")","v":""}]
["Midt-Norge RHF2 - Velg delområde fra rullegardinen her2",null,null,null,null,{"$f":"+IFERROR(VLOOKUP(Database2[[#This Row],[Leverandør]],Kontaktinfo[],4,FALSE),\"\")","v":""}]
["Midt-Norge RHF2 - Velg delområde fra rullegardinen her3",null,null,null,null,{"$f":"+IFERROR(VLOOKUP(Database2[[#This Row],[Leverandør]],Kontaktinfo[],4,FALSE),\"\")","v":""}]
["Midt-Norge RHF2 - Velg delområde fra rullegardinen her4",null,null,null,null,{"$f":"+IFERROR(VLOOKUP(Database2[[#This Row],[Leverandør]],Kontaktinfo[],4,FALSE),\"\")","v":""}]
["Midt-Norge RHF2 - Velg delområde fra rullegardinen her5",null,null,null,null,{"$f":"+IFERROR(VLOOKUP(Database2[[#This Row],[Leverandør]],Kontaktinfo[],4,FALSE),\"\")","v":""}]
["Midt-Norge RHF2 - Velg delområde fra rullegardinen her6",null,null,null,null,{"$f":"+IFERROR(VLOOKUP(Database2[[#This Row],[Leverandør]],Kontaktinfo[],4,FALSE),\"\")","v":""}]
["Midt-Norge RHF2 - Velg delområde fra rullegardinen her7",null,null,null,null,{"$f":"+IFERROR(VLOOKUP(Database2[[#This Row],[Leverandør]],Kontaktinfo[],4,FALSE),\"\")","v":""}]
["Midt-Norge RHF2 - Velg delområde fra rullegardinen her8",null,null,null,null,{"$f":"+IFERROR(VLOOKUP(Database2[[#This Row],[Leverandør]],Kontaktinfo[],4,FALSE),\"\")","v":""}]
["Midt-Norge RHF2 - Velg delområde fra rullegardinen her9",null,null,null,null,{"$f":"+IFERROR(VLOOKUP(Database2[[#This Row],[Leverandør]],Kontaktinfo[],4,FALSE),\"\")","v":""}]
["Midt-Norge RHF2 - Velg delområde fra rullegardinen her10",null,null,null,null,{"$f":"+IFERROR(VLOOKUP(Database2[[#This Row],[Leverandør]],Kontaktinfo[],4,FALSE),\"\")","v":""}]
["Midt-Norge RHF2 - Velg delområde fra rullegardinen her11",null,null,null,null,{"$f":"+IFERROR(VLOOKUP(Database2[[#This Row],[Leverandør]],Kontaktinfo[],4,FALSE),\"\")","v":""}]
["Midt-Norge RHF2 - Velg delområde fra rullegardinen her12",null,null,null,null,{"$f":"+IFERROR(VLOOKUP(Database2[[#This Row],[Leverandør]],Kontaktinfo[],4,FALSE),\"\")","v":""}]
["Midt-Norge RHF2 - Velg delområde fra rullegardinen her13",null,null,null,null,{"$f":"+IFERROR(VLOOKUP(Database2[[#This Row],[Leverandør]],Kontaktinfo[],4,FALSE),\"\")","v":""}]
["Midt-Norge RHF2 - Velg delområde fra rullegardinen her14",null,null,null,null,{"$f":"+IFERROR(VLOOKUP(Database2[[#This Row],[Leverandør]],Kontaktinfo[],4,FALSE),\"\")","v":""}]
["Midt-Norge RHF2 - Velg delområde fra rullegardinen her15",null,null,null,null,{"$f":"+IFERROR(VLOOKUP(Database2[[#This Row],[Leverandør]],Kontaktinfo[],4,FALSE),\"\")","v":""}]
["Midt-Norge RHF2 - Velg delområde fra rullegardinen her16",null,null,null,null,{"$f":"+IFERROR(VLOOKUP(Database2[[#This Row],[Leverandør]],Kontaktinfo[],4,FALSE),\"\")","v":""}]
["Midt-Norge RHF2 - Velg delområde fra rullegardinen her17",null,null,null,null,{"$f":"+IFERROR(VLOOKUP(Database2[[#This Row],[Leverandør]],Kontaktinfo[],4,FALSE),\"\")","v":""}]
["Midt-Norge RHF2 - Velg delområde fra rullegardinen her18",null,null,null,null,{"$f":"+IFERROR(VLOOKUP(Database2[[#This Row],[Leverandør]],Kontaktinfo[],4,FALSE),\"\")","v":""}]
["Midt-Norge RHF2 - Velg delområde fra rullegardinen her19",null,null,null,null,{"$f":"+IFERROR(VLOOKUP(Database2[[#This Row],[Leverandør]],Kontaktinfo[],4,FALSE),\"\")","v":""}]
["Midt-Norge RHF2 - Velg delområde fra rullegardinen her20",null,null,null,null,{"$f":"+IFERROR(VLOOKUP(Database2[[#This Row],[Leverandør]],Kontaktinfo[],4,FALSE),\"\")","v":""}]
["Midt-Norge RHF2 - Velg delområde fra rullegardinen her21",null,null,null,null,{"$f":"+IFERROR(VLOOKUP(Database2[[#This Row],[Leverandør]],Kontaktinfo[],4,FALSE),\"\")","v":""}]
["Midt-Norge RHF2 - Velg delområde fra rullegardinen her22",null,null,null,null,{"$f":"+IFERROR(VLOOKUP(Database2[[#This Row],[Leverandør]],Kontaktinfo[],4,FALSE),\"\")","v":""}]
["Midt-Norge RHF2 - Velg delområde fra rullegardinen her23",null,null,null,null,{"$f":"+IFERROR(VLOOKUP(Database2[[#This Row],[Leverandør]],Kontaktinfo[],4,FALSE),\"\")","v":""}]
["Midt-Norge RHF2 - Velg delområde fra rullegardinen her24",null,null,null,null,{"$f":"+IFERROR(VLOOKUP(Database2[[#This Row],[Leverandør]],Kontaktinfo[],4,FALSE),\"\")","v":""}]
["Midt-Norge RHF2 - Velg delområde fra rullegardinen her25",null,null,null,null,{"$f":"+IFERROR(VLOOKUP(Database2[[#This Row],[Leverandør]],Kontaktinfo[],4,FALSE),\"\")","v":""}]
["Midt-Norge RHF2 - Velg delområde fra rullegardinen her26",null,null,null,null,{"$f":"+IFERROR(VLOOKUP(Database2[[#This Row],[Leverandør]],Kontaktinfo[],4,FALSE),\"\")","v":""}]
["Midt-Norge RHF2 - Velg delområde fra rullegardinen her27",null,null,null,null,{"$f":"+IFERROR(VLOOKUP(Database2[[#This Row],[Leverandør]],Kontaktinfo[],4,FALSE),\"\")","v":""}]
["Midt-Norge RHF2 - Velg delområde fra rullegardinen her28",null,null,null,null,{"$f":"+IFERROR(VLOOKUP(Database2[[#This Row],[Leverandør]],Kontaktinfo[],4,FALSE),\"\")","v":""}]
["Midt-Norge RHF2 - Velg delområde fra rullegardinen her29",null,null,null,null,{"$f":"+IFERROR(VLOOKUP(Database2[[#This Row],[Leverandør]],Kontaktinfo[],4,FALSE),\"\")","v":""}]
["Midt-Norge RHF2 - Velg delområde fra rullegardinen her30",null,null,null,null,{"$f":"+IFERROR(VLOOKUP(Database2[[#This Row],[Leverandør]],Kontaktinfo[],4,FALSE),\"\")","v":""}]
["Midt-Norge RHF2 - Velg delområde fra rullegardinen her31",null,null,null,null,{"$f":"+IFERROR(VLOOKUP(Database2[[#This Row],[Leverandør]],Kontaktinfo[],4,FALSE),\"\")","v":""}]
["Midt-Norge RHF2 - Velg delområde fra rullegardinen her32",null,null,null,null,{"$f":"+IFERROR(VLOOKUP(Database2[[#This Row],[Leverandør]],Kontaktinfo[],4,FALSE),\"\")","v":""}]
["Midt-Norge RHF2 - Velg delområde fra rullegardinen her33",null,null,null,null,{"$f":"+IFERROR(VLOOKUP(Database2[[#This Row],[Leverandør]],Kontaktinfo[],4,FALSE),\"\")","v":""}]
["Midt-Norge RHF2 - Velg delområde fra rullegardinen her34",null,null,null,null,{"$f":"+IFERROR(VLOOKUP(Database2[[#This Row],[Leverandør]],Kontaktinfo[],4,FALSE),\"\")","v":""}]
[{"$f":"Database!$B1860&Database!$C1860&Database!$D1860","v":""},null,null,null,null,{"$f":"+IFERROR(VLOOKUP(Database2[[#This Row],[Leverandør]],Kontaktinfo[],4,FALSE),\"\")","v":""}]
["Vest RHF2 - Velg delområde fra rullegardinen her1",null,null,null,null,{"$f":"+IFERROR(VLOOKUP(Database2[[#This Row],[Leverandør]],Kontaktinfo[],4,FALSE),\"\")","v":""}]
["Vest RHF2 - Velg delområde fra rullegardinen her2",null,null,null,null,{"$f":"+IFERROR(VLOOKUP(Database2[[#This Row],[Leverandør]],Kontaktinfo[],4,FALSE),\"\")","v":""}]
["Vest RHF2 - Velg delområde fra rullegardinen her3",null,null,null,null,{"$f":"+IFERROR(VLOOKUP(Database2[[#This Row],[Leverandør]],Kontaktinfo[],4,FALSE),\"\")","v":""}]
["Vest RHF2 - Velg delområde fra rullegardinen her4",null,null,null,null,{"$f":"+IFERROR(VLOOKUP(Database2[[#This Row],[Leverandør]],Kontaktinfo[],4,FALSE),\"\")","v":""}]
["Vest RHF2 - Velg delområde fra rullegardinen her5",null,null,null,null,{"$f":"+IFERROR(VLOOKUP(Database2[[#This Row],[Leverandør]],Kontaktinfo[],4,FALSE),\"\")","v":""}]
["Vest RHF2 - Velg delområde fra rullegardinen her6",null,null,null,null,{"$f":"+IFERROR(VLOOKUP(Database2[[#This Row],[Leverandør]],Kontaktinfo[],4,FALSE),\"\")","v":""}]
["Vest RHF2 - Velg delområde fra rullegardinen her7",null,null,null,null,{"$f":"+IFERROR(VLOOKUP(Database2[[#This Row],[Leverandør]],Kontaktinfo[],4,FALSE),\"\")","v":""}]
["Vest RHF2 - Velg delområde fra rullegardinen her8",null,null,null,null,{"$f":"+IFERROR(VLOOKUP(Database2[[#This Row],[Leverandør]],Kontaktinfo[],4,FALSE),\"\")","v":""}]
["Vest RHF2 - Velg delområde fra rullegardinen her9",null,null,null,null,{"$f":"+IFERROR(VLOOKUP(Database2[[#This Row],[Leverandør]],Kontaktinfo[],4,FALSE),\"\")","v":""}]
["Vest RHF2 - Velg delområde fra rullegardinen her10",null,null,null,null,{"$f":"+IFERROR(VLOOKUP(Database2[[#This Row],[Leverandør]],Kontaktinfo[],4,FALSE),\"\")","v":""}]
["Vest RHF2 - Velg delområde fra rullegardinen her11",null,null,null,null,{"$f":"+IFERROR(VLOOKUP(Database2[[#This Row],[Leverandør]],Kontaktinfo[],4,FALSE),\"\")","v":""}]
["Vest RHF2 - Velg delområde fra rullegardinen her12",null,null,null,null,{"$f":"+IFERROR(VLOOKUP(Database2[[#This Row],[Leverandør]],Kontaktinfo[],4,FALSE),\"\")","v":""}]
["Vest RHF2 - Velg delområde fra rullegardinen her13",null,null,null,null,{"$f":"+IFERROR(VLOOKUP(Database2[[#This Row],[Leverandør]],Kontaktinfo[],4,FALSE),\"\")","v":""}]
["Vest RHF2 - Velg delområde fra rullegardinen her14",null,null,null,null,{"$f":"+IFERROR(VLOOKUP(Database2[[#This Row],[Leverandør]],Kontaktinfo[],4,FALSE),\"\")","v":""}]
["Vest RHF2 - Velg delområde fra rullegardinen her15",null,null,null,null,{"$f":"+IFERROR(VLOOKUP(Database2[[#This Row],[Leverandør]],Kontaktinfo[],4,FALSE),\"\")","v":""}]
["Vest RHF2 - Velg delområde fra rullegardinen her16",null,null,null,null,{"$f":"+IFERROR(VLOOKUP(Database2[[#This Row],[Leverandør]],Kontaktinfo[],4,FALSE),\"\")","v":""}]
["Vest RHF2 - Velg delområde fra rullegardinen her17",null,null,null,null,{"$f":"+IFERROR(VLOOKUP(Database2[[#This Row],[Leverandør]],Kontaktinfo[],4,FALSE),\"\")","v":""}]
["Vest RHF2 - Velg delområde fra rullegardinen her18",null,null,null,null,{"$f":"+IFERROR(VLOOKUP(Database2[[#This Row],[Leverandør]],Kontaktinfo[],4,FALSE),\"\")","v":""}]
["Vest RHF2 - Velg delområde fra rullegardinen her19",null,null,null,null,{"$f":"+IFERROR(VLOOKUP(Database2[[#This Row],[Leverandør]],Kontaktinfo[],4,FALSE),\"\")","v":""}]
["Vest RHF2 - Velg delområde fra rullegardinen her20",null,null,null,null,{"$f":"+IFERROR(VLOOKUP(Database2[[#This Row],[Leverandør]],Kontaktinfo[],4,FALSE),\"\")","v":""}]
["Vest RHF2 - Velg delområde fra rullegardinen her21",null,null,null,null,{"$f":"+IFERROR(VLOOKUP(Database2[[#This Row],[Leverandør]],Kontaktinfo[],4,FALSE),\"\")","v":""}]
["Vest RHF2 - Velg delområde fra rullegardinen her22",null,null,null,null,{"$f":"+IFERROR(VLOOKUP(Database2[[#This Row],[Leverandør]],Kontaktinfo[],4,FALSE),\"\")","v":""}]
["Vest RHF2 - Velg delområde fra rullegardinen her23",null,null,null,null,{"$f":"+IFERROR(VLOOKUP(Database2[[#This Row],[Leverandør]],Kontaktinfo[],4,FALSE),\"\")","v":""}]
["Vest RHF2 - Velg delområde fra rullegardinen her24",null,null,null,null,{"$f":"+IFERROR(VLOOKUP(Database2[[#This Row],[Leverandør]],Kontaktinfo[],4,FALSE),\"\")","v":""}]
["Vest RHF2 - Velg delområde fra rullegardinen her25",null,null,null,null,{"$f":"+IFERROR(VLOOKUP(Database2[[#This Row],[Leverandør]],Kontaktinfo[],4,FALSE),\"\")","v":""}]
["Vest RHF2 - Velg delområde fra rullegardinen her26",null,null,null,null,{"$f":"+IFERROR(VLOOKUP(Database2[[#This Row],[Leverandør]],Kontaktinfo[],4,FALSE),\"\")","v":""}]
["Vest RHF2 - Velg delområde fra rullegardinen her27",null,null,null,null,{"$f":"+IFERROR(VLOOKUP(Database2[[#This Row],[Leverandør]],Kontaktinfo[],4,FALSE),\"\")","v":""}]
["Vest RHF2 - Velg delområde fra rullegardinen her28",null,null,null,null,{"$f":"+IFERROR(VLOOKUP(Database2[[#This Row],[Leverandør]],Kontaktinfo[],4,FALSE),\"\")","v":""}]
["Vest RHF2 - Velg delområde fra rullegardinen her29",null,null,null,null,{"$f":"+IFERROR(VLOOKUP(Database2[[#This Row],[Leverandør]],Kontaktinfo[],4,FALSE),\"\")","v":""}]
["Vest RHF2 - Velg delområde fra rullegardinen her30",null,null,null,null,{"$f":"+IFERROR(VLOOKUP(Database2[[#This Row],[Leverandør]],Kontaktinfo[],4,FALSE),\"\")","v":""}]
["Vest RHF2 - Velg delområde fra rullegardinen her31",null,null,null,null,{"$f":"+IFERROR(VLOOKUP(Database2[[#This Row],[Leverandør]],Kontaktinfo[],4,FALSE),\"\")","v":""}]
["Vest RHF2 - Velg delområde fra rullegardinen her32",null,null,null,null,{"$f":"+IFERROR(VLOOKUP(Database2[[#This Row],[Leverandør]],Kontaktinfo[],4,FALSE),\"\")","v":""}]
["Vest RHF2 - Velg delområde fra rullegardinen her33",null,null,null,null,{"$f":"+IFERROR(VLOOKUP(Database2[[#This Row],[Leverandør]],Kontaktinfo[],4,FALSE),\"\")","v":""}]
["Vest RHF2 - Velg delområde fra rullegardinen her34",null,null,null,null,{"$f":"+IFERROR(VLOOKUP(Database2[[#This Row],[Leverandør]],Kontaktinfo[],4,FALSE),\"\")","v":""}]
[{"$f":"Database!$B1895&Database!$C1895&Database!$D1895","v":""},null,null,null,null,{"$f":"+IFERROR(VLOOKUP(Database2[[#This Row],[Leverandør]],Kontaktinfo[],4,FALSE),\"\")","v":""}]
["Sør-Øst RHF2 - Velg delområde fra rullegardinen her1",null,null,null,null,{"$f":"+IFERROR(VLOOKUP(Database2[[#This Row],[Leverandør]],Kontaktinfo[],4,FALSE),\"\")","v":""}]
["Sør-Øst RHF2 - Velg delområde fra rullegardinen her2",null,null,null,null,{"$f":"+IFERROR(VLOOKUP(Database2[[#This Row],[Leverandør]],Kontaktinfo[],4,FALSE),\"\")","v":""}]
["Sør-Øst RHF2 - Velg delområde fra rullegardinen her3",null,null,null,null,{"$f":"+IFERROR(VLOOKUP(Database2[[#This Row],[Leverandør]],Kontaktinfo[],4,FALSE),\"\")","v":""}]
["Sør-Øst RHF2 - Velg delområde fra rullegardinen her4",null,null,null,null,{"$f":"+IFERROR(VLOOKUP(Database2[[#This Row],[Leverandør]],Kontaktinfo[],4,FALSE),\"\")","v":""}]
["Sør-Øst RHF2 - Velg delområde fra rullegardinen her5",null,null,null,null,{"$f":"+IFERROR(VLOOKUP(Database2[[#This Row],[Leverandør]],Kontaktinfo[],4,FALSE),\"\")","v":""}]
["Sør-Øst RHF2 - Velg delområde fra rullegardinen her6",null,null,null,null,{"$f":"+IFERROR(VLOOKUP(Database2[[#This Row],[Leverandør]],Kontaktinfo[],4,FALSE),\"\")","v":""}]
["Sør-Øst RHF2 - Velg delområde fra rullegardinen her7",null,null,null,null,{"$f":"+IFERROR(VLOOKUP(Database2[[#This Row],[Leverandør]],Kontaktinfo[],4,FALSE),\"\")","v":""}]
["Sør-Øst RHF2 - Velg delområde fra rullegardinen her8",null,null,null,null,{"$f":"+IFERROR(VLOOKUP(Database2[[#This Row],[Leverandør]],Kontaktinfo[],4,FALSE),\"\")","v":""}]
["Sør-Øst RHF2 - Velg delområde fra rullegardinen her9",null,null,null,null,{"$f":"+IFERROR(VLOOKUP(Database2[[#This Row],[Leverandør]],Kontaktinfo[],4,FALSE),\"\")","v":""}]
["Sør-Øst RHF2 - Velg delområde fra rullegardinen her10",null,null,null,null,{"$f":"+IFERROR(VLOOKUP(Database2[[#This Row],[Leverandør]],Kontaktinfo[],4,FALSE),\"\")","v":""}]
["Sør-Øst RHF2 - Velg delområde fra rullegardinen her11",null,null,null,null,{"$f":"+IFERROR(VLOOKUP(Database2[[#This Row],[Leverandør]],Kontaktinfo[],4,FALSE),\"\")","v":""}]
["Sør-Øst RHF2 - Velg delområde fra rullegardinen her12",null,null,null,null,{"$f":"+IFERROR(VLOOKUP(Database2[[#This Row],[Leverandør]],Kontaktinfo[],4,FALSE),\"\")","v":""}]
["Sør-Øst RHF2 - Velg delområde fra rullegardinen her13",null,null,null,null,{"$f":"+IFERROR(VLOOKUP(Database2[[#This Row],[Leverandør]],Kontaktinfo[],4,FALSE),\"\")","v":""}]
["Sør-Øst RHF2 - Velg delområde fra rullegardinen her14",null,null,null,null,{"$f":"+IFERROR(VLOOKUP(Database2[[#This Row],[Leverandør]],Kontaktinfo[],4,FALSE),\"\")","v":""}]
["Sør-Øst RHF2 - Velg delområde fra rullegardinen her15",null,null,null,null,{"$f":"+IFERROR(VLOOKUP(Database2[[#This Row],[Leverandør]],Kontaktinfo[],4,FALSE),\"\")","v":""}]
["Sør-Øst RHF2 - Velg delområde fra rullegardinen her16",null,null,null,null,{"$f":"+IFERROR(VLOOKUP(Database2[[#This Row],[Leverandør]],Kontaktinfo[],4,FALSE),\"\")","v":""}]
["Sør-Øst RHF2 - Velg delområde fra rullegardinen her17",null,null,null,null,{"$f":"+IFERROR(VLOOKUP(Database2[[#This Row],[Leverandør]],Kontaktinfo[],4,FALSE),\"\")","v":""}]
["Sør-Øst RHF2 - Velg delområde fra rullegardinen her18",null,null,null,null,{"$f":"+IFERROR(VLOOKUP(Database2[[#This Row],[Leverandør]],Kontaktinfo[],4,FALSE),\"\")","v":""}]
["Sør-Øst RHF2 - Velg delområde fra rullegardinen her19",null,null,null,null,{"$f":"+IFERROR(VLOOKUP(Database2[[#This Row],[Leverandør]],Kontaktinfo[],4,FALSE),\"\")","v":""}]
["Sør-Øst RHF2 - Velg delområde fra rullegardinen her20",null,null,null,null,{"$f":"+IFERROR(VLOOKUP(Database2[[#This Row],[Leverandør]],Kontaktinfo[],4,FALSE),\"\")","v":""}]
["Sør-Øst RHF2 - Velg delområde fra rullegardinen her21",null,null,null,null,{"$f":"+IFERROR(VLOOKUP(Database2[[#This Row],[Leverandør]],Kontaktinfo[],4,FALSE),\"\")","v":""}]
["Sør-Øst RHF2 - Velg delområde fra rullegardinen her22",null,null,null,null,{"$f":"+IFERROR(VLOOKUP(Database2[[#This Row],[Leverandør]],Kontaktinfo[],4,FALSE),\"\")","v":""}]
["Sør-Øst RHF2 - Velg delområde fra rullegardinen her23",null,null,null,null,{"$f":"+IFERROR(VLOOKUP(Database2[[#This Row],[Leverandør]],Kontaktinfo[],4,FALSE),\"\")","v":""}]
["Sør-Øst RHF2 - Velg delområde fra rullegardinen her24",null,null,null,null,{"$f":"+IFERROR(VLOOKUP(Database2[[#This Row],[Leverandør]],Kontaktinfo[],4,FALSE),\"\")","v":""}]
["Sør-Øst RHF2 - Velg delområde fra rullegardinen her25",null,null,null,null,{"$f":"+IFERROR(VLOOKUP(Database2[[#This Row],[Leverandør]],Kontaktinfo[],4,FALSE),\"\")","v":""}]
["Sør-Øst RHF2 - Velg delområde fra rullegardinen her26",null,null,null,null,{"$f":"+IFERROR(VLOOKUP(Database2[[#This Row],[Leverandør]],Kontaktinfo[],4,FALSE),\"\")","v":""}]
["Sør-Øst RHF2 - Velg delområde fra rullegardinen her27",null,null,null,null,{"$f":"+IFERROR(VLOOKUP(Database2[[#This Row],[Leverandør]],Kontaktinfo[],4,FALSE),\"\")","v":""}]
["Sør-Øst RHF2 - Velg delområde fra rullegardinen her28",null,null,null,null,{"$f":"+IFERROR(VLOOKUP(Database2[[#This Row],[Leverandør]],Kontaktinfo[],4,FALSE),\"\")","v":""}]
["Sør-Øst RHF2 - Velg delområde fra rullegardinen her29",null,null,null,null,{"$f":"+IFERROR(VLOOKUP(Database2[[#This Row],[Leverandør]],Kontaktinfo[],4,FALSE),\"\")","v":""}]
["Sør-Øst RHF2 - Velg delområde fra rullegardinen her30",null,null,null,null,{"$f":"+IFERROR(VLOOKUP(Database2[[#This Row],[Leverandør]],Kontaktinfo[],4,FALSE),\"\")","v":""}]
["Sør-Øst RHF2 - Velg delområde fra rullegardinen her31",null,null,null,null,{"$f":"+IFERROR(VLOOKUP(Database2[[#This Row],[Leverandør]],Kontaktinfo[],4,FALSE),\"\")","v":""}]
["Sør-Øst RHF2 - Velg delområde fra rullegardinen her32",null,null,null,null,{"$f":"+IFERROR(VLOOKUP(Database2[[#This Row],[Leverandør]],Kontaktinfo[],4,FALSE),\"\")","v":""}]
["Sør-Øst RHF2 - Velg delområde fra rullegardinen her33",null,null,null,null,{"$f":"+IFERROR(VLOOKUP(Database2[[#This Row],[Leverandør]],Kontaktinfo[],4,FALSE),\"\")","v":""}]
["Sør-Øst RHF2 - Velg delområde fra rullegardinen her34",null,null,null,null,{"$f":"+IFERROR(VLOOKUP(Database2[[#This Row],[Leverandør]],Kontaktinfo[],4,FALSE),\"\")","v":""}]
[null,null,null,null,null,{"$f":"+IFERROR(VLOOKUP(Database2[[#This Row],[Leverandør]],Kontaktinfo[],4,FALSE),\"\")","v":""}]
["NordProgram og Prosjektgjennomføring1",null,null,null,null,{"$f":"+IFERROR(VLOOKUP(Database2[[#This Row],[Leverandør]],Kontaktinfo[],4,FALSE),\"\")","v":""}]
["NordProgram og Prosjektgjennomføring2",null,null,null,null,{"$f":"+IFERROR(VLOOKUP(Database2[[#This Row],[Leverandør]],Kontaktinfo[],4,FALSE),\"\")","v":""}]
["NordProgram og Prosjektgjennomføring3",null,null,null,null,{"$f":"+IFERROR(VLOOKUP(Database2[[#This Row],[Leverandør]],Kontaktinfo[],4,FALSE),\"\")","v":""}]
["NordProgram og Prosjektgjennomføring4",null,null,null,null,{"$f":"+IFERROR(VLOOKUP(Database2[[#This Row],[Leverandør]],Kontaktinfo[],4,FALSE),\"\")","v":""}]
["NordProgram og Prosjektgjennomføring5",null,null,null,null,{"$f":"+IFERROR(VLOOKUP(Database2[[#This Row],[Leverandør]],Kontaktinfo[],4,FALSE),\"\")","v":""}]
["NordProgram og Prosjektgjennomføring6",null,null,null,null,{"$f":"+IFERROR(VLOOKUP(Database2[[#This Row],[Leverandør]],Kontaktinfo[],4,FALSE),\"\")","v":""}]
["NordProgram og Prosjektgjennomføring7",null,null,null,null,{"$f":"+IFERROR(VLOOKUP(Database2[[#This Row],[Leverandør]],Kontaktinfo[],4,FALSE),\"\")","v":""}]
["NordProgram og Prosjektgjennomføring8",null,null,null,null,{"$f":"+IFERROR(VLOOKUP(Database2[[#This Row],[Leverandør]],Kontaktinfo[],4,FALSE),\"\")","v":""}]
["NordProgram og Prosjektgjennomføring9",null,null,null,null,{"$f":"+IFERROR(VLOOKUP(Database2[[#This Row],[Leverandør]],Kontaktinfo[],4,FALSE),\"\")","v":""}]
["NordProgram og Prosjektgjennomføring10",null,null,null,null,{"$f":"+IFERROR(VLOOKUP(Database2[[#This Row],[Leverandør]],Kontaktinfo[],4,FALSE),\"\")","v":""}]
["NordProgram og Prosjektgjennomføring11",null,null,null,null,{"$f":"+IFERROR(VLOOKUP(Database2[[#This Row],[Leverandør]],Kontaktinfo[],4,FALSE),\"\")","v":""}]
["NordProgram og Prosjektgjennomføring12",null,null,null,null,{"$f":"+IFERROR(VLOOKUP(Database2[[#This Row],[Leverandør]],Kontaktinfo[],4,FALSE),\"\")","v":""}]
["NordProgram og Prosjektgjennomføring13",null,null,null,null,{"$f":"+IFERROR(VLOOKUP(Database2[[#This Row],[Leverandør]],Kontaktinfo[],4,FALSE),\"\")","v":""}]
["NordProgram og Prosjektgjennomføring14",null,null,null,null,{"$f":"+IFERROR(VLOOKUP(Database2[[#This Row],[Leverandør]],Kontaktinfo[],4,FALSE),\"\")","v":""}]
["NordProgram og Prosjektgjennomføring15",null,null,null,null,{"$f":"+IFERROR(VLOOKUP(Database2[[#This Row],[Leverandør]],Kontaktinfo[],4,FALSE),\"\")","v":""}]
["NordProgram og Prosjektgjennomføring16",null,null,null,null,{"$f":"+IFERROR(VLOOKUP(Database2[[#This Row],[Leverandør]],Kontaktinfo[],4,FALSE),\"\")","v":""}]
["NordProgram og Prosjektgjennomføring17",null,null,null,null,{"$f":"+IFERROR(VLOOKUP(Database2[[#This Row],[Leverandør]],Kontaktinfo[],4,FALSE),\"\")","v":""}]
["NordProgram og Prosjektgjennomføring18",null,null,null,null,{"$f":"+IFERROR(VLOOKUP(Database2[[#This Row],[Leverandør]],Kontaktinfo[],4,FALSE),\"\")","v":""}]
["NordProgram og Prosjektgjennomføring19",null,null,null,null,{"$f":"+IFERROR(VLOOKUP(Database2[[#This Row],[Leverandør]],Kontaktinfo[],4,FALSE),\"\")","v":""}]
["NordProgram og Prosjektgjennomføring20",null,null,null,null,{"$f":"+IFERROR(VLOOKUP(Database2[[#This Row],[Leverandør]],Kontaktinfo[],4,FALSE),\"\")","v":""}]
["NordProgram og Prosjektgjennomføring21",null,null,null,null,{"$f":"+IFERROR(VLOOKUP(Database2[[#This Row],[Leverandør]],Kontaktinfo[],4,FALSE),\"\")","v":""}]
["NordProgram og Prosjektgjennomføring22",null,null,null,null,{"$f":"+IFERROR(VLOOKUP(Database2[[#This Row],[Leverandør]],Kontaktinfo[],4,FALSE),\"\")","v":""}]
["NordProgram og Prosjektgjennomføring23",null,null,null,null,{"$f":"+IFERROR(VLOOKUP(Database2[[#This Row],[Leverandør]],Kontaktinfo[],4,FALSE),\"\")","v":""}]
["NordProgram og Prosjektgjennomføring24",null,null,null,null,{"$f":"+IFERROR(VLOOKUP(Database2[[#This Row],[Leverandør]],Kontaktinfo[],4,FALSE),\"\")","v":""}]
["NordProgram og Prosjektgjennomføring25",null,null,null,null,{"$f":"+IFERROR(VLOOKUP(Database2[[#This Row],[Leverandør]],Kontaktinfo[],4,FALSE),\"\")","v":""}]
["NordProgram og Prosjektgjennomføring26",null,null,null,null,{"$f":"+IFERROR(VLOOKUP(Database2[[#This Row],[Leverandør]],Kontaktinfo[],4,FALSE),\"\")","v":""}]
["",null,null,null,null,{"$f":"+IFERROR(VLOOKUP(Database2[[#This Row],[Leverandør]],Kontaktinfo[],4,FALSE),\"\")","v":""}]
["NordStrategiplanlegging, rådgivning og innovasjon1",null,null,null,null,{"$f":"+IFERROR(VLOOKUP(Database2[[#This Row],[Leverandør]],Kontaktinfo[],4,FALSE),\"\")","v":""}]
["NordStrategiplanlegging, rådgivning og innovasjon2",null,null,null,null,{"$f":"+IFERROR(VLOOKUP(Database2[[#This Row],[Leverandør]],Kontaktinfo[],4,FALSE),\"\")","v":""}]
["NordStrategiplanlegging, rådgivning og innovasjon3",null,null,null,null,{"$f":"+IFERROR(VLOOKUP(Database2[[#This Row],[Leverandør]],Kontaktinfo[],4,FALSE),\"\")","v":""}]
["NordStrategiplanlegging, rådgivning og innovasjon4",null,null,null,null,{"$f":"+IFERROR(VLOOKUP(Database2[[#This Row],[Leverandør]],Kontaktinfo[],4,FALSE),\"\")","v":""}]
["NordStrategiplanlegging, rådgivning og innovasjon5",null,null,null,null,{"$f":"+IFERROR(VLOOKUP(Database2[[#This Row],[Leverandør]],Kontaktinfo[],4,FALSE),\"\")","v":""}]
["NordStrategiplanlegging, rådgivning og innovasjon6",null,null,null,null,{"$f":"+IFERROR(VLOOKUP(Database2[[#This Row],[Leverandør]],Kontaktinfo[],4,FALSE),\"\")","v":""}]
["NordStrategiplanlegging, rådgivning og innovasjon7",null,null,null,null,{"$f":"+IFERROR(VLOOKUP(Database2[[#This Row],[Leverandør]],Kontaktinfo[],4,FALSE),\"\")","v":""}]
["NordStrategiplanlegging, rådgivning og innovasjon8",null,null,null,null,{"$f":"+IFERROR(VLOOKUP(Database2[[#This Row],[Leverandør]],Kontaktinfo[],4,FALSE),\"\")","v":""}]
["NordStrategiplanlegging, rådgivning og innovasjon9",null,null,null,null,{"$f":"+IFERROR(VLOOKUP(Database2[[#This Row],[Leverandør]],Kontaktinfo[],4,FALSE),\"\")","v":""}]
["NordStrategiplanlegging, rådgivning og innovasjon10",null,null,null,null,{"$f":"+IFERROR(VLOOKUP(Database2[[#This Row],[Leverandør]],Kontaktinfo[],4,FALSE),\"\")","v":""}]
["NordStrategiplanlegging, rådgivning og innovasjon11",null,null,null,null,{"$f":"+IFERROR(VLOOKUP(Database2[[#This Row],[Leverandør]],Kontaktinfo[],4,FALSE),\"\")","v":""}]
["NordStrategiplanlegging, rådgivning og innovasjon12",null,null,null,null,{"$f":"+IFERROR(VLOOKUP(Database2[[#This Row],[Leverandør]],Kontaktinfo[],4,FALSE),\"\")","v":""}]
["NordStrategiplanlegging, rådgivning og innovasjon13",null,null,null,null,{"$f":"+IFERROR(VLOOKUP(Database2[[#This Row],[Leverandør]],Kontaktinfo[],4,FALSE),\"\")","v":""}]
["NordStrategiplanlegging, rådgivning og innovasjon14",null,null,null,null,{"$f":"+IFERROR(VLOOKUP(Database2[[#This Row],[Leverandør]],Kontaktinfo[],4,FALSE),\"\")","v":""}]
["NordStrategiplanlegging, rådgivning og innovasjon15",null,null,null,null,{"$f":"+IFERROR(VLOOKUP(Database2[[#This Row],[Leverandør]],Kontaktinfo[],4,FALSE),\"\")","v":""}]
["NordStrategiplanlegging, rådgivning og innovasjon16",null,null,null,null,{"$f":"+IFERROR(VLOOKUP(Database2[[#This Row],[Leverandør]],Kontaktinfo[],4,FALSE),\"\")","v":""}]
["NordStrategiplanlegging, rådgivning og innovasjon17",null,null,null,null,{"$f":"+IFERROR(VLOOKUP(Database2[[#This Row],[Leverandør]],Kontaktinfo[],4,FALSE),\"\")","v":""}]
["NordStrategiplanlegging, rådgivning og innovasjon18",null,null,null,null,{"$f":"+IFERROR(VLOOKUP(Database2[[#This Row],[Leverandør]],Kontaktinfo[],4,FALSE),\"\")","v":""}]
["NordStrategiplanlegging, rådgivning og innovasjon19",null,null,null,null,{"$f":"+IFERROR(VLOOKUP(Database2[[#This Row],[Leverandør]],Kontaktinfo[],4,FALSE),\"\")","v":""}]
["NordStrategiplanlegging, rådgivning og innovasjon20",null,null,null,null,{"$f":"+IFERROR(VLOOKUP(Database2[[#This Row],[Leverandør]],Kontaktinfo[],4,FALSE),\"\")","v":""}]
["NordStrategiplanlegging, rådgivning og innovasjon21",null,null,null,null,{"$f":"+IFERROR(VLOOKUP(Database2[[#This Row],[Leverandør]],Kontaktinfo[],4,FALSE),\"\")","v":""}]
["NordStrategiplanlegging, rådgivning og innovasjon22",null,null,null,null,{"$f":"+IFERROR(VLOOKUP(Database2[[#This Row],[Leverandør]],Kontaktinfo[],4,FALSE),\"\")","v":""}]
["NordStrategiplanlegging, rådgivning og innovasjon23",null,null,null,null,{"$f":"+IFERROR(VLOOKUP(Database2[[#This Row],[Leverandør]],Kontaktinfo[],4,FALSE),\"\")","v":""}]
["NordStrategiplanlegging, rådgivning og innovasjon24",null,null,null,null,{"$f":"+IFERROR(VLOOKUP(Database2[[#This Row],[Leverandør]],Kontaktinfo[],4,FALSE),\"\")","v":""}]
["NordStrategiplanlegging, rådgivning og innovasjon25",null,null,null,null,{"$f":"+IFERROR(VLOOKUP(Database2[[#This Row],[Leverandør]],Kontaktinfo[],4,FALSE),\"\")","v":""}]
["NordStrategiplanlegging, rådgivning og innovasjon26",null,null,null,null,{"$f":"+IFERROR(VLOOKUP(Database2[[#This Row],[Leverandør]],Kontaktinfo[],4,FALSE),\"\")","v":""}]
["NordStrategiplanlegging, rådgivning og innovasjon27",null,null,null,null,{"$f":"+IFERROR(VLOOKUP(Database2[[#This Row],[Leverandør]],Kontaktinfo[],4,FALSE),\"\")","v":""}]
["NordStrategiplanlegging, rådgivning og innovasjon28",null,null,null,null,{"$f":"+IFERROR(VLOOKUP(Database2[[#This Row],[Leverandør]],Kontaktinfo[],4,FALSE),\"\")","v":""}]
["NordStrategiplanlegging, rådgivning og innovasjon29",null,null,null,null,{"$f":"+IFERROR(VLOOKUP(Database2[[#This Row],[Leverandør]],Kontaktinfo[],4,FALSE),\"\")","v":""}]
["NordStrategiplanlegging, rådgivning og innovasjon30",null,null,null,null,{"$f":"+IFERROR(VLOOKUP(Database2[[#This Row],[Leverandør]],Kontaktinfo[],4,FALSE),\"\")","v":""}]
["",null,null,null,null,{"$f":"+IFERROR(VLOOKUP(Database2[[#This Row],[Leverandør]],Kontaktinfo[],4,FALSE),\"\")","v":""}]
["NordArkitektur1",null,null,null,null,{"$f":"+IFERROR(VLOOKUP(Database2[[#This Row],[Leverandør]],Kontaktinfo[],4,FALSE),\"\")","v":""}]
["NordArkitektur2",null,null,null,null,{"$f":"+IFERROR(VLOOKUP(Database2[[#This Row],[Leverandør]],Kontaktinfo[],4,FALSE),\"\")","v":""}]
["NordArkitektur3",null,null,null,null,{"$f":"+IFERROR(VLOOKUP(Database2[[#This Row],[Leverandør]],Kontaktinfo[],4,FALSE),\"\")","v":""}]
["NordArkitektur4",null,null,null,null,{"$f":"+IFERROR(VLOOKUP(Database2[[#This Row],[Leverandør]],Kontaktinfo[],4,FALSE),\"\")","v":""}]
["NordArkitektur5",null,null,null,null,{"$f":"+IFERROR(VLOOKUP(Database2[[#This Row],[Leverandør]],Kontaktinfo[],4,FALSE),\"\")","v":""}]
["NordArkitektur6",null,null,null,null,{"$f":"+IFERROR(VLOOKUP(Database2[[#This Row],[Leverandør]],Kontaktinfo[],4,FALSE),\"\")","v":""}]
["NordArkitektur7",null,null,null,null,{"$f":"+IFERROR(VLOOKUP(Database2[[#This Row],[Leverandør]],Kontaktinfo[],4,FALSE),\"\")","v":""}]
["NordArkitektur8",null,null,null,null,{"$f":"+IFERROR(VLOOKUP(Database2[[#This Row],[Leverandør]],Kontaktinfo[],4,FALSE),\"\")","v":""}]
["NordArkitektur9",null,null,null,null,{"$f":"+IFERROR(VLOOKUP(Database2[[#This Row],[Leverandør]],Kontaktinfo[],4,FALSE),\"\")","v":""}]
["NordArkitektur10",null,null,null,null,{"$f":"+IFERROR(VLOOKUP(Database2[[#This Row],[Leverandør]],Kontaktinfo[],4,FALSE),\"\")","v":""}]
["NordArkitektur11",null,null,null,null,{"$f":"+IFERROR(VLOOKUP(Database2[[#This Row],[Leverandør]],Kontaktinfo[],4,FALSE),\"\")","v":""}]
["NordArkitektur12",null,null,null,null,{"$f":"+IFERROR(VLOOKUP(Database2[[#This Row],[Leverandør]],Kontaktinfo[],4,FALSE),\"\")","v":""}]
["NordArkitektur13",null,null,null,null,{"$f":"+IFERROR(VLOOKUP(Database2[[#This Row],[Leverandør]],Kontaktinfo[],4,FALSE),\"\")","v":""}]
["NordArkitektur14",null,null,null,null,{"$f":"+IFERROR(VLOOKUP(Database2[[#This Row],[Leverandør]],Kontaktinfo[],4,FALSE),\"\")","v":""}]
["NordArkitektur15",null,null,null,null,{"$f":"+IFERROR(VLOOKUP(Database2[[#This Row],[Leverandør]],Kontaktinfo[],4,FALSE),\"\")","v":""}]
["NordArkitektur16",null,null,null,null,{"$f":"+IFERROR(VLOOKUP(Database2[[#This Row],[Leverandør]],Kontaktinfo[],4,FALSE),\"\")","v":""}]
["NordArkitektur17",null,null,null,null,{"$f":"+IFERROR(VLOOKUP(Database2[[#This Row],[Leverandør]],Kontaktinfo[],4,FALSE),\"\")","v":""}]
["NordArkitektur18",null,null,null,null,{"$f":"+IFERROR(VLOOKUP(Database2[[#This Row],[Leverandør]],Kontaktinfo[],4,FALSE),\"\")","v":""}]
["NordArkitektur19",null,null,null,null,{"$f":"+IFERROR(VLOOKUP(Database2[[#This Row],[Leverandør]],Kontaktinfo[],4,FALSE),\"\")","v":""}]
["NordArkitektur20",null,null,null,null,{"$f":"+IFERROR(VLOOKUP(Database2[[#This Row],[Leverandør]],Kontaktinfo[],4,FALSE),\"\")","v":""}]
["NordArkitektur21",null,null,null,null,{"$f":"+IFERROR(VLOOKUP(Database2[[#This Row],[Leverandør]],Kontaktinfo[],4,FALSE),\"\")","v":""}]
["NordArkitektur22",null,null,null,null,{"$f":"+IFERROR(VLOOKUP(Database2[[#This Row],[Leverandør]],Kontaktinfo[],4,FALSE),\"\")","v":""}]
["NordArkitektur23",null,null,null,null,{"$f":"+IFERROR(VLOOKUP(Database2[[#This Row],[Leverandør]],Kontaktinfo[],4,FALSE),\"\")","v":""}]
["NordArkitektur24",null,null,null,null,{"$f":"+IFERROR(VLOOKUP(Database2[[#This Row],[Leverandør]],Kontaktinfo[],4,FALSE),\"\")","v":""}]
["NordArkitektur25",null,null,null,null,{"$f":"+IFERROR(VLOOKUP(Database2[[#This Row],[Leverandør]],Kontaktinfo[],4,FALSE),\"\")","v":""}]
["NordArkitektur26",null,null,null,null,{"$f":"+IFERROR(VLOOKUP(Database2[[#This Row],[Leverandør]],Kontaktinfo[],4,FALSE),\"\")","v":""}]
["NordArkitektur27",null,null,null,null,{"$f":"+IFERROR(VLOOKUP(Database2[[#This Row],[Leverandør]],Kontaktinfo[],4,FALSE),\"\")","v":""}]
["NordArkitektur28",null,null,null,null,{"$f":"+IFERROR(VLOOKUP(Database2[[#This Row],[Leverandør]],Kontaktinfo[],4,FALSE),\"\")","v":""}]
["NordArkitektur29",null,null,null,null,{"$f":"+IFERROR(VLOOKUP(Database2[[#This Row],[Leverandør]],Kontaktinfo[],4,FALSE),\"\")","v":""}]
["NordArkitektur30",null,null,null,null,{"$f":"+IFERROR(VLOOKUP(Database2[[#This Row],[Leverandør]],Kontaktinfo[],4,FALSE),\"\")","v":""}]
["",null,null,null,null,{"$f":"+IFERROR(VLOOKUP(Database2[[#This Row],[Leverandør]],Kontaktinfo[],4,FALSE),\"\")","v":""}]
["NordInformasjonssikkerhet1",null,null,null,null,{"$f":"+IFERROR(VLOOKUP(Database2[[#This Row],[Leverandør]],Kontaktinfo[],4,FALSE),\"\")","v":""}]
["NordInformasjonssikkerhet2",null,null,null,null,{"$f":"+IFERROR(VLOOKUP(Database2[[#This Row],[Leverandør]],Kontaktinfo[],4,FALSE),\"\")","v":""}]
["NordInformasjonssikkerhet3",null,null,null,null,{"$f":"+IFERROR(VLOOKUP(Database2[[#This Row],[Leverandør]],Kontaktinfo[],4,FALSE),\"\")","v":""}]
["NordInformasjonssikkerhet4",null,null,null,null,{"$f":"+IFERROR(VLOOKUP(Database2[[#This Row],[Leverandør]],Kontaktinfo[],4,FALSE),\"\")","v":""}]
["NordInformasjonssikkerhet5",null,null,null,null,{"$f":"+IFERROR(VLOOKUP(Database2[[#This Row],[Leverandør]],Kontaktinfo[],4,FALSE),\"\")","v":""}]
["NordInformasjonssikkerhet6",null,null,null,null,{"$f":"+IFERROR(VLOOKUP(Database2[[#This Row],[Leverandør]],Kontaktinfo[],4,FALSE),\"\")","v":""}]
["NordInformasjonssikkerhet7",null,null,null,null,{"$f":"+IFERROR(VLOOKUP(Database2[[#This Row],[Leverandør]],Kontaktinfo[],4,FALSE),\"\")","v":""}]
["NordInformasjonssikkerhet8",null,null,null,null,{"$f":"+IFERROR(VLOOKUP(Database2[[#This Row],[Leverandør]],Kontaktinfo[],4,FALSE),\"\")","v":""}]
["NordInformasjonssikkerhet9",null,null,null,null,{"$f":"+IFERROR(VLOOKUP(Database2[[#This Row],[Leverandør]],Kontaktinfo[],4,FALSE),\"\")","v":""}]
["NordInformasjonssikkerhet10",null,null,null,null,{"$f":"+IFERROR(VLOOKUP(Database2[[#This Row],[Leverandør]],Kontaktinfo[],4,FALSE),\"\")","v":""}]
["NordInformasjonssikkerhet11",null,null,null,null,{"$f":"+IFERROR(VLOOKUP(Database2[[#This Row],[Leverandør]],Kontaktinfo[],4,FALSE),\"\")","v":""}]
["NordInformasjonssikkerhet12",null,null,null,null,{"$f":"+IFERROR(VLOOKUP(Database2[[#This Row],[Leverandør]],Kontaktinfo[],4,FALSE),\"\")","v":""}]
["NordInformasjonssikkerhet13",null,null,null,null,{"$f":"+IFERROR(VLOOKUP(Database2[[#This Row],[Leverandør]],Kontaktinfo[],4,FALSE),\"\")","v":""}]
["NordInformasjonssikkerhet14",null,null,null,null,{"$f":"+IFERROR(VLOOKUP(Database2[[#This Row],[Leverandør]],Kontaktinfo[],4,FALSE),\"\")","v":""}]
["NordInformasjonssikkerhet15",null,null,null,null,{"$f":"+IFERROR(VLOOKUP(Database2[[#This Row],[Leverandør]],Kontaktinfo[],4,FALSE),\"\")","v":""}]
["NordInformasjonssikkerhet16",null,null,null,null,{"$f":"+IFERROR(VLOOKUP(Database2[[#This Row],[Leverandør]],Kontaktinfo[],4,FALSE),\"\")","v":""}]
["NordInformasjonssikkerhet17",null,null,null,null,{"$f":"+IFERROR(VLOOKUP(Database2[[#This Row],[Leverandør]],Kontaktinfo[],4,FALSE),\"\")","v":""}]
["NordInformasjonssikkerhet18",null,null,null,null,{"$f":"+IFERROR(VLOOKUP(Database2[[#This Row],[Leverandør]],Kontaktinfo[],4,FALSE),\"\")","v":""}]
["NordInformasjonssikkerhet19",null,null,null,null,{"$f":"+IFERROR(VLOOKUP(Database2[[#This Row],[Leverandør]],Kontaktinfo[],4,FALSE),\"\")","v":""}]
["NordInformasjonssikkerhet20",null,null,null,null,{"$f":"+IFERROR(VLOOKUP(Database2[[#This Row],[Leverandør]],Kontaktinfo[],4,FALSE),\"\")","v":""}]
["NordInformasjonssikkerhet21",null,null,null,null,{"$f":"+IFERROR(VLOOKUP(Database2[[#This Row],[Leverandør]],Kontaktinfo[],4,FALSE),\"\")","v":""}]
["NordInformasjonssikkerhet22",null,null,null,null,{"$f":"+IFERROR(VLOOKUP(Database2[[#This Row],[Leverandør]],Kontaktinfo[],4,FALSE),\"\")","v":""}]
["NordInformasjonssikkerhet23",null,null,null,null,{"$f":"+IFERROR(VLOOKUP(Database2[[#This Row],[Leverandør]],Kontaktinfo[],4,FALSE),\"\")","v":""}]
["NordInformasjonssikkerhet24",null,null,null,null,{"$f":"+IFERROR(VLOOKUP(Database2[[#This Row],[Leverandør]],Kontaktinfo[],4,FALSE),\"\")","v":""}]
["NordInformasjonssikkerhet25",null,null,null,null,{"$f":"+IFERROR(VLOOKUP(Database2[[#This Row],[Leverandør]],Kontaktinfo[],4,FALSE),\"\")","v":""}]
["NordInformasjonssikkerhet26",null,null,null,null,{"$f":"+IFERROR(VLOOKUP(Database2[[#This Row],[Leverandør]],Kontaktinfo[],4,FALSE),\"\")","v":""}]
["",null,null,null,null,{"$f":"+IFERROR(VLOOKUP(Database2[[#This Row],[Leverandør]],Kontaktinfo[],4,FALSE),\"\")","v":""}]
["NordTestledelse og Release-gjennomføring1",null,null,null,null,{"$f":"+IFERROR(VLOOKUP(Database2[[#This Row],[Leverandør]],Kontaktinfo[],4,FALSE),\"\")","v":""}]
["NordTestledelse og Release-gjennomføring2",null,null,null,null,{"$f":"+IFERROR(VLOOKUP(Database2[[#This Row],[Leverandør]],Kontaktinfo[],4,FALSE),\"\")","v":""}]
["NordTestledelse og Release-gjennomføring3",null,null,null,null,{"$f":"+IFERROR(VLOOKUP(Database2[[#This Row],[Leverandør]],Kontaktinfo[],4,FALSE),\"\")","v":""}]
["NordTestledelse og Release-gjennomføring4",null,null,null,null,{"$f":"+IFERROR(VLOOKUP(Database2[[#This Row],[Leverandør]],Kontaktinfo[],4,FALSE),\"\")","v":""}]
["NordTestledelse og Release-gjennomføring5",null,null,null,null,{"$f":"+IFERROR(VLOOKUP(Database2[[#This Row],[Leverandør]],Kontaktinfo[],4,FALSE),\"\")","v":""}]
["NordTestledelse og Release-gjennomføring6",null,null,null,null,{"$f":"+IFERROR(VLOOKUP(Database2[[#This Row],[Leverandør]],Kontaktinfo[],4,FALSE),\"\")","v":""}]
["NordTestledelse og Release-gjennomføring7",null,null,null,null,{"$f":"+IFERROR(VLOOKUP(Database2[[#This Row],[Leverandør]],Kontaktinfo[],4,FALSE),\"\")","v":""}]
["NordTestledelse og Release-gjennomføring8",null,null,null,null,{"$f":"+IFERROR(VLOOKUP(Database2[[#This Row],[Leverandør]],Kontaktinfo[],4,FALSE),\"\")","v":""}]
["NordTestledelse og Release-gjennomføring9",null,null,null,null,{"$f":"+IFERROR(VLOOKUP(Database2[[#This Row],[Leverandør]],Kontaktinfo[],4,FALSE),\"\")","v":""}]
["NordTestledelse og Release-gjennomføring10",null,null,null,null,{"$f":"+IFERROR(VLOOKUP(Database2[[#This Row],[Leverandør]],Kontaktinfo[],4,FALSE),\"\")","v":""}]
["NordTestledelse og Release-gjennomføring11",null,null,null,null,{"$f":"+IFERROR(VLOOKUP(Database2[[#This Row],[Leverandør]],Kontaktinfo[],4,FALSE),\"\")","v":""}]
["NordTestledelse og Release-gjennomføring12",null,null,null,null,{"$f":"+IFERROR(VLOOKUP(Database2[[#This Row],[Leverandør]],Kontaktinfo[],4,FALSE),\"\")","v":""}]
["NordTestledelse og Release-gjennomføring13",null,null,null,null,{"$f":"+IFERROR(VLOOKUP(Database2[[#This Row],[Leverandør]],Kontaktinfo[],4,FALSE),\"\")","v":""}]
["NordTestledelse og Release-gjennomføring14",null,null,null,null,{"$f":"+IFERROR(VLOOKUP(Database2[[#This Row],[Leverandør]],Kontaktinfo[],4,FALSE),\"\")","v":""}]
["NordTestledelse og Release-gjennomføring15",null,null,null,null,{"$f":"+IFERROR(VLOOKUP(Database2[[#This Row],[Leverandør]],Kontaktinfo[],4,FALSE),\"\")","v":""}]
["NordTestledelse og Release-gjennomføring16",null,null,null,null,{"$f":"+IFERROR(VLOOKUP(Database2[[#This Row],[Leverandør]],Kontaktinfo[],4,FALSE),\"\")","v":""}]
["NordTestledelse og Release-gjennomføring17",null,null,null,null,{"$f":"+IFERROR(VLOOKUP(Database2[[#This Row],[Leverandør]],Kontaktinfo[],4,FALSE),\"\")","v":""}]
["NordTestledelse og Release-gjennomføring18",null,null,null,null,{"$f":"+IFERROR(VLOOKUP(Database2[[#This Row],[Leverandør]],Kontaktinfo[],4,FALSE),\"\")","v":""}]
["NordTestledelse og Release-gjennomføring19",null,null,null,null,{"$f":"+IFERROR(VLOOKUP(Database2[[#This Row],[Leverandør]],Kontaktinfo[],4,FALSE),\"\")","v":""}]
["NordTestledelse og Release-gjennomføring20",null,null,null,null,{"$f":"+IFERROR(VLOOKUP(Database2[[#This Row],[Leverandør]],Kontaktinfo[],4,FALSE),\"\")","v":""}]
["NordTestledelse og Release-gjennomføring21",null,null,null,null,{"$f":"+IFERROR(VLOOKUP(Database2[[#This Row],[Leverandør]],Kontaktinfo[],4,FALSE),\"\")","v":""}]
["NordTestledelse og Release-gjennomføring22",null,null,null,null,{"$f":"+IFERROR(VLOOKUP(Database2[[#This Row],[Leverandør]],Kontaktinfo[],4,FALSE),\"\")","v":""}]
["NordTestledelse og Release-gjennomføring23",null,null,null,null,{"$f":"+IFERROR(VLOOKUP(Database2[[#This Row],[Leverandør]],Kontaktinfo[],4,FALSE),\"\")","v":""}]
["NordTestledelse og Release-gjennomføring24",null,null,null,null,{"$f":"+IFERROR(VLOOKUP(Database2[[#This Row],[Leverandør]],Kontaktinfo[],4,FALSE),\"\")","v":""}]
["NordTestledelse og Release-gjennomføring25",null,null,null,null,{"$f":"+IFERROR(VLOOKUP(Database2[[#This Row],[Leverandør]],Kontaktinfo[],4,FALSE),\"\")","v":""}]
["NordTestledelse og Release-gjennomføring26",null,null,null,null,{"$f":"+IFERROR(VLOOKUP(Database2[[#This Row],[Leverandør]],Kontaktinfo[],4,FALSE),\"\")","v":""}]
["",null,null,null,null,{"$f":"+IFERROR(VLOOKUP(Database2[[#This Row],[Leverandør]],Kontaktinfo[],4,FALSE),\"\")","v":""}]
["",null,null,null,null,{"$f":"+IFERROR(VLOOKUP(Database2[[#This Row],[Leverandør]],Kontaktinfo[],4,FALSE),\"\")","v":""}]
["NordElektronisk samhandling/integrasjoner/systemutvikling1",null,null,null,null,{"$f":"+IFERROR(VLOOKUP(Database2[[#This Row],[Leverandør]],Kontaktinfo[],4,FALSE),\"\")","v":""}]
["NordElektronisk samhandling/integrasjoner/systemutvikling2",null,null,null,null,{"$f":"+IFERROR(VLOOKUP(Database2[[#This Row],[Leverandør]],Kontaktinfo[],4,FALSE),\"\")","v":""}]
["NordElektronisk samhandling/integrasjoner/systemutvikling3",null,null,null,null,{"$f":"+IFERROR(VLOOKUP(Database2[[#This Row],[Leverandør]],Kontaktinfo[],4,FALSE),\"\")","v":""}]
["NordElektronisk samhandling/integrasjoner/systemutvikling4",null,null,null,null,{"$f":"+IFERROR(VLOOKUP(Database2[[#This Row],[Leverandør]],Kontaktinfo[],4,FALSE),\"\")","v":""}]
["NordElektronisk samhandling/integrasjoner/systemutvikling5",null,null,null,null,{"$f":"+IFERROR(VLOOKUP(Database2[[#This Row],[Leverandør]],Kontaktinfo[],4,FALSE),\"\")","v":""}]
["NordElektronisk samhandling/integrasjoner/systemutvikling6",null,null,null,null,{"$f":"+IFERROR(VLOOKUP(Database2[[#This Row],[Leverandør]],Kontaktinfo[],4,FALSE),\"\")","v":""}]
["NordElektronisk samhandling/integrasjoner/systemutvikling7",null,null,null,null,{"$f":"+IFERROR(VLOOKUP(Database2[[#This Row],[Leverandør]],Kontaktinfo[],4,FALSE),\"\")","v":""}]
["NordElektronisk samhandling/integrasjoner/systemutvikling8",null,null,null,null,{"$f":"+IFERROR(VLOOKUP(Database2[[#This Row],[Leverandør]],Kontaktinfo[],4,FALSE),\"\")","v":""}]
["NordElektronisk samhandling/integrasjoner/systemutvikling9",null,null,null,null,{"$f":"+IFERROR(VLOOKUP(Database2[[#This Row],[Leverandør]],Kontaktinfo[],4,FALSE),\"\")","v":""}]
["NordElektronisk samhandling/integrasjoner/systemutvikling10",null,null,null,null,{"$f":"+IFERROR(VLOOKUP(Database2[[#This Row],[Leverandør]],Kontaktinfo[],4,FALSE),\"\")","v":""}]
["NordElektronisk samhandling/integrasjoner/systemutvikling11",null,null,null,null,{"$f":"+IFERROR(VLOOKUP(Database2[[#This Row],[Leverandør]],Kontaktinfo[],4,FALSE),\"\")","v":""}]
["NordElektronisk samhandling/integrasjoner/systemutvikling12",null,null,null,null,{"$f":"+IFERROR(VLOOKUP(Database2[[#This Row],[Leverandør]],Kontaktinfo[],4,FALSE),\"\")","v":""}]
["NordElektronisk samhandling/integrasjoner/systemutvikling13",null,null,null,null,{"$f":"+IFERROR(VLOOKUP(Database2[[#This Row],[Leverandør]],Kontaktinfo[],4,FALSE),\"\")","v":""}]
["NordElektronisk samhandling/integrasjoner/systemutvikling14",null,null,null,null,{"$f":"+IFERROR(VLOOKUP(Database2[[#This Row],[Leverandør]],Kontaktinfo[],4,FALSE),\"\")","v":""}]
["NordElektronisk samhandling/integrasjoner/systemutvikling15",null,null,null,null,{"$f":"+IFERROR(VLOOKUP(Database2[[#This Row],[Leverandør]],Kontaktinfo[],4,FALSE),\"\")","v":""}]
["NordElektronisk samhandling/integrasjoner/systemutvikling16",null,null,null,null,{"$f":"+IFERROR(VLOOKUP(Database2[[#This Row],[Leverandør]],Kontaktinfo[],4,FALSE),\"\")","v":""}]
["NordElektronisk samhandling/integrasjoner/systemutvikling17",null,null,null,null,{"$f":"+IFERROR(VLOOKUP(Database2[[#This Row],[Leverandør]],Kontaktinfo[],4,FALSE),\"\")","v":""}]
["NordElektronisk samhandling/integrasjoner/systemutvikling18",null,null,null,null,{"$f":"+IFERROR(VLOOKUP(Database2[[#This Row],[Leverandør]],Kontaktinfo[],4,FALSE),\"\")","v":""}]
["NordElektronisk samhandling/integrasjoner/systemutvikling19",null,null,null,null,{"$f":"+IFERROR(VLOOKUP(Database2[[#This Row],[Leverandør]],Kontaktinfo[],4,FALSE),\"\")","v":""}]
["NordElektronisk samhandling/integrasjoner/systemutvikling20",null,null,null,null,{"$f":"+IFERROR(VLOOKUP(Database2[[#This Row],[Leverandør]],Kontaktinfo[],4,FALSE),\"\")","v":""}]
["NordElektronisk samhandling/integrasjoner/systemutvikling21",null,null,null,null,{"$f":"+IFERROR(VLOOKUP(Database2[[#This Row],[Leverandør]],Kontaktinfo[],4,FALSE),\"\")","v":""}]
["NordElektronisk samhandling/integrasjoner/systemutvikling22",null,null,null,null,{"$f":"+IFERROR(VLOOKUP(Database2[[#This Row],[Leverandør]],Kontaktinfo[],4,FALSE),\"\")","v":""}]
["NordElektronisk samhandling/integrasjoner/systemutvikling23",null,null,null,null,{"$f":"+IFERROR(VLOOKUP(Database2[[#This Row],[Leverandør]],Kontaktinfo[],4,FALSE),\"\")","v":""}]
["NordElektronisk samhandling/integrasjoner/systemutvikling24",null,null,null,null,{"$f":"+IFERROR(VLOOKUP(Database2[[#This Row],[Leverandør]],Kontaktinfo[],4,FALSE),\"\")","v":""}]
["NordElektronisk samhandling/integrasjoner/systemutvikling25",null,null,null,null,{"$f":"+IFERROR(VLOOKUP(Database2[[#This Row],[Leverandør]],Kontaktinfo[],4,FALSE),\"\")","v":""}]
["NordElektronisk samhandling/integrasjoner/systemutvikling26",null,null,null,null,{"$f":"+IFERROR(VLOOKUP(Database2[[#This Row],[Leverandør]],Kontaktinfo[],4,FALSE),\"\")","v":""}]
["",null,null,null,null,{"$f":"+IFERROR(VLOOKUP(Database2[[#This Row],[Leverandør]],Kontaktinfo[],4,FALSE),\"\")","v":""}]
["NordDrift og Forvaltning av IT-systemer og plattformer1",null,null,null,null,{"$f":"+IFERROR(VLOOKUP(Database2[[#This Row],[Leverandør]],Kontaktinfo[],4,FALSE),\"\")","v":""}]
["NordDrift og Forvaltning av IT-systemer og plattformer2",null,null,null,null,{"$f":"+IFERROR(VLOOKUP(Database2[[#This Row],[Leverandør]],Kontaktinfo[],4,FALSE),\"\")","v":""}]
["NordDrift og Forvaltning av IT-systemer og plattformer3",null,null,null,null,{"$f":"+IFERROR(VLOOKUP(Database2[[#This Row],[Leverandør]],Kontaktinfo[],4,FALSE),\"\")","v":""}]
["NordDrift og Forvaltning av IT-systemer og plattformer4",null,null,null,null,{"$f":"+IFERROR(VLOOKUP(Database2[[#This Row],[Leverandør]],Kontaktinfo[],4,FALSE),\"\")","v":""}]
["NordDrift og Forvaltning av IT-systemer og plattformer5",null,null,null,null,{"$f":"+IFERROR(VLOOKUP(Database2[[#This Row],[Leverandør]],Kontaktinfo[],4,FALSE),\"\")","v":""}]
["NordDrift og Forvaltning av IT-systemer og plattformer6",null,null,null,null,{"$f":"+IFERROR(VLOOKUP(Database2[[#This Row],[Leverandør]],Kontaktinfo[],4,FALSE),\"\")","v":""}]
["NordDrift og Forvaltning av IT-systemer og plattformer7",null,null,null,null,{"$f":"+IFERROR(VLOOKUP(Database2[[#This Row],[Leverandør]],Kontaktinfo[],4,FALSE),\"\")","v":""}]
["NordDrift og Forvaltning av IT-systemer og plattformer8",null,null,null,null,{"$f":"+IFERROR(VLOOKUP(Database2[[#This Row],[Leverandør]],Kontaktinfo[],4,FALSE),\"\")","v":""}]
["NordDrift og Forvaltning av IT-systemer og plattformer9",null,null,null,null,{"$f":"+IFERROR(VLOOKUP(Database2[[#This Row],[Leverandør]],Kontaktinfo[],4,FALSE),\"\")","v":""}]
["NordDrift og Forvaltning av IT-systemer og plattformer10",null,null,null,null,{"$f":"+IFERROR(VLOOKUP(Database2[[#This Row],[Leverandør]],Kontaktinfo[],4,FALSE),\"\")","v":""}]
["NordDrift og Forvaltning av IT-systemer og plattformer11",null,null,null,null,{"$f":"+IFERROR(VLOOKUP(Database2[[#This Row],[Leverandør]],Kontaktinfo[],4,FALSE),\"\")","v":""}]
["NordDrift og Forvaltning av IT-systemer og plattformer12",null,null,null,null,{"$f":"+IFERROR(VLOOKUP(Database2[[#This Row],[Leverandør]],Kontaktinfo[],4,FALSE),\"\")","v":""}]
["NordDrift og Forvaltning av IT-systemer og plattformer13",null,null,null,null,{"$f":"+IFERROR(VLOOKUP(Database2[[#This Row],[Leverandør]],Kontaktinfo[],4,FALSE),\"\")","v":""}]
["NordDrift og Forvaltning av IT-systemer og plattformer14",null,null,null,null,{"$f":"+IFERROR(VLOOKUP(Database2[[#This Row],[Leverandør]],Kontaktinfo[],4,FALSE),\"\")","v":""}]
["NordDrift og Forvaltning av IT-systemer og plattformer15",null,null,null,null,{"$f":"+IFERROR(VLOOKUP(Database2[[#This Row],[Leverandør]],Kontaktinfo[],4,FALSE),\"\")","v":""}]
["NordDrift og Forvaltning av IT-systemer og plattformer16",null,null,null,null,{"$f":"+IFERROR(VLOOKUP(Database2[[#This Row],[Leverandør]],Kontaktinfo[],4,FALSE),\"\")","v":""}]
["NordDrift og Forvaltning av IT-systemer og plattformer17",null,null,null,null,{"$f":"+IFERROR(VLOOKUP(Database2[[#This Row],[Leverandør]],Kontaktinfo[],4,FALSE),\"\")","v":""}]
["NordDrift og Forvaltning av IT-systemer og plattformer18",null,null,null,null,{"$f":"+IFERROR(VLOOKUP(Database2[[#This Row],[Leverandør]],Kontaktinfo[],4,FALSE),\"\")","v":""}]
["NordDrift og Forvaltning av IT-systemer og plattformer19",null,null,null,null,{"$f":"+IFERROR(VLOOKUP(Database2[[#This Row],[Leverandør]],Kontaktinfo[],4,FALSE),\"\")","v":""}]
["NordDrift og Forvaltning av IT-systemer og plattformer20",null,null,null,null,{"$f":"+IFERROR(VLOOKUP(Database2[[#This Row],[Leverandør]],Kontaktinfo[],4,FALSE),\"\")","v":""}]
["NordDrift og Forvaltning av IT-systemer og plattformer21",null,null,null,null,{"$f":"+IFERROR(VLOOKUP(Database2[[#This Row],[Leverandør]],Kontaktinfo[],4,FALSE),\"\")","v":""}]
["NordDrift og Forvaltning av IT-systemer og plattformer22",null,null,null,null,{"$f":"+IFERROR(VLOOKUP(Database2[[#This Row],[Leverandør]],Kontaktinfo[],4,FALSE),\"\")","v":""}]
["NordDrift og Forvaltning av IT-systemer og plattformer23",null,null,null,null,{"$f":"+IFERROR(VLOOKUP(Database2[[#This Row],[Leverandør]],Kontaktinfo[],4,FALSE),\"\")","v":""}]
["NordDrift og Forvaltning av IT-systemer og plattformer24",null,null,null,null,{"$f":"+IFERROR(VLOOKUP(Database2[[#This Row],[Leverandør]],Kontaktinfo[],4,FALSE),\"\")","v":""}]
["NordDrift og Forvaltning av IT-systemer og plattformer25",null,null,null,null,{"$f":"+IFERROR(VLOOKUP(Database2[[#This Row],[Leverandør]],Kontaktinfo[],4,FALSE),\"\")","v":""}]
["NordDrift og Forvaltning av IT-systemer og plattformer26",null,null,null,null,{"$f":"+IFERROR(VLOOKUP(Database2[[#This Row],[Leverandør]],Kontaktinfo[],4,FALSE),\"\")","v":""}]
["",null,null,null,null,{"$f":"+IFERROR(VLOOKUP(Database2[[#This Row],[Leverandør]],Kontaktinfo[],4,FALSE),\"\")","v":""}]
["NordDatakommunikasjon og Telekommunikasjon1",null,null,null,null,{"$f":"+IFERROR(VLOOKUP(Database2[[#This Row],[Leverandør]],Kontaktinfo[],4,FALSE),\"\")","v":""}]
["NordDatakommunikasjon og Telekommunikasjon2",null,null,null,null,{"$f":"+IFERROR(VLOOKUP(Database2[[#This Row],[Leverandør]],Kontaktinfo[],4,FALSE),\"\")","v":""}]
["NordDatakommunikasjon og Telekommunikasjon3",null,null,null,null,{"$f":"+IFERROR(VLOOKUP(Database2[[#This Row],[Leverandør]],Kontaktinfo[],4,FALSE),\"\")","v":""}]
["NordDatakommunikasjon og Telekommunikasjon4",null,null,null,null,{"$f":"+IFERROR(VLOOKUP(Database2[[#This Row],[Leverandør]],Kontaktinfo[],4,FALSE),\"\")","v":""}]
["NordDatakommunikasjon og Telekommunikasjon5",null,null,null,null,{"$f":"+IFERROR(VLOOKUP(Database2[[#This Row],[Leverandør]],Kontaktinfo[],4,FALSE),\"\")","v":""}]
["NordDatakommunikasjon og Telekommunikasjon6",null,null,null,null,{"$f":"+IFERROR(VLOOKUP(Database2[[#This Row],[Leverandør]],Kontaktinfo[],4,FALSE),\"\")","v":""}]
["NordDatakommunikasjon og Telekommunikasjon7",null,null,null,null,{"$f":"+IFERROR(VLOOKUP(Database2[[#This Row],[Leverandør]],Kontaktinfo[],4,FALSE),\"\")","v":""}]
["NordDatakommunikasjon og Telekommunikasjon8",null,null,null,null,{"$f":"+IFERROR(VLOOKUP(Database2[[#This Row],[Leverandør]],Kontaktinfo[],4,FALSE),\"\")","v":""}]
["NordDatakommunikasjon og Telekommunikasjon9",null,null,null,null,{"$f":"+IFERROR(VLOOKUP(Database2[[#This Row],[Leverandør]],Kontaktinfo[],4,FALSE),\"\")","v":""}]
["NordDatakommunikasjon og Telekommunikasjon10",null,null,null,null,{"$f":"+IFERROR(VLOOKUP(Database2[[#This Row],[Leverandør]],Kontaktinfo[],4,FALSE),\"\")","v":""}]
["NordDatakommunikasjon og Telekommunikasjon11",null,null,null,null,{"$f":"+IFERROR(VLOOKUP(Database2[[#This Row],[Leverandør]],Kontaktinfo[],4,FALSE),\"\")","v":""}]
["NordDatakommunikasjon og Telekommunikasjon12",null,null,null,null,{"$f":"+IFERROR(VLOOKUP(Database2[[#This Row],[Leverandør]],Kontaktinfo[],4,FALSE),\"\")","v":""}]
["NordDatakommunikasjon og Telekommunikasjon13",null,null,null,null,{"$f":"+IFERROR(VLOOKUP(Database2[[#This Row],[Leverandør]],Kontaktinfo[],4,FALSE),\"\")","v":""}]
["NordDatakommunikasjon og Telekommunikasjon14",null,null,null,null,{"$f":"+IFERROR(VLOOKUP(Database2[[#This Row],[Leverandør]],Kontaktinfo[],4,FALSE),\"\")","v":""}]
["NordDatakommunikasjon og Telekommunikasjon15",null,null,null,null,{"$f":"+IFERROR(VLOOKUP(Database2[[#This Row],[Leverandør]],Kontaktinfo[],4,FALSE),\"\")","v":""}]
["NordDatakommunikasjon og Telekommunikasjon16",null,null,null,null,{"$f":"+IFERROR(VLOOKUP(Database2[[#This Row],[Leverandør]],Kontaktinfo[],4,FALSE),\"\")","v":""}]
["NordDatakommunikasjon og Telekommunikasjon17",null,null,null,null,{"$f":"+IFERROR(VLOOKUP(Database2[[#This Row],[Leverandør]],Kontaktinfo[],4,FALSE),\"\")","v":""}]
["NordDatakommunikasjon og Telekommunikasjon18",null,null,null,null,{"$f":"+IFERROR(VLOOKUP(Database2[[#This Row],[Leverandør]],Kontaktinfo[],4,FALSE),\"\")","v":""}]
["NordDatakommunikasjon og Telekommunikasjon19",null,null,null,null,{"$f":"+IFERROR(VLOOKUP(Database2[[#This Row],[Leverandør]],Kontaktinfo[],4,FALSE),\"\")","v":""}]
["NordDatakommunikasjon og Telekommunikasjon20",null,null,null,null,{"$f":"+IFERROR(VLOOKUP(Database2[[#This Row],[Leverandør]],Kontaktinfo[],4,FALSE),\"\")","v":""}]
["NordDatakommunikasjon og Telekommunikasjon21",null,null,null,null,{"$f":"+IFERROR(VLOOKUP(Database2[[#This Row],[Leverandør]],Kontaktinfo[],4,FALSE),\"\")","v":""}]
["NordDatakommunikasjon og Telekommunikasjon22",null,null,null,null,{"$f":"+IFERROR(VLOOKUP(Database2[[#This Row],[Leverandør]],Kontaktinfo[],4,FALSE),\"\")","v":""}]
["NordDatakommunikasjon og Telekommunikasjon23",null,null,null,null,{"$f":"+IFERROR(VLOOKUP(Database2[[#This Row],[Leverandør]],Kontaktinfo[],4,FALSE),\"\")","v":""}]
["NordDatakommunikasjon og Telekommunikasjon24",null,null,null,null,{"$f":"+IFERROR(VLOOKUP(Database2[[#This Row],[Leverandør]],Kontaktinfo[],4,FALSE),\"\")","v":""}]
["NordDatakommunikasjon og Telekommunikasjon25",null,null,null,null,{"$f":"+IFERROR(VLOOKUP(Database2[[#This Row],[Leverandør]],Kontaktinfo[],4,FALSE),\"\")","v":""}]
["NordDatakommunikasjon og Telekommunikasjon26",null,null,null,null,{"$f":"+IFERROR(VLOOKUP(Database2[[#This Row],[Leverandør]],Kontaktinfo[],4,FALSE),\"\")","v":""}]
["",null,null,null,null,{"$f":"+IFERROR(VLOOKUP(Database2[[#This Row],[Leverandør]],Kontaktinfo[],4,FALSE),\"\")","v":""}]
["NordApplikasjonsforvaltning1",null,null,null,null,{"$f":"+IFERROR(VLOOKUP(Database2[[#This Row],[Leverandør]],Kontaktinfo[],4,FALSE),\"\")","v":""}]
["NordApplikasjonsforvaltning2",null,null,null,null,{"$f":"+IFERROR(VLOOKUP(Database2[[#This Row],[Leverandør]],Kontaktinfo[],4,FALSE),\"\")","v":""}]
["NordApplikasjonsforvaltning3",null,null,null,null,{"$f":"+IFERROR(VLOOKUP(Database2[[#This Row],[Leverandør]],Kontaktinfo[],4,FALSE),\"\")","v":""}]
["NordApplikasjonsforvaltning4",null,null,null,null,{"$f":"+IFERROR(VLOOKUP(Database2[[#This Row],[Leverandør]],Kontaktinfo[],4,FALSE),\"\")","v":""}]
["NordApplikasjonsforvaltning5",null,null,null,null,{"$f":"+IFERROR(VLOOKUP(Database2[[#This Row],[Leverandør]],Kontaktinfo[],4,FALSE),\"\")","v":""}]
["NordApplikasjonsforvaltning6",null,null,null,null,{"$f":"+IFERROR(VLOOKUP(Database2[[#This Row],[Leverandør]],Kontaktinfo[],4,FALSE),\"\")","v":""}]
["NordApplikasjonsforvaltning7",null,null,null,null,{"$f":"+IFERROR(VLOOKUP(Database2[[#This Row],[Leverandør]],Kontaktinfo[],4,FALSE),\"\")","v":""}]
["NordApplikasjonsforvaltning8",null,null,null,null,{"$f":"+IFERROR(VLOOKUP(Database2[[#This Row],[Leverandør]],Kontaktinfo[],4,FALSE),\"\")","v":""}]
["NordApplikasjonsforvaltning9",null,null,null,null,{"$f":"+IFERROR(VLOOKUP(Database2[[#This Row],[Leverandør]],Kontaktinfo[],4,FALSE),\"\")","v":""}]
["NordApplikasjonsforvaltning10",null,null,null,null,{"$f":"+IFERROR(VLOOKUP(Database2[[#This Row],[Leverandør]],Kontaktinfo[],4,FALSE),\"\")","v":""}]
["NordApplikasjonsforvaltning11",null,null,null,null,{"$f":"+IFERROR(VLOOKUP(Database2[[#This Row],[Leverandør]],Kontaktinfo[],4,FALSE),\"\")","v":""}]
["NordApplikasjonsforvaltning12",null,null,null,null,{"$f":"+IFERROR(VLOOKUP(Database2[[#This Row],[Leverandør]],Kontaktinfo[],4,FALSE),\"\")","v":""}]
["NordApplikasjonsforvaltning13",null,null,null,null,{"$f":"+IFERROR(VLOOKUP(Database2[[#This Row],[Leverandør]],Kontaktinfo[],4,FALSE),\"\")","v":""}]
["NordApplikasjonsforvaltning14",null,null,null,null,{"$f":"+IFERROR(VLOOKUP(Database2[[#This Row],[Leverandør]],Kontaktinfo[],4,FALSE),\"\")","v":""}]
["NordApplikasjonsforvaltning15",null,null,null,null,{"$f":"+IFERROR(VLOOKUP(Database2[[#This Row],[Leverandør]],Kontaktinfo[],4,FALSE),\"\")","v":""}]
["NordApplikasjonsforvaltning16",null,null,null,null,{"$f":"+IFERROR(VLOOKUP(Database2[[#This Row],[Leverandør]],Kontaktinfo[],4,FALSE),\"\")","v":""}]
["NordApplikasjonsforvaltning17",null,null,null,null,{"$f":"+IFERROR(VLOOKUP(Database2[[#This Row],[Leverandør]],Kontaktinfo[],4,FALSE),\"\")","v":""}]
["NordApplikasjonsforvaltning18",null,null,null,null,{"$f":"+IFERROR(VLOOKUP(Database2[[#This Row],[Leverandør]],Kontaktinfo[],4,FALSE),\"\")","v":""}]
["NordApplikasjonsforvaltning19",null,null,null,null,{"$f":"+IFERROR(VLOOKUP(Database2[[#This Row],[Leverandør]],Kontaktinfo[],4,FALSE),\"\")","v":""}]
["NordApplikasjonsforvaltning20",null,null,null,null,{"$f":"+IFERROR(VLOOKUP(Database2[[#This Row],[Leverandør]],Kontaktinfo[],4,FALSE),\"\")","v":""}]
["NordApplikasjonsforvaltning21",null,null,null,null,{"$f":"+IFERROR(VLOOKUP(Database2[[#This Row],[Leverandør]],Kontaktinfo[],4,FALSE),\"\")","v":""}]
["NordApplikasjonsforvaltning22",null,null,null,null,{"$f":"+IFERROR(VLOOKUP(Database2[[#This Row],[Leverandør]],Kontaktinfo[],4,FALSE),\"\")","v":""}]
["NordApplikasjonsforvaltning23",null,null,null,null,{"$f":"+IFERROR(VLOOKUP(Database2[[#This Row],[Leverandør]],Kontaktinfo[],4,FALSE),\"\")","v":""}]
["NordApplikasjonsforvaltning24",null,null,null,null,{"$f":"+IFERROR(VLOOKUP(Database2[[#This Row],[Leverandør]],Kontaktinfo[],4,FALSE),\"\")","v":""}]
["NordApplikasjonsforvaltning25",null,null,null,null,{"$f":"+IFERROR(VLOOKUP(Database2[[#This Row],[Leverandør]],Kontaktinfo[],4,FALSE),\"\")","v":""}]
["NordApplikasjonsforvaltning26",null,null,null,null,{"$f":"+IFERROR(VLOOKUP(Database2[[#This Row],[Leverandør]],Kontaktinfo[],4,FALSE),\"\")","v":""}]
["",null,null,null,null,{"$f":"+IFERROR(VLOOKUP(Database2[[#This Row],[Leverandør]],Kontaktinfo[],4,FALSE),\"\")","v":""}]
["NordKlientplattform1",null,null,null,null,{"$f":"+IFERROR(VLOOKUP(Database2[[#This Row],[Leverandør]],Kontaktinfo[],4,FALSE),\"\")","v":""}]
["NordKlientplattform2",null,null,null,null,{"$f":"+IFERROR(VLOOKUP(Database2[[#This Row],[Leverandør]],Kontaktinfo[],4,FALSE),\"\")","v":""}]
["NordKlientplattform3",null,null,null,null,{"$f":"+IFERROR(VLOOKUP(Database2[[#This Row],[Leverandør]],Kontaktinfo[],4,FALSE),\"\")","v":""}]
["NordKlientplattform4",null,null,null,null,{"$f":"+IFERROR(VLOOKUP(Database2[[#This Row],[Leverandør]],Kontaktinfo[],4,FALSE),\"\")","v":""}]
["NordKlientplattform5",null,null,null,null,{"$f":"+IFERROR(VLOOKUP(Database2[[#This Row],[Leverandør]],Kontaktinfo[],4,FALSE),\"\")","v":""}]
["NordKlientplattform6",null,null,null,null,{"$f":"+IFERROR(VLOOKUP(Database2[[#This Row],[Leverandør]],Kontaktinfo[],4,FALSE),\"\")","v":""}]
["NordKlientplattform7",null,null,null,null,{"$f":"+IFERROR(VLOOKUP(Database2[[#This Row],[Leverandør]],Kontaktinfo[],4,FALSE),\"\")","v":""}]
["NordKlientplattform8",null,null,null,null,{"$f":"+IFERROR(VLOOKUP(Database2[[#This Row],[Leverandør]],Kontaktinfo[],4,FALSE),\"\")","v":""}]
["NordKlientplattform9",null,null,null,null,{"$f":"+IFERROR(VLOOKUP(Database2[[#This Row],[Leverandør]],Kontaktinfo[],4,FALSE),\"\")","v":""}]
["NordKlientplattform10",null,null,null,null,{"$f":"+IFERROR(VLOOKUP(Database2[[#This Row],[Leverandør]],Kontaktinfo[],4,FALSE),\"\")","v":""}]
["NordKlientplattform11",null,null,null,null,{"$f":"+IFERROR(VLOOKUP(Database2[[#This Row],[Leverandør]],Kontaktinfo[],4,FALSE),\"\")","v":""}]
["NordKlientplattform12",null,null,null,null,{"$f":"+IFERROR(VLOOKUP(Database2[[#This Row],[Leverandør]],Kontaktinfo[],4,FALSE),\"\")","v":""}]
["NordKlientplattform13",null,null,null,null,{"$f":"+IFERROR(VLOOKUP(Database2[[#This Row],[Leverandør]],Kontaktinfo[],4,FALSE),\"\")","v":""}]
["NordKlientplattform14",null,null,null,null,{"$f":"+IFERROR(VLOOKUP(Database2[[#This Row],[Leverandør]],Kontaktinfo[],4,FALSE),\"\")","v":""}]
["NordKlientplattform15",null,null,null,null,{"$f":"+IFERROR(VLOOKUP(Database2[[#This Row],[Leverandør]],Kontaktinfo[],4,FALSE),\"\")","v":""}]
["NordKlientplattform16",null,null,null,null,{"$f":"+IFERROR(VLOOKUP(Database2[[#This Row],[Leverandør]],Kontaktinfo[],4,FALSE),\"\")","v":""}]
["NordKlientplattform17",null,null,null,null,{"$f":"+IFERROR(VLOOKUP(Database2[[#This Row],[Leverandør]],Kontaktinfo[],4,FALSE),\"\")","v":""}]
["NordKlientplattform18",null,null,null,null,{"$f":"+IFERROR(VLOOKUP(Database2[[#This Row],[Leverandør]],Kontaktinfo[],4,FALSE),\"\")","v":""}]
["NordKlientplattform19",null,null,null,null,{"$f":"+IFERROR(VLOOKUP(Database2[[#This Row],[Leverandør]],Kontaktinfo[],4,FALSE),\"\")","v":""}]
["NordKlientplattform20",null,null,null,null,{"$f":"+IFERROR(VLOOKUP(Database2[[#This Row],[Leverandør]],Kontaktinfo[],4,FALSE),\"\")","v":""}]
["NordKlientplattform21",null,null,null,null,{"$f":"+IFERROR(VLOOKUP(Database2[[#This Row],[Leverandør]],Kontaktinfo[],4,FALSE),\"\")","v":""}]
["NordKlientplattform22",null,null,null,null,{"$f":"+IFERROR(VLOOKUP(Database2[[#This Row],[Leverandør]],Kontaktinfo[],4,FALSE),\"\")","v":""}]
["NordKlientplattform23",null,null,null,null,{"$f":"+IFERROR(VLOOKUP(Database2[[#This Row],[Leverandør]],Kontaktinfo[],4,FALSE),\"\")","v":""}]
["NordKlientplattform24",null,null,null,null,{"$f":"+IFERROR(VLOOKUP(Database2[[#This Row],[Leverandør]],Kontaktinfo[],4,FALSE),\"\")","v":""}]
["NordKlientplattform25",null,null,null,null,{"$f":"+IFERROR(VLOOKUP(Database2[[#This Row],[Leverandør]],Kontaktinfo[],4,FALSE),\"\")","v":""}]
["NordKlientplattform26",null,null,null,null,{"$f":"+IFERROR(VLOOKUP(Database2[[#This Row],[Leverandør]],Kontaktinfo[],4,FALSE),\"\")","v":""}]
["",null,null,null,null,{"$f":"+IFERROR(VLOOKUP(Database2[[#This Row],[Leverandør]],Kontaktinfo[],4,FALSE),\"\")","v":""}]
["Midt-NorgeProgram og Prosjektgjennomføring1",null,null,null,null,{"$f":"+IFERROR(VLOOKUP(Database2[[#This Row],[Leverandør]],Kontaktinfo[],4,FALSE),\"\")","v":""}]
["Midt-NorgeProgram og Prosjektgjennomføring2",null,null,null,null,{"$f":"+IFERROR(VLOOKUP(Database2[[#This Row],[Leverandør]],Kontaktinfo[],4,FALSE),\"\")","v":""}]
["Midt-NorgeProgram og Prosjektgjennomføring3",null,null,null,null,{"$f":"+IFERROR(VLOOKUP(Database2[[#This Row],[Leverandør]],Kontaktinfo[],4,FALSE),\"\")","v":""}]
["Midt-NorgeProgram og Prosjektgjennomføring4",null,null,null,null,{"$f":"+IFERROR(VLOOKUP(Database2[[#This Row],[Leverandør]],Kontaktinfo[],4,FALSE),\"\")","v":""}]
["Midt-NorgeProgram og Prosjektgjennomføring5",null,null,null,null,{"$f":"+IFERROR(VLOOKUP(Database2[[#This Row],[Leverandør]],Kontaktinfo[],4,FALSE),\"\")","v":""}]
["Midt-NorgeProgram og Prosjektgjennomføring6",null,null,null,null,{"$f":"+IFERROR(VLOOKUP(Database2[[#This Row],[Leverandør]],Kontaktinfo[],4,FALSE),\"\")","v":""}]
["Midt-NorgeProgram og Prosjektgjennomføring7",null,null,null,null,{"$f":"+IFERROR(VLOOKUP(Database2[[#This Row],[Leverandør]],Kontaktinfo[],4,FALSE),\"\")","v":""}]
["Midt-NorgeProgram og Prosjektgjennomføring8",null,null,null,null,{"$f":"+IFERROR(VLOOKUP(Database2[[#This Row],[Leverandør]],Kontaktinfo[],4,FALSE),\"\")","v":""}]
["Midt-NorgeProgram og Prosjektgjennomføring9",null,null,null,null,{"$f":"+IFERROR(VLOOKUP(Database2[[#This Row],[Leverandør]],Kontaktinfo[],4,FALSE),\"\")","v":""}]
["Midt-NorgeProgram og Prosjektgjennomføring10",null,null,null,null,{"$f":"+IFERROR(VLOOKUP(Database2[[#This Row],[Leverandør]],Kontaktinfo[],4,FALSE),\"\")","v":""}]
["Midt-NorgeProgram og Prosjektgjennomføring11",null,null,null,null,{"$f":"+IFERROR(VLOOKUP(Database2[[#This Row],[Leverandør]],Kontaktinfo[],4,FALSE),\"\")","v":""}]
["Midt-NorgeProgram og Prosjektgjennomføring12",null,null,null,null,{"$f":"+IFERROR(VLOOKUP(Database2[[#This Row],[Leverandør]],Kontaktinfo[],4,FALSE),\"\")","v":""}]
["Midt-NorgeProgram og Prosjektgjennomføring13",null,null,null,null,{"$f":"+IFERROR(VLOOKUP(Database2[[#This Row],[Leverandør]],Kontaktinfo[],4,FALSE),\"\")","v":""}]
["Midt-NorgeProgram og Prosjektgjennomføring14",null,null,null,null,{"$f":"+IFERROR(VLOOKUP(Database2[[#This Row],[Leverandør]],Kontaktinfo[],4,FALSE),\"\")","v":""}]
["Midt-NorgeProgram og Prosjektgjennomføring15",null,null,null,null,{"$f":"+IFERROR(VLOOKUP(Database2[[#This Row],[Leverandør]],Kontaktinfo[],4,FALSE),\"\")","v":""}]
["Midt-NorgeProgram og Prosjektgjennomføring16",null,null,null,null,{"$f":"+IFERROR(VLOOKUP(Database2[[#This Row],[Leverandør]],Kontaktinfo[],4,FALSE),\"\")","v":""}]
["Midt-NorgeProgram og Prosjektgjennomføring17",null,null,null,null,{"$f":"+IFERROR(VLOOKUP(Database2[[#This Row],[Leverandør]],Kontaktinfo[],4,FALSE),\"\")","v":""}]
["Midt-NorgeProgram og Prosjektgjennomføring18",null,null,null,null,{"$f":"+IFERROR(VLOOKUP(Database2[[#This Row],[Leverandør]],Kontaktinfo[],4,FALSE),\"\")","v":""}]
["Midt-NorgeProgram og Prosjektgjennomføring19",null,null,null,null,{"$f":"+IFERROR(VLOOKUP(Database2[[#This Row],[Leverandør]],Kontaktinfo[],4,FALSE),\"\")","v":""}]
["Midt-NorgeProgram og Prosjektgjennomføring20",null,null,null,null,{"$f":"+IFERROR(VLOOKUP(Database2[[#This Row],[Leverandør]],Kontaktinfo[],4,FALSE),\"\")","v":""}]
["Midt-NorgeProgram og Prosjektgjennomføring21",null,null,null,null,{"$f":"+IFERROR(VLOOKUP(Database2[[#This Row],[Leverandør]],Kontaktinfo[],4,FALSE),\"\")","v":""}]
["Midt-NorgeProgram og Prosjektgjennomføring22",null,null,null,null,{"$f":"+IFERROR(VLOOKUP(Database2[[#This Row],[Leverandør]],Kontaktinfo[],4,FALSE),\"\")","v":""}]
["Midt-NorgeProgram og Prosjektgjennomføring23",null,null,null,null,{"$f":"+IFERROR(VLOOKUP(Database2[[#This Row],[Leverandør]],Kontaktinfo[],4,FALSE),\"\")","v":""}]
["Midt-NorgeProgram og Prosjektgjennomføring24",null,null,null,null,{"$f":"+IFERROR(VLOOKUP(Database2[[#This Row],[Leverandør]],Kontaktinfo[],4,FALSE),\"\")","v":""}]
["Midt-NorgeProgram og Prosjektgjennomføring25",null,null,null,null,{"$f":"+IFERROR(VLOOKUP(Database2[[#This Row],[Leverandør]],Kontaktinfo[],4,FALSE),\"\")","v":""}]
["Midt-NorgeProgram og Prosjektgjennomføring26",null,null,null,null,{"$f":"+IFERROR(VLOOKUP(Database2[[#This Row],[Leverandør]],Kontaktinfo[],4,FALSE),\"\")","v":""}]
["",null,null,null,null,{"$f":"+IFERROR(VLOOKUP(Database2[[#This Row],[Leverandør]],Kontaktinfo[],4,FALSE),\"\")","v":""}]
["Midt-NorgeStrategiplanlegging, rådgivning og innovasjon1",null,null,null,null,{"$f":"+IFERROR(VLOOKUP(Database2[[#This Row],[Leverandør]],Kontaktinfo[],4,FALSE),\"\")","v":""}]
["Midt-NorgeStrategiplanlegging, rådgivning og innovasjon2",null,null,null,null,{"$f":"+IFERROR(VLOOKUP(Database2[[#This Row],[Leverandør]],Kontaktinfo[],4,FALSE),\"\")","v":""}]
["Midt-NorgeStrategiplanlegging, rådgivning og innovasjon3",null,null,null,null,{"$f":"+IFERROR(VLOOKUP(Database2[[#This Row],[Leverandør]],Kontaktinfo[],4,FALSE),\"\")","v":""}]
["Midt-NorgeStrategiplanlegging, rådgivning og innovasjon4",null,null,null,null,{"$f":"+IFERROR(VLOOKUP(Database2[[#This Row],[Leverandør]],Kontaktinfo[],4,FALSE),\"\")","v":""}]
["Midt-NorgeStrategiplanlegging, rådgivning og innovasjon5",null,null,null,null,{"$f":"+IFERROR(VLOOKUP(Database2[[#This Row],[Leverandør]],Kontaktinfo[],4,FALSE),\"\")","v":""}]
["Midt-NorgeStrategiplanlegging, rådgivning og innovasjon6",null,null,null,null,{"$f":"+IFERROR(VLOOKUP(Database2[[#This Row],[Leverandør]],Kontaktinfo[],4,FALSE),\"\")","v":""}]
["Midt-NorgeStrategiplanlegging, rådgivning og innovasjon7",null,null,null,null,{"$f":"+IFERROR(VLOOKUP(Database2[[#This Row],[Leverandør]],Kontaktinfo[],4,FALSE),\"\")","v":""}]
["Midt-NorgeStrategiplanlegging, rådgivning og innovasjon8",null,null,null,null,{"$f":"+IFERROR(VLOOKUP(Database2[[#This Row],[Leverandør]],Kontaktinfo[],4,FALSE),\"\")","v":""}]
["Midt-NorgeStrategiplanlegging, rådgivning og innovasjon9",null,null,null,null,{"$f":"+IFERROR(VLOOKUP(Database2[[#This Row],[Leverandør]],Kontaktinfo[],4,FALSE),\"\")","v":""}]
["Midt-NorgeStrategiplanlegging, rådgivning og innovasjon10",null,null,null,null,{"$f":"+IFERROR(VLOOKUP(Database2[[#This Row],[Leverandør]],Kontaktinfo[],4,FALSE),\"\")","v":""}]
["Midt-NorgeStrategiplanlegging, rådgivning og innovasjon11",null,null,null,null,{"$f":"+IFERROR(VLOOKUP(Database2[[#This Row],[Leverandør]],Kontaktinfo[],4,FALSE),\"\")","v":""}]
["Midt-NorgeStrategiplanlegging, rådgivning og innovasjon12",null,null,null,null,{"$f":"+IFERROR(VLOOKUP(Database2[[#This Row],[Leverandør]],Kontaktinfo[],4,FALSE),\"\")","v":""}]
["Midt-NorgeStrategiplanlegging, rådgivning og innovasjon13",null,null,null,null,{"$f":"+IFERROR(VLOOKUP(Database2[[#This Row],[Leverandør]],Kontaktinfo[],4,FALSE),\"\")","v":""}]
["Midt-NorgeStrategiplanlegging, rådgivning og innovasjon14",null,null,null,null,{"$f":"+IFERROR(VLOOKUP(Database2[[#This Row],[Leverandør]],Kontaktinfo[],4,FALSE),\"\")","v":""}]
["Midt-NorgeStrategiplanlegging, rådgivning og innovasjon15",null,null,null,null,{"$f":"+IFERROR(VLOOKUP(Database2[[#This Row],[Leverandør]],Kontaktinfo[],4,FALSE),\"\")","v":""}]
["Midt-NorgeStrategiplanlegging, rådgivning og innovasjon16",null,null,null,null,{"$f":"+IFERROR(VLOOKUP(Database2[[#This Row],[Leverandør]],Kontaktinfo[],4,FALSE),\"\")","v":""}]
["Midt-NorgeStrategiplanlegging, rådgivning og innovasjon17",null,null,null,null,{"$f":"+IFERROR(VLOOKUP(Database2[[#This Row],[Leverandør]],Kontaktinfo[],4,FALSE),\"\")","v":""}]
["Midt-NorgeStrategiplanlegging, rådgivning og innovasjon18",null,null,null,null,{"$f":"+IFERROR(VLOOKUP(Database2[[#This Row],[Leverandør]],Kontaktinfo[],4,FALSE),\"\")","v":""}]
["Midt-NorgeStrategiplanlegging, rådgivning og innovasjon19",null,null,null,null,{"$f":"+IFERROR(VLOOKUP(Database2[[#This Row],[Leverandør]],Kontaktinfo[],4,FALSE),\"\")","v":""}]
["Midt-NorgeStrategiplanlegging, rådgivning og innovasjon20",null,null,null,null,{"$f":"+IFERROR(VLOOKUP(Database2[[#This Row],[Leverandør]],Kontaktinfo[],4,FALSE),\"\")","v":""}]
["Midt-NorgeStrategiplanlegging, rådgivning og innovasjon21",null,null,null,null,{"$f":"+IFERROR(VLOOKUP(Database2[[#This Row],[Leverandør]],Kontaktinfo[],4,FALSE),\"\")","v":""}]
["Midt-NorgeStrategiplanlegging, rådgivning og innovasjon22",null,null,null,null,{"$f":"+IFERROR(VLOOKUP(Database2[[#This Row],[Leverandør]],Kontaktinfo[],4,FALSE),\"\")","v":""}]
["Midt-NorgeStrategiplanlegging, rådgivning og innovasjon23",null,null,null,null,{"$f":"+IFERROR(VLOOKUP(Database2[[#This Row],[Leverandør]],Kontaktinfo[],4,FALSE),\"\")","v":""}]
["Midt-NorgeStrategiplanlegging, rådgivning og innovasjon24",null,null,null,null,{"$f":"+IFERROR(VLOOKUP(Database2[[#This Row],[Leverandør]],Kontaktinfo[],4,FALSE),\"\")","v":""}]
["Midt-NorgeStrategiplanlegging, rådgivning og innovasjon25",null,null,null,null,{"$f":"+IFERROR(VLOOKUP(Database2[[#This Row],[Leverandør]],Kontaktinfo[],4,FALSE),\"\")","v":""}]
["Midt-NorgeStrategiplanlegging, rådgivning og innovasjon26",null,null,null,null,{"$f":"+IFERROR(VLOOKUP(Database2[[#This Row],[Leverandør]],Kontaktinfo[],4,FALSE),\"\")","v":""}]
["",null,null,null,null,{"$f":"+IFERROR(VLOOKUP(Database2[[#This Row],[Leverandør]],Kontaktinfo[],4,FALSE),\"\")","v":""}]
["Midt-NorgeArkitektur1",null,null,null,null,{"$f":"+IFERROR(VLOOKUP(Database2[[#This Row],[Leverandør]],Kontaktinfo[],4,FALSE),\"\")","v":""}]
["Midt-NorgeArkitektur2",null,null,null,null,{"$f":"+IFERROR(VLOOKUP(Database2[[#This Row],[Leverandør]],Kontaktinfo[],4,FALSE),\"\")","v":""}]
["Midt-NorgeArkitektur3",null,null,null,null,{"$f":"+IFERROR(VLOOKUP(Database2[[#This Row],[Leverandør]],Kontaktinfo[],4,FALSE),\"\")","v":""}]
["Midt-NorgeArkitektur4",null,null,null,null,{"$f":"+IFERROR(VLOOKUP(Database2[[#This Row],[Leverandør]],Kontaktinfo[],4,FALSE),\"\")","v":""}]
["Midt-NorgeArkitektur5",null,null,null,null,{"$f":"+IFERROR(VLOOKUP(Database2[[#This Row],[Leverandør]],Kontaktinfo[],4,FALSE),\"\")","v":""}]
["Midt-NorgeArkitektur6",null,null,null,null,{"$f":"+IFERROR(VLOOKUP(Database2[[#This Row],[Leverandør]],Kontaktinfo[],4,FALSE),\"\")","v":""}]
["Midt-NorgeArkitektur7",null,null,null,null,{"$f":"+IFERROR(VLOOKUP(Database2[[#This Row],[Leverandør]],Kontaktinfo[],4,FALSE),\"\")","v":""}]
["Midt-NorgeArkitektur8",null,null,null,null,{"$f":"+IFERROR(VLOOKUP(Database2[[#This Row],[Leverandør]],Kontaktinfo[],4,FALSE),\"\")","v":""}]
["Midt-NorgeArkitektur9",null,null,null,null,{"$f":"+IFERROR(VLOOKUP(Database2[[#This Row],[Leverandør]],Kontaktinfo[],4,FALSE),\"\")","v":""}]
["Midt-NorgeArkitektur10",null,null,null,null,{"$f":"+IFERROR(VLOOKUP(Database2[[#This Row],[Leverandør]],Kontaktinfo[],4,FALSE),\"\")","v":""}]
["Midt-NorgeArkitektur11",null,null,null,null,{"$f":"+IFERROR(VLOOKUP(Database2[[#This Row],[Leverandør]],Kontaktinfo[],4,FALSE),\"\")","v":""}]
["Midt-NorgeArkitektur12",null,null,null,null,{"$f":"+IFERROR(VLOOKUP(Database2[[#This Row],[Leverandør]],Kontaktinfo[],4,FALSE),\"\")","v":""}]
["Midt-NorgeArkitektur13",null,null,null,null,{"$f":"+IFERROR(VLOOKUP(Database2[[#This Row],[Leverandør]],Kontaktinfo[],4,FALSE),\"\")","v":""}]
["Midt-NorgeArkitektur14",null,null,null,null,{"$f":"+IFERROR(VLOOKUP(Database2[[#This Row],[Leverandør]],Kontaktinfo[],4,FALSE),\"\")","v":""}]
["Midt-NorgeArkitektur15",null,null,null,null,{"$f":"+IFERROR(VLOOKUP(Database2[[#This Row],[Leverandør]],Kontaktinfo[],4,FALSE),\"\")","v":""}]
["Midt-NorgeArkitektur16",null,null,null,null,{"$f":"+IFERROR(VLOOKUP(Database2[[#This Row],[Leverandør]],Kontaktinfo[],4,FALSE),\"\")","v":""}]
["Midt-NorgeArkitektur17",null,null,null,null,{"$f":"+IFERROR(VLOOKUP(Database2[[#This Row],[Leverandør]],Kontaktinfo[],4,FALSE),\"\")","v":""}]
["Midt-NorgeArkitektur18",null,null,null,null,{"$f":"+IFERROR(VLOOKUP(Database2[[#This Row],[Leverandør]],Kontaktinfo[],4,FALSE),\"\")","v":""}]
["Midt-NorgeArkitektur19",null,null,null,null,{"$f":"+IFERROR(VLOOKUP(Database2[[#This Row],[Leverandør]],Kontaktinfo[],4,FALSE),\"\")","v":""}]
["Midt-NorgeArkitektur20",null,null,null,null,{"$f":"+IFERROR(VLOOKUP(Database2[[#This Row],[Leverandør]],Kontaktinfo[],4,FALSE),\"\")","v":""}]
["Midt-NorgeArkitektur21",null,null,null,null,{"$f":"+IFERROR(VLOOKUP(Database2[[#This Row],[Leverandør]],Kontaktinfo[],4,FALSE),\"\")","v":""}]
["Midt-NorgeArkitektur22",null,null,null,null,{"$f":"+IFERROR(VLOOKUP(Database2[[#This Row],[Leverandør]],Kontaktinfo[],4,FALSE),\"\")","v":""}]
["Midt-NorgeArkitektur23",null,null,null,null,{"$f":"+IFERROR(VLOOKUP(Database2[[#This Row],[Leverandør]],Kontaktinfo[],4,FALSE),\"\")","v":""}]
["Midt-NorgeArkitektur24",null,null,null,null,{"$f":"+IFERROR(VLOOKUP(Database2[[#This Row],[Leverandør]],Kontaktinfo[],4,FALSE),\"\")","v":""}]
["Midt-NorgeArkitektur25",null,null,null,null,{"$f":"+IFERROR(VLOOKUP(Database2[[#This Row],[Leverandør]],Kontaktinfo[],4,FALSE),\"\")","v":""}]
["Midt-NorgeArkitektur26",null,null,null,null,{"$f":"+IFERROR(VLOOKUP(Database2[[#This Row],[Leverandør]],Kontaktinfo[],4,FALSE),\"\")","v":""}]
["",null,null,null,null,{"$f":"+IFERROR(VLOOKUP(Database2[[#This Row],[Leverandør]],Kontaktinfo[],4,FALSE),\"\")","v":""}]
["Midt-NorgeInformasjonssikkerhet1",null,null,null,null,{"$f":"+IFERROR(VLOOKUP(Database2[[#This Row],[Leverandør]],Kontaktinfo[],4,FALSE),\"\")","v":""}]
["Midt-NorgeInformasjonssikkerhet2",null,null,null,null,{"$f":"+IFERROR(VLOOKUP(Database2[[#This Row],[Leverandør]],Kontaktinfo[],4,FALSE),\"\")","v":""}]
["Midt-NorgeInformasjonssikkerhet3",null,null,null,null,{"$f":"+IFERROR(VLOOKUP(Database2[[#This Row],[Leverandør]],Kontaktinfo[],4,FALSE),\"\")","v":""}]
["Midt-NorgeInformasjonssikkerhet4",null,null,null,null,{"$f":"+IFERROR(VLOOKUP(Database2[[#This Row],[Leverandør]],Kontaktinfo[],4,FALSE),\"\")","v":""}]
["Midt-NorgeInformasjonssikkerhet5",null,null,null,null,{"$f":"+IFERROR(VLOOKUP(Database2[[#This Row],[Leverandør]],Kontaktinfo[],4,FALSE),\"\")","v":""}]
["Midt-NorgeInformasjonssikkerhet6",null,null,null,null,{"$f":"+IFERROR(VLOOKUP(Database2[[#This Row],[Leverandør]],Kontaktinfo[],4,FALSE),\"\")","v":""}]
["Midt-NorgeInformasjonssikkerhet7",null,null,null,null,{"$f":"+IFERROR(VLOOKUP(Database2[[#This Row],[Leverandør]],Kontaktinfo[],4,FALSE),\"\")","v":""}]
["Midt-NorgeInformasjonssikkerhet8",null,null,null,null,{"$f":"+IFERROR(VLOOKUP(Database2[[#This Row],[Leverandør]],Kontaktinfo[],4,FALSE),\"\")","v":""}]
["Midt-NorgeInformasjonssikkerhet9",null,null,null,null,{"$f":"+IFERROR(VLOOKUP(Database2[[#This Row],[Leverandør]],Kontaktinfo[],4,FALSE),\"\")","v":""}]
["Midt-NorgeInformasjonssikkerhet10",null,null,null,null,{"$f":"+IFERROR(VLOOKUP(Database2[[#This Row],[Leverandør]],Kontaktinfo[],4,FALSE),\"\")","v":""}]
["Midt-NorgeInformasjonssikkerhet11",null,null,null,null,{"$f":"+IFERROR(VLOOKUP(Database2[[#This Row],[Leverandør]],Kontaktinfo[],4,FALSE),\"\")","v":""}]
["Midt-NorgeInformasjonssikkerhet12",null,null,null,null,{"$f":"+IFERROR(VLOOKUP(Database2[[#This Row],[Leverandør]],Kontaktinfo[],4,FALSE),\"\")","v":""}]
["Midt-NorgeInformasjonssikkerhet13",null,null,null,null,{"$f":"+IFERROR(VLOOKUP(Database2[[#This Row],[Leverandør]],Kontaktinfo[],4,FALSE),\"\")","v":""}]
["Midt-NorgeInformasjonssikkerhet14",null,null,null,null,{"$f":"+IFERROR(VLOOKUP(Database2[[#This Row],[Leverandør]],Kontaktinfo[],4,FALSE),\"\")","v":""}]
["Midt-NorgeInformasjonssikkerhet15",null,null,null,null,{"$f":"+IFERROR(VLOOKUP(Database2[[#This Row],[Leverandør]],Kontaktinfo[],4,FALSE),\"\")","v":""}]
["Midt-NorgeInformasjonssikkerhet16",null,null,null,null,{"$f":"+IFERROR(VLOOKUP(Database2[[#This Row],[Leverandør]],Kontaktinfo[],4,FALSE),\"\")","v":""}]
["Midt-NorgeInformasjonssikkerhet17",null,null,null,null,{"$f":"+IFERROR(VLOOKUP(Database2[[#This Row],[Leverandør]],Kontaktinfo[],4,FALSE),\"\")","v":""}]
["Midt-NorgeInformasjonssikkerhet18",null,null,null,null,{"$f":"+IFERROR(VLOOKUP(Database2[[#This Row],[Leverandør]],Kontaktinfo[],4,FALSE),\"\")","v":""}]
["Midt-NorgeInformasjonssikkerhet19",null,null,null,null,{"$f":"+IFERROR(VLOOKUP(Database2[[#This Row],[Leverandør]],Kontaktinfo[],4,FALSE),\"\")","v":""}]
["Midt-NorgeInformasjonssikkerhet20",null,null,null,null,{"$f":"+IFERROR(VLOOKUP(Database2[[#This Row],[Leverandør]],Kontaktinfo[],4,FALSE),\"\")","v":""}]
["Midt-NorgeInformasjonssikkerhet21",null,null,null,null,{"$f":"+IFERROR(VLOOKUP(Database2[[#This Row],[Leverandør]],Kontaktinfo[],4,FALSE),\"\")","v":""}]
["Midt-NorgeInformasjonssikkerhet22",null,null,null,null,{"$f":"+IFERROR(VLOOKUP(Database2[[#This Row],[Leverandør]],Kontaktinfo[],4,FALSE),\"\")","v":""}]
["Midt-NorgeInformasjonssikkerhet23",null,null,null,null,{"$f":"+IFERROR(VLOOKUP(Database2[[#This Row],[Leverandør]],Kontaktinfo[],4,FALSE),\"\")","v":""}]
["Midt-NorgeInformasjonssikkerhet24",null,null,null,null,{"$f":"+IFERROR(VLOOKUP(Database2[[#This Row],[Leverandør]],Kontaktinfo[],4,FALSE),\"\")","v":""}]
["Midt-NorgeInformasjonssikkerhet25",null,null,null,null,{"$f":"+IFERROR(VLOOKUP(Database2[[#This Row],[Leverandør]],Kontaktinfo[],4,FALSE),\"\")","v":""}]
["Midt-NorgeInformasjonssikkerhet26",null,null,null,null,{"$f":"+IFERROR(VLOOKUP(Database2[[#This Row],[Leverandør]],Kontaktinfo[],4,FALSE),\"\")","v":""}]
["",null,null,null,null,{"$f":"+IFERROR(VLOOKUP(Database2[[#This Row],[Leverandør]],Kontaktinfo[],4,FALSE),\"\")","v":""}]
["Midt-NorgeTestledelse og Release-gjennomføring1",null,null,null,null,{"$f":"+IFERROR(VLOOKUP(Database2[[#This Row],[Leverandør]],Kontaktinfo[],4,FALSE),\"\")","v":""}]
["Midt-NorgeTestledelse og Release-gjennomføring2",null,null,null,null,{"$f":"+IFERROR(VLOOKUP(Database2[[#This Row],[Leverandør]],Kontaktinfo[],4,FALSE),\"\")","v":""}]
["Midt-NorgeTestledelse og Release-gjennomføring3",null,null,null,null,{"$f":"+IFERROR(VLOOKUP(Database2[[#This Row],[Leverandør]],Kontaktinfo[],4,FALSE),\"\")","v":""}]
["Midt-NorgeTestledelse og Release-gjennomføring4",null,null,null,null,{"$f":"+IFERROR(VLOOKUP(Database2[[#This Row],[Leverandør]],Kontaktinfo[],4,FALSE),\"\")","v":""}]
["Midt-NorgeTestledelse og Release-gjennomføring5",null,null,null,null,{"$f":"+IFERROR(VLOOKUP(Database2[[#This Row],[Leverandør]],Kontaktinfo[],4,FALSE),\"\")","v":""}]
["Midt-NorgeTestledelse og Release-gjennomføring6",null,null,null,null,{"$f":"+IFERROR(VLOOKUP(Database2[[#This Row],[Leverandør]],Kontaktinfo[],4,FALSE),\"\")","v":""}]
["Midt-NorgeTestledelse og Release-gjennomføring7",null,null,null,null,{"$f":"+IFERROR(VLOOKUP(Database2[[#This Row],[Leverandør]],Kontaktinfo[],4,FALSE),\"\")","v":""}]
["Midt-NorgeTestledelse og Release-gjennomføring8",null,null,null,null,{"$f":"+IFERROR(VLOOKUP(Database2[[#This Row],[Leverandør]],Kontaktinfo[],4,FALSE),\"\")","v":""}]
["Midt-NorgeTestledelse og Release-gjennomføring9",null,null,null,null,{"$f":"+IFERROR(VLOOKUP(Database2[[#This Row],[Leverandør]],Kontaktinfo[],4,FALSE),\"\")","v":""}]
["Midt-NorgeTestledelse og Release-gjennomføring10",null,null,null,null,{"$f":"+IFERROR(VLOOKUP(Database2[[#This Row],[Leverandør]],Kontaktinfo[],4,FALSE),\"\")","v":""}]
["Midt-NorgeTestledelse og Release-gjennomføring11",null,null,null,null,{"$f":"+IFERROR(VLOOKUP(Database2[[#This Row],[Leverandør]],Kontaktinfo[],4,FALSE),\"\")","v":""}]
["Midt-NorgeTestledelse og Release-gjennomføring12",null,null,null,null,{"$f":"+IFERROR(VLOOKUP(Database2[[#This Row],[Leverandør]],Kontaktinfo[],4,FALSE),\"\")","v":""}]
["Midt-NorgeTestledelse og Release-gjennomføring13",null,null,null,null,{"$f":"+IFERROR(VLOOKUP(Database2[[#This Row],[Leverandør]],Kontaktinfo[],4,FALSE),\"\")","v":""}]
["Midt-NorgeTestledelse og Release-gjennomføring14",null,null,null,null,{"$f":"+IFERROR(VLOOKUP(Database2[[#This Row],[Leverandør]],Kontaktinfo[],4,FALSE),\"\")","v":""}]
["Midt-NorgeTestledelse og Release-gjennomføring15",null,null,null,null,{"$f":"+IFERROR(VLOOKUP(Database2[[#This Row],[Leverandør]],Kontaktinfo[],4,FALSE),\"\")","v":""}]
["Midt-NorgeTestledelse og Release-gjennomføring16",null,null,null,null,{"$f":"+IFERROR(VLOOKUP(Database2[[#This Row],[Leverandør]],Kontaktinfo[],4,FALSE),\"\")","v":""}]
["Midt-NorgeTestledelse og Release-gjennomføring17",null,null,null,null,{"$f":"+IFERROR(VLOOKUP(Database2[[#This Row],[Leverandør]],Kontaktinfo[],4,FALSE),\"\")","v":""}]
["Midt-NorgeTestledelse og Release-gjennomføring18",null,null,null,null,{"$f":"+IFERROR(VLOOKUP(Database2[[#This Row],[Leverandør]],Kontaktinfo[],4,FALSE),\"\")","v":""}]
["Midt-NorgeTestledelse og Release-gjennomføring19",null,null,null,null,{"$f":"+IFERROR(VLOOKUP(Database2[[#This Row],[Leverandør]],Kontaktinfo[],4,FALSE),\"\")","v":""}]
["Midt-NorgeTestledelse og Release-gjennomføring20",null,null,null,null,{"$f":"+IFERROR(VLOOKUP(Database2[[#This Row],[Leverandør]],Kontaktinfo[],4,FALSE),\"\")","v":""}]
["Midt-NorgeTestledelse og Release-gjennomføring21",null,null,null,null,{"$f":"+IFERROR(VLOOKUP(Database2[[#This Row],[Leverandør]],Kontaktinfo[],4,FALSE),\"\")","v":""}]
["Midt-NorgeTestledelse og Release-gjennomføring22",null,null,null,null,{"$f":"+IFERROR(VLOOKUP(Database2[[#This Row],[Leverandør]],Kontaktinfo[],4,FALSE),\"\")","v":""}]
["Midt-NorgeTestledelse og Release-gjennomføring23",null,null,null,null,{"$f":"+IFERROR(VLOOKUP(Database2[[#This Row],[Leverandør]],Kontaktinfo[],4,FALSE),\"\")","v":""}]
["Midt-NorgeTestledelse og Release-gjennomføring24",null,null,null,null,{"$f":"+IFERROR(VLOOKUP(Database2[[#This Row],[Leverandør]],Kontaktinfo[],4,FALSE),\"\")","v":""}]
["Midt-NorgeTestledelse og Release-gjennomføring25",null,null,null,null,{"$f":"+IFERROR(VLOOKUP(Database2[[#This Row],[Leverandør]],Kontaktinfo[],4,FALSE),\"\")","v":""}]
["Midt-NorgeTestledelse og Release-gjennomføring26",null,null,null,null,{"$f":"+IFERROR(VLOOKUP(Database2[[#This Row],[Leverandør]],Kontaktinfo[],4,FALSE),\"\")","v":""}]
["",null,null,null,null,{"$f":"+IFERROR(VLOOKUP(Database2[[#This Row],[Leverandør]],Kontaktinfo[],4,FALSE),\"\")","v":""}]
["Midt-NorgeElektronisk samhandling/integrasjoner/systemutvikling1",null,null,null,null,{"$f":"+IFERROR(VLOOKUP(Database2[[#This Row],[Leverandør]],Kontaktinfo[],4,FALSE),\"\")","v":""}]
["Midt-NorgeElektronisk samhandling/integrasjoner/systemutvikling2",null,null,null,null,{"$f":"+IFERROR(VLOOKUP(Database2[[#This Row],[Leverandør]],Kontaktinfo[],4,FALSE),\"\")","v":""}]
["Midt-NorgeElektronisk samhandling/integrasjoner/systemutvikling3",null,null,null,null,{"$f":"+IFERROR(VLOOKUP(Database2[[#This Row],[Leverandør]],Kontaktinfo[],4,FALSE),\"\")","v":""}]
["Midt-NorgeElektronisk samhandling/integrasjoner/systemutvikling4",null,null,null,null,{"$f":"+IFERROR(VLOOKUP(Database2[[#This Row],[Leverandør]],Kontaktinfo[],4,FALSE),\"\")","v":""}]
["Midt-NorgeElektronisk samhandling/integrasjoner/systemutvikling5",null,null,null,null,{"$f":"+IFERROR(VLOOKUP(Database2[[#This Row],[Leverandør]],Kontaktinfo[],4,FALSE),\"\")","v":""}]
["Midt-NorgeElektronisk samhandling/integrasjoner/systemutvikling6",null,null,null,null,{"$f":"+IFERROR(VLOOKUP(Database2[[#This Row],[Leverandør]],Kontaktinfo[],4,FALSE),\"\")","v":""}]
["Midt-NorgeElektronisk samhandling/integrasjoner/systemutvikling7",null,null,null,null,{"$f":"+IFERROR(VLOOKUP(Database2[[#This Row],[Leverandør]],Kontaktinfo[],4,FALSE),\"\")","v":""}]
["Midt-NorgeElektronisk samhandling/integrasjoner/systemutvikling8",null,null,null,null,{"$f":"+IFERROR(VLOOKUP(Database2[[#This Row],[Leverandør]],Kontaktinfo[],4,FALSE),\"\")","v":""}]
["Midt-NorgeElektronisk samhandling/integrasjoner/systemutvikling9",null,null,null,null,{"$f":"+IFERROR(VLOOKUP(Database2[[#This Row],[Leverandør]],Kontaktinfo[],4,FALSE),\"\")","v":""}]
["Midt-NorgeElektronisk samhandling/integrasjoner/systemutvikling10",null,null,null,null,{"$f":"+IFERROR(VLOOKUP(Database2[[#This Row],[Leverandør]],Kontaktinfo[],4,FALSE),\"\")","v":""}]
["Midt-NorgeElektronisk samhandling/integrasjoner/systemutvikling11",null,null,null,null,{"$f":"+IFERROR(VLOOKUP(Database2[[#This Row],[Leverandør]],Kontaktinfo[],4,FALSE),\"\")","v":""}]
["Midt-NorgeElektronisk samhandling/integrasjoner/systemutvikling12",null,null,null,null,{"$f":"+IFERROR(VLOOKUP(Database2[[#This Row],[Leverandør]],Kontaktinfo[],4,FALSE),\"\")","v":""}]
["Midt-NorgeElektronisk samhandling/integrasjoner/systemutvikling13",null,null,null,null,{"$f":"+IFERROR(VLOOKUP(Database2[[#This Row],[Leverandør]],Kontaktinfo[],4,FALSE),\"\")","v":""}]
["Midt-NorgeElektronisk samhandling/integrasjoner/systemutvikling14",null,null,null,null,{"$f":"+IFERROR(VLOOKUP(Database2[[#This Row],[Leverandør]],Kontaktinfo[],4,FALSE),\"\")","v":""}]
["Midt-NorgeElektronisk samhandling/integrasjoner/systemutvikling15",null,null,null,null,{"$f":"+IFERROR(VLOOKUP(Database2[[#This Row],[Leverandør]],Kontaktinfo[],4,FALSE),\"\")","v":""}]
["Midt-NorgeElektronisk samhandling/integrasjoner/systemutvikling16",null,null,null,null,{"$f":"+IFERROR(VLOOKUP(Database2[[#This Row],[Leverandør]],Kontaktinfo[],4,FALSE),\"\")","v":""}]
["Midt-NorgeElektronisk samhandling/integrasjoner/systemutvikling17",null,null,null,null,{"$f":"+IFERROR(VLOOKUP(Database2[[#This Row],[Leverandør]],Kontaktinfo[],4,FALSE),\"\")","v":""}]
["Midt-NorgeElektronisk samhandling/integrasjoner/systemutvikling18",null,null,null,null,{"$f":"+IFERROR(VLOOKUP(Database2[[#This Row],[Leverandør]],Kontaktinfo[],4,FALSE),\"\")","v":""}]
["Midt-NorgeElektronisk samhandling/integrasjoner/systemutvikling19",null,null,null,null,{"$f":"+IFERROR(VLOOKUP(Database2[[#This Row],[Leverandør]],Kontaktinfo[],4,FALSE),\"\")","v":""}]
["Midt-NorgeElektronisk samhandling/integrasjoner/systemutvikling20",null,null,null,null,{"$f":"+IFERROR(VLOOKUP(Database2[[#This Row],[Leverandør]],Kontaktinfo[],4,FALSE),\"\")","v":""}]
["Midt-NorgeElektronisk samhandling/integrasjoner/systemutvikling21",null,null,null,null,{"$f":"+IFERROR(VLOOKUP(Database2[[#This Row],[Leverandør]],Kontaktinfo[],4,FALSE),\"\")","v":""}]
["Midt-NorgeElektronisk samhandling/integrasjoner/systemutvikling22",null,null,null,null,{"$f":"+IFERROR(VLOOKUP(Database2[[#This Row],[Leverandør]],Kontaktinfo[],4,FALSE),\"\")","v":""}]
["Midt-NorgeElektronisk samhandling/integrasjoner/systemutvikling23",null,null,null,null,{"$f":"+IFERROR(VLOOKUP(Database2[[#This Row],[Leverandør]],Kontaktinfo[],4,FALSE),\"\")","v":""}]
["Midt-NorgeElektronisk samhandling/integrasjoner/systemutvikling24",null,null,null,null,{"$f":"+IFERROR(VLOOKUP(Database2[[#This Row],[Leverandør]],Kontaktinfo[],4,FALSE),\"\")","v":""}]
["Midt-NorgeElektronisk samhandling/integrasjoner/systemutvikling25",null,null,null,null,{"$f":"+IFERROR(VLOOKUP(Database2[[#This Row],[Leverandør]],Kontaktinfo[],4,FALSE),\"\")","v":""}]
["Midt-NorgeElektronisk samhandling/integrasjoner/systemutvikling26",null,null,null,null,{"$f":"+IFERROR(VLOOKUP(Database2[[#This Row],[Leverandør]],Kontaktinfo[],4,FALSE),\"\")","v":""}]
["",null,null,null,null,{"$f":"+IFERROR(VLOOKUP(Database2[[#This Row],[Leverandør]],Kontaktinfo[],4,FALSE),\"\")","v":""}]
["Midt-NorgeDrift og Forvaltning av IT-systemer og plattformer1",null,null,null,null,{"$f":"+IFERROR(VLOOKUP(Database2[[#This Row],[Leverandør]],Kontaktinfo[],4,FALSE),\"\")","v":""}]
["Midt-NorgeDrift og Forvaltning av IT-systemer og plattformer2",null,null,null,null,{"$f":"+IFERROR(VLOOKUP(Database2[[#This Row],[Leverandør]],Kontaktinfo[],4,FALSE),\"\")","v":""}]
["Midt-NorgeDrift og Forvaltning av IT-systemer og plattformer3",null,null,null,null,{"$f":"+IFERROR(VLOOKUP(Database2[[#This Row],[Leverandør]],Kontaktinfo[],4,FALSE),\"\")","v":""}]
["Midt-NorgeDrift og Forvaltning av IT-systemer og plattformer4",null,null,null,null,{"$f":"+IFERROR(VLOOKUP(Database2[[#This Row],[Leverandør]],Kontaktinfo[],4,FALSE),\"\")","v":""}]
["Midt-NorgeDrift og Forvaltning av IT-systemer og plattformer5",null,null,null,null,{"$f":"+IFERROR(VLOOKUP(Database2[[#This Row],[Leverandør]],Kontaktinfo[],4,FALSE),\"\")","v":""}]
["Midt-NorgeDrift og Forvaltning av IT-systemer og plattformer6",null,null,null,null,{"$f":"+IFERROR(VLOOKUP(Database2[[#This Row],[Leverandør]],Kontaktinfo[],4,FALSE),\"\")","v":""}]
["Midt-NorgeDrift og Forvaltning av IT-systemer og plattformer7",null,null,null,null,{"$f":"+IFERROR(VLOOKUP(Database2[[#This Row],[Leverandør]],Kontaktinfo[],4,FALSE),\"\")","v":""}]
["Midt-NorgeDrift og Forvaltning av IT-systemer og plattformer8",null,null,null,null,{"$f":"+IFERROR(VLOOKUP(Database2[[#This Row],[Leverandør]],Kontaktinfo[],4,FALSE),\"\")","v":""}]
["Midt-NorgeDrift og Forvaltning av IT-systemer og plattformer9",null,null,null,null,{"$f":"+IFERROR(VLOOKUP(Database2[[#This Row],[Leverandør]],Kontaktinfo[],4,FALSE),\"\")","v":""}]
["Midt-NorgeDrift og Forvaltning av IT-systemer og plattformer10",null,null,null,null,{"$f":"+IFERROR(VLOOKUP(Database2[[#This Row],[Leverandør]],Kontaktinfo[],4,FALSE),\"\")","v":""}]
["Midt-NorgeDrift og Forvaltning av IT-systemer og plattformer11",null,null,null,null,{"$f":"+IFERROR(VLOOKUP(Database2[[#This Row],[Leverandør]],Kontaktinfo[],4,FALSE),\"\")","v":""}]
["Midt-NorgeDrift og Forvaltning av IT-systemer og plattformer12",null,null,null,null,{"$f":"+IFERROR(VLOOKUP(Database2[[#This Row],[Leverandør]],Kontaktinfo[],4,FALSE),\"\")","v":""}]
["Midt-NorgeDrift og Forvaltning av IT-systemer og plattformer13",null,null,null,null,{"$f":"+IFERROR(VLOOKUP(Database2[[#This Row],[Leverandør]],Kontaktinfo[],4,FALSE),\"\")","v":""}]
["Midt-NorgeDrift og Forvaltning av IT-systemer og plattformer14",null,null,null,null,{"$f":"+IFERROR(VLOOKUP(Database2[[#This Row],[Leverandør]],Kontaktinfo[],4,FALSE),\"\")","v":""}]
["Midt-NorgeDrift og Forvaltning av IT-systemer og plattformer15",null,null,null,null,{"$f":"+IFERROR(VLOOKUP(Database2[[#This Row],[Leverandør]],Kontaktinfo[],4,FALSE),\"\")","v":""}]
["Midt-NorgeDrift og Forvaltning av IT-systemer og plattformer16",null,null,null,null,{"$f":"+IFERROR(VLOOKUP(Database2[[#This Row],[Leverandør]],Kontaktinfo[],4,FALSE),\"\")","v":""}]
["Midt-NorgeDrift og Forvaltning av IT-systemer og plattformer17",null,null,null,null,{"$f":"+IFERROR(VLOOKUP(Database2[[#This Row],[Leverandør]],Kontaktinfo[],4,FALSE),\"\")","v":""}]
["Midt-NorgeDrift og Forvaltning av IT-systemer og plattformer18",null,null,null,null,{"$f":"+IFERROR(VLOOKUP(Database2[[#This Row],[Leverandør]],Kontaktinfo[],4,FALSE),\"\")","v":""}]
["Midt-NorgeDrift og Forvaltning av IT-systemer og plattformer19",null,null,null,null,{"$f":"+IFERROR(VLOOKUP(Database2[[#This Row],[Leverandør]],Kontaktinfo[],4,FALSE),\"\")","v":""}]
["Midt-NorgeDrift og Forvaltning av IT-systemer og plattformer20",null,null,null,null,{"$f":"+IFERROR(VLOOKUP(Database2[[#This Row],[Leverandør]],Kontaktinfo[],4,FALSE),\"\")","v":""}]
["Midt-NorgeDrift og Forvaltning av IT-systemer og plattformer21",null,null,null,null,{"$f":"+IFERROR(VLOOKUP(Database2[[#This Row],[Leverandør]],Kontaktinfo[],4,FALSE),\"\")","v":""}]
["Midt-NorgeDrift og Forvaltning av IT-systemer og plattformer22",null,null,null,null,{"$f":"+IFERROR(VLOOKUP(Database2[[#This Row],[Leverandør]],Kontaktinfo[],4,FALSE),\"\")","v":""}]
["Midt-NorgeDrift og Forvaltning av IT-systemer og plattformer23",null,null,null,null,{"$f":"+IFERROR(VLOOKUP(Database2[[#This Row],[Leverandør]],Kontaktinfo[],4,FALSE),\"\")","v":""}]
["Midt-NorgeDrift og Forvaltning av IT-systemer og plattformer24",null,null,null,null,{"$f":"+IFERROR(VLOOKUP(Database2[[#This Row],[Leverandør]],Kontaktinfo[],4,FALSE),\"\")","v":""}]
["Midt-NorgeDrift og Forvaltning av IT-systemer og plattformer25",null,null,null,null,{"$f":"+IFERROR(VLOOKUP(Database2[[#This Row],[Leverandør]],Kontaktinfo[],4,FALSE),\"\")","v":""}]
["Midt-NorgeDrift og Forvaltning av IT-systemer og plattformer26",null,null,null,null,{"$f":"+IFERROR(VLOOKUP(Database2[[#This Row],[Leverandør]],Kontaktinfo[],4,FALSE),\"\")","v":""}]
[null,null,null,null,null,{"$f":"+IFERROR(VLOOKUP(Database2[[#This Row],[Leverandør]],Kontaktinfo[],4,FALSE),\"\")","v":""}]
["Midt-NorgeDatakommunikasjon og Telekommunikasjon1",null,null,null,null,{"$f":"+IFERROR(VLOOKUP(Database2[[#This Row],[Leverandør]],Kontaktinfo[],4,FALSE),\"\")","v":""}]
["Midt-NorgeDatakommunikasjon og Telekommunikasjon2",null,null,null,null,{"$f":"+IFERROR(VLOOKUP(Database2[[#This Row],[Leverandør]],Kontaktinfo[],4,FALSE),\"\")","v":""}]
["Midt-NorgeDatakommunikasjon og Telekommunikasjon3",null,null,null,null,{"$f":"+IFERROR(VLOOKUP(Database2[[#This Row],[Leverandør]],Kontaktinfo[],4,FALSE),\"\")","v":""}]
["Midt-NorgeDatakommunikasjon og Telekommunikasjon4",null,null,null,null,{"$f":"+IFERROR(VLOOKUP(Database2[[#This Row],[Leverandør]],Kontaktinfo[],4,FALSE),\"\")","v":""}]
["Midt-NorgeDatakommunikasjon og Telekommunikasjon5",null,null,null,null,{"$f":"+IFERROR(VLOOKUP(Database2[[#This Row],[Leverandør]],Kontaktinfo[],4,FALSE),\"\")","v":""}]
["Midt-NorgeDatakommunikasjon og Telekommunikasjon6",null,null,null,null,{"$f":"+IFERROR(VLOOKUP(Database2[[#This Row],[Leverandør]],Kontaktinfo[],4,FALSE),\"\")","v":""}]
["Midt-NorgeDatakommunikasjon og Telekommunikasjon7",null,null,null,null,{"$f":"+IFERROR(VLOOKUP(Database2[[#This Row],[Leverandør]],Kontaktinfo[],4,FALSE),\"\")","v":""}]
["Midt-NorgeDatakommunikasjon og Telekommunikasjon8",null,null,null,null,{"$f":"+IFERROR(VLOOKUP(Database2[[#This Row],[Leverandør]],Kontaktinfo[],4,FALSE),\"\")","v":""}]
["Midt-NorgeDatakommunikasjon og Telekommunikasjon9",null,null,null,null,{"$f":"+IFERROR(VLOOKUP(Database2[[#This Row],[Leverandør]],Kontaktinfo[],4,FALSE),\"\")","v":""}]
["Midt-NorgeDatakommunikasjon og Telekommunikasjon10",null,null,null,null,{"$f":"+IFERROR(VLOOKUP(Database2[[#This Row],[Leverandør]],Kontaktinfo[],4,FALSE),\"\")","v":""}]
["Midt-NorgeDatakommunikasjon og Telekommunikasjon11",null,null,null,null,{"$f":"+IFERROR(VLOOKUP(Database2[[#This Row],[Leverandør]],Kontaktinfo[],4,FALSE),\"\")","v":""}]
["Midt-NorgeDatakommunikasjon og Telekommunikasjon12",null,null,null,null,{"$f":"+IFERROR(VLOOKUP(Database2[[#This Row],[Leverandør]],Kontaktinfo[],4,FALSE),\"\")","v":""}]
["Midt-NorgeDatakommunikasjon og Telekommunikasjon13",null,null,null,null,{"$f":"+IFERROR(VLOOKUP(Database2[[#This Row],[Leverandør]],Kontaktinfo[],4,FALSE),\"\")","v":""}]
["Midt-NorgeDatakommunikasjon og Telekommunikasjon14",null,null,null,null,{"$f":"+IFERROR(VLOOKUP(Database2[[#This Row],[Leverandør]],Kontaktinfo[],4,FALSE),\"\")","v":""}]
["Midt-NorgeDatakommunikasjon og Telekommunikasjon15",null,null,null,null,{"$f":"+IFERROR(VLOOKUP(Database2[[#This Row],[Leverandør]],Kontaktinfo[],4,FALSE),\"\")","v":""}]
["Midt-NorgeDatakommunikasjon og Telekommunikasjon16",null,null,null,null,{"$f":"+IFERROR(VLOOKUP(Database2[[#This Row],[Leverandør]],Kontaktinfo[],4,FALSE),\"\")","v":""}]
["Midt-NorgeDatakommunikasjon og Telekommunikasjon17",null,null,null,null,{"$f":"+IFERROR(VLOOKUP(Database2[[#This Row],[Leverandør]],Kontaktinfo[],4,FALSE),\"\")","v":""}]
["Midt-NorgeDatakommunikasjon og Telekommunikasjon18",null,null,null,null,{"$f":"+IFERROR(VLOOKUP(Database2[[#This Row],[Leverandør]],Kontaktinfo[],4,FALSE),\"\")","v":""}]
["Midt-NorgeDatakommunikasjon og Telekommunikasjon19",null,null,null,null,{"$f":"+IFERROR(VLOOKUP(Database2[[#This Row],[Leverandør]],Kontaktinfo[],4,FALSE),\"\")","v":""}]
["Midt-NorgeDatakommunikasjon og Telekommunikasjon20",null,null,null,null,{"$f":"+IFERROR(VLOOKUP(Database2[[#This Row],[Leverandør]],Kontaktinfo[],4,FALSE),\"\")","v":""}]
["Midt-NorgeDatakommunikasjon og Telekommunikasjon21",null,null,null,null,{"$f":"+IFERROR(VLOOKUP(Database2[[#This Row],[Leverandør]],Kontaktinfo[],4,FALSE),\"\")","v":""}]
["Midt-NorgeDatakommunikasjon og Telekommunikasjon22",null,null,null,null,{"$f":"+IFERROR(VLOOKUP(Database2[[#This Row],[Leverandør]],Kontaktinfo[],4,FALSE),\"\")","v":""}]
["Midt-NorgeDatakommunikasjon og Telekommunikasjon23",null,null,null,null,{"$f":"+IFERROR(VLOOKUP(Database2[[#This Row],[Leverandør]],Kontaktinfo[],4,FALSE),\"\")","v":""}]
["Midt-NorgeDatakommunikasjon og Telekommunikasjon24",null,null,null,null,{"$f":"+IFERROR(VLOOKUP(Database2[[#This Row],[Leverandør]],Kontaktinfo[],4,FALSE),\"\")","v":""}]
["Midt-NorgeDatakommunikasjon og Telekommunikasjon25",null,null,null,null,{"$f":"+IFERROR(VLOOKUP(Database2[[#This Row],[Leverandør]],Kontaktinfo[],4,FALSE),\"\")","v":""}]
["Midt-NorgeDatakommunikasjon og Telekommunikasjon26",null,null,null,null,{"$f":"+IFERROR(VLOOKUP(Database2[[#This Row],[Leverandør]],Kontaktinfo[],4,FALSE),\"\")","v":""}]
["",null,null,null,null,{"$f":"+IFERROR(VLOOKUP(Database2[[#This Row],[Leverandør]],Kontaktinfo[],4,FALSE),\"\")","v":""}]
["Midt-NorgeApplikasjonsforvaltning1",null,null,null,null,{"$f":"+IFERROR(VLOOKUP(Database2[[#This Row],[Leverandør]],Kontaktinfo[],4,FALSE),\"\")","v":""}]
["Midt-NorgeApplikasjonsforvaltning2",null,null,null,null,{"$f":"+IFERROR(VLOOKUP(Database2[[#This Row],[Leverandør]],Kontaktinfo[],4,FALSE),\"\")","v":""}]
["Midt-NorgeApplikasjonsforvaltning3",null,null,null,null,{"$f":"+IFERROR(VLOOKUP(Database2[[#This Row],[Leverandør]],Kontaktinfo[],4,FALSE),\"\")","v":""}]
["Midt-NorgeApplikasjonsforvaltning4",null,null,null,null,{"$f":"+IFERROR(VLOOKUP(Database2[[#This Row],[Leverandør]],Kontaktinfo[],4,FALSE),\"\")","v":""}]
["Midt-NorgeApplikasjonsforvaltning5",null,null,null,null,{"$f":"+IFERROR(VLOOKUP(Database2[[#This Row],[Leverandør]],Kontaktinfo[],4,FALSE),\"\")","v":""}]
["Midt-NorgeApplikasjonsforvaltning6",null,null,null,null,{"$f":"+IFERROR(VLOOKUP(Database2[[#This Row],[Leverandør]],Kontaktinfo[],4,FALSE),\"\")","v":""}]
["Midt-NorgeApplikasjonsforvaltning7",null,null,null,null,{"$f":"+IFERROR(VLOOKUP(Database2[[#This Row],[Leverandør]],Kontaktinfo[],4,FALSE),\"\")","v":""}]
["Midt-NorgeApplikasjonsforvaltning8",null,null,null,null,{"$f":"+IFERROR(VLOOKUP(Database2[[#This Row],[Leverandør]],Kontaktinfo[],4,FALSE),\"\")","v":""}]
["Midt-NorgeApplikasjonsforvaltning9",null,null,null,null,{"$f":"+IFERROR(VLOOKUP(Database2[[#This Row],[Leverandør]],Kontaktinfo[],4,FALSE),\"\")","v":""}]
["Midt-NorgeApplikasjonsforvaltning10",null,null,null,null,{"$f":"+IFERROR(VLOOKUP(Database2[[#This Row],[Leverandør]],Kontaktinfo[],4,FALSE),\"\")","v":""}]
["Midt-NorgeApplikasjonsforvaltning11",null,null,null,null,{"$f":"+IFERROR(VLOOKUP(Database2[[#This Row],[Leverandør]],Kontaktinfo[],4,FALSE),\"\")","v":""}]
["Midt-NorgeApplikasjonsforvaltning12",null,null,null,null,{"$f":"+IFERROR(VLOOKUP(Database2[[#This Row],[Leverandør]],Kontaktinfo[],4,FALSE),\"\")","v":""}]
["Midt-NorgeApplikasjonsforvaltning13",null,null,null,null,{"$f":"+IFERROR(VLOOKUP(Database2[[#This Row],[Leverandør]],Kontaktinfo[],4,FALSE),\"\")","v":""}]
["Midt-NorgeApplikasjonsforvaltning14",null,null,null,null,{"$f":"+IFERROR(VLOOKUP(Database2[[#This Row],[Leverandør]],Kontaktinfo[],4,FALSE),\"\")","v":""}]
["Midt-NorgeApplikasjonsforvaltning15",null,null,null,null,{"$f":"+IFERROR(VLOOKUP(Database2[[#This Row],[Leverandør]],Kontaktinfo[],4,FALSE),\"\")","v":""}]
["Midt-NorgeApplikasjonsforvaltning16",null,null,null,null,{"$f":"+IFERROR(VLOOKUP(Database2[[#This Row],[Leverandør]],Kontaktinfo[],4,FALSE),\"\")","v":""}]
["Midt-NorgeApplikasjonsforvaltning17",null,null,null,null,{"$f":"+IFERROR(VLOOKUP(Database2[[#This Row],[Leverandør]],Kontaktinfo[],4,FALSE),\"\")","v":""}]
["Midt-NorgeApplikasjonsforvaltning18",null,null,null,null,{"$f":"+IFERROR(VLOOKUP(Database2[[#This Row],[Leverandør]],Kontaktinfo[],4,FALSE),\"\")","v":""}]
["Midt-NorgeApplikasjonsforvaltning19",null,null,null,null,{"$f":"+IFERROR(VLOOKUP(Database2[[#This Row],[Leverandør]],Kontaktinfo[],4,FALSE),\"\")","v":""}]
["Midt-NorgeApplikasjonsforvaltning20",null,null,null,null,{"$f":"+IFERROR(VLOOKUP(Database2[[#This Row],[Leverandør]],Kontaktinfo[],4,FALSE),\"\")","v":""}]
["Midt-NorgeApplikasjonsforvaltning21",null,null,null,null,{"$f":"+IFERROR(VLOOKUP(Database2[[#This Row],[Leverandør]],Kontaktinfo[],4,FALSE),\"\")","v":""}]
["Midt-NorgeApplikasjonsforvaltning22",null,null,null,null,{"$f":"+IFERROR(VLOOKUP(Database2[[#This Row],[Leverandør]],Kontaktinfo[],4,FALSE),\"\")","v":""}]
["Midt-NorgeApplikasjonsforvaltning23",null,null,null,null,{"$f":"+IFERROR(VLOOKUP(Database2[[#This Row],[Leverandør]],Kontaktinfo[],4,FALSE),\"\")","v":""}]
["Midt-NorgeApplikasjonsforvaltning24",null,null,null,null,{"$f":"+IFERROR(VLOOKUP(Database2[[#This Row],[Leverandør]],Kontaktinfo[],4,FALSE),\"\")","v":""}]
["Midt-NorgeApplikasjonsforvaltning25",null,null,null,null,{"$f":"+IFERROR(VLOOKUP(Database2[[#This Row],[Leverandør]],Kontaktinfo[],4,FALSE),\"\")","v":""}]
["Midt-NorgeApplikasjonsforvaltning26",null,null,null,null,{"$f":"+IFERROR(VLOOKUP(Database2[[#This Row],[Leverandør]],Kontaktinfo[],4,FALSE),\"\")","v":""}]
[null,null,null,null,null,{"$f":"+IFERROR(VLOOKUP(Database2[[#This Row],[Leverandør]],Kontaktinfo[],4,FALSE),\"\")","v":""}]
["Midt-NorgeKlientplattform1",null,null,null,null,{"$f":"+IFERROR(VLOOKUP(Database2[[#This Row],[Leverandør]],Kontaktinfo[],4,FALSE),\"\")","v":""}]
["Midt-NorgeKlientplattform2",null,null,null,null,{"$f":"+IFERROR(VLOOKUP(Database2[[#This Row],[Leverandør]],Kontaktinfo[],4,FALSE),\"\")","v":""}]
["Midt-NorgeKlientplattform3",null,null,null,null,{"$f":"+IFERROR(VLOOKUP(Database2[[#This Row],[Leverandør]],Kontaktinfo[],4,FALSE),\"\")","v":""}]
["Midt-NorgeKlientplattform4",null,null,null,null,{"$f":"+IFERROR(VLOOKUP(Database2[[#This Row],[Leverandør]],Kontaktinfo[],4,FALSE),\"\")","v":""}]
["Midt-NorgeKlientplattform5",null,null,null,null,{"$f":"+IFERROR(VLOOKUP(Database2[[#This Row],[Leverandør]],Kontaktinfo[],4,FALSE),\"\")","v":""}]
["Midt-NorgeKlientplattform6",null,null,null,null,{"$f":"+IFERROR(VLOOKUP(Database2[[#This Row],[Leverandør]],Kontaktinfo[],4,FALSE),\"\")","v":""}]
["Midt-NorgeKlientplattform7",null,null,null,null,{"$f":"+IFERROR(VLOOKUP(Database2[[#This Row],[Leverandør]],Kontaktinfo[],4,FALSE),\"\")","v":""}]
["Midt-NorgeKlientplattform8",null,null,null,null,{"$f":"+IFERROR(VLOOKUP(Database2[[#This Row],[Leverandør]],Kontaktinfo[],4,FALSE),\"\")","v":""}]
["Midt-NorgeKlientplattform9",null,null,null,null,{"$f":"+IFERROR(VLOOKUP(Database2[[#This Row],[Leverandør]],Kontaktinfo[],4,FALSE),\"\")","v":""}]
["Midt-NorgeKlientplattform10",null,null,null,null,{"$f":"+IFERROR(VLOOKUP(Database2[[#This Row],[Leverandør]],Kontaktinfo[],4,FALSE),\"\")","v":""}]
["Midt-NorgeKlientplattform11",null,null,null,null,{"$f":"+IFERROR(VLOOKUP(Database2[[#This Row],[Leverandør]],Kontaktinfo[],4,FALSE),\"\")","v":""}]
["Midt-NorgeKlientplattform12",null,null,null,null,{"$f":"+IFERROR(VLOOKUP(Database2[[#This Row],[Leverandør]],Kontaktinfo[],4,FALSE),\"\")","v":""}]
["Midt-NorgeKlientplattform13",null,null,null,null,{"$f":"+IFERROR(VLOOKUP(Database2[[#This Row],[Leverandør]],Kontaktinfo[],4,FALSE),\"\")","v":""}]
["Midt-NorgeKlientplattform14",null,null,null,null,{"$f":"+IFERROR(VLOOKUP(Database2[[#This Row],[Leverandør]],Kontaktinfo[],4,FALSE),\"\")","v":""}]
["Midt-NorgeKlientplattform15",null,null,null,null,{"$f":"+IFERROR(VLOOKUP(Database2[[#This Row],[Leverandør]],Kontaktinfo[],4,FALSE),\"\")","v":""}]
["Midt-NorgeKlientplattform16",null,null,null,null,{"$f":"+IFERROR(VLOOKUP(Database2[[#This Row],[Leverandør]],Kontaktinfo[],4,FALSE),\"\")","v":""}]
["Midt-NorgeKlientplattform17",null,null,null,null,{"$f":"+IFERROR(VLOOKUP(Database2[[#This Row],[Leverandør]],Kontaktinfo[],4,FALSE),\"\")","v":""}]
["Midt-NorgeKlientplattform18",null,null,null,null,{"$f":"+IFERROR(VLOOKUP(Database2[[#This Row],[Leverandør]],Kontaktinfo[],4,FALSE),\"\")","v":""}]
["Midt-NorgeKlientplattform19",null,null,null,null,{"$f":"+IFERROR(VLOOKUP(Database2[[#This Row],[Leverandør]],Kontaktinfo[],4,FALSE),\"\")","v":""}]
["Midt-NorgeKlientplattform20",null,null,null,null,{"$f":"+IFERROR(VLOOKUP(Database2[[#This Row],[Leverandør]],Kontaktinfo[],4,FALSE),\"\")","v":""}]
["Midt-NorgeKlientplattform21",null,null,null,null,{"$f":"+IFERROR(VLOOKUP(Database2[[#This Row],[Leverandør]],Kontaktinfo[],4,FALSE),\"\")","v":""}]
["Midt-NorgeKlientplattform22",null,null,null,null,{"$f":"+IFERROR(VLOOKUP(Database2[[#This Row],[Leverandør]],Kontaktinfo[],4,FALSE),\"\")","v":""}]
["Midt-NorgeKlientplattform23",null,null,null,null,{"$f":"+IFERROR(VLOOKUP(Database2[[#This Row],[Leverandør]],Kontaktinfo[],4,FALSE),\"\")","v":""}]
["Midt-NorgeKlientplattform24",null,null,null,null,{"$f":"+IFERROR(VLOOKUP(Database2[[#This Row],[Leverandør]],Kontaktinfo[],4,FALSE),\"\")","v":""}]
["Midt-NorgeKlientplattform25",null,null,null,null,{"$f":"+IFERROR(VLOOKUP(Database2[[#This Row],[Leverandør]],Kontaktinfo[],4,FALSE),\"\")","v":""}]
["Midt-NorgeKlientplattform26",null,null,null,null,{"$f":"+IFERROR(VLOOKUP(Database2[[#This Row],[Leverandør]],Kontaktinfo[],4,FALSE),\"\")","v":""}]
[null,null,null,null,null,{"$f":"+IFERROR(VLOOKUP(Database2[[#This Row],[Leverandør]],Kontaktinfo[],4,FALSE),\"\")","v":""}]
["VestProgram og Prosjektgjennomføring1",null,null,null,null,{"$f":"+IFERROR(VLOOKUP(Database2[[#This Row],[Leverandør]],Kontaktinfo[],4,FALSE),\"\")","v":""}]
["VestProgram og Prosjektgjennomføring2",null,null,null,null,{"$f":"+IFERROR(VLOOKUP(Database2[[#This Row],[Leverandør]],Kontaktinfo[],4,FALSE),\"\")","v":""}]
["VestProgram og Prosjektgjennomføring3",null,null,null,null,{"$f":"+IFERROR(VLOOKUP(Database2[[#This Row],[Leverandør]],Kontaktinfo[],4,FALSE),\"\")","v":""}]
["VestProgram og Prosjektgjennomføring4",null,null,null,null,{"$f":"+IFERROR(VLOOKUP(Database2[[#This Row],[Leverandør]],Kontaktinfo[],4,FALSE),\"\")","v":""}]
["VestProgram og Prosjektgjennomføring5",null,null,null,null,{"$f":"+IFERROR(VLOOKUP(Database2[[#This Row],[Leverandør]],Kontaktinfo[],4,FALSE),\"\")","v":""}]
["VestProgram og Prosjektgjennomføring6",null,null,null,null,{"$f":"+IFERROR(VLOOKUP(Database2[[#This Row],[Leverandør]],Kontaktinfo[],4,FALSE),\"\")","v":""}]
["VestProgram og Prosjektgjennomføring7",null,null,null,null,{"$f":"+IFERROR(VLOOKUP(Database2[[#This Row],[Leverandør]],Kontaktinfo[],4,FALSE),\"\")","v":""}]
["VestProgram og Prosjektgjennomføring8",null,null,null,null,{"$f":"+IFERROR(VLOOKUP(Database2[[#This Row],[Leverandør]],Kontaktinfo[],4,FALSE),\"\")","v":""}]
["VestProgram og Prosjektgjennomføring9",null,null,null,null,{"$f":"+IFERROR(VLOOKUP(Database2[[#This Row],[Leverandør]],Kontaktinfo[],4,FALSE),\"\")","v":""}]
["VestProgram og Prosjektgjennomføring10",null,null,null,null,{"$f":"+IFERROR(VLOOKUP(Database2[[#This Row],[Leverandør]],Kontaktinfo[],4,FALSE),\"\")","v":""}]
["VestProgram og Prosjektgjennomføring11",null,null,null,null,{"$f":"+IFERROR(VLOOKUP(Database2[[#This Row],[Leverandør]],Kontaktinfo[],4,FALSE),\"\")","v":""}]
["VestProgram og Prosjektgjennomføring12",null,null,null,null,{"$f":"+IFERROR(VLOOKUP(Database2[[#This Row],[Leverandør]],Kontaktinfo[],4,FALSE),\"\")","v":""}]
["VestProgram og Prosjektgjennomføring13",null,null,null,null,{"$f":"+IFERROR(VLOOKUP(Database2[[#This Row],[Leverandør]],Kontaktinfo[],4,FALSE),\"\")","v":""}]
["VestProgram og Prosjektgjennomføring14",null,null,null,null,{"$f":"+IFERROR(VLOOKUP(Database2[[#This Row],[Leverandør]],Kontaktinfo[],4,FALSE),\"\")","v":""}]
["VestProgram og Prosjektgjennomføring15",null,null,null,null,{"$f":"+IFERROR(VLOOKUP(Database2[[#This Row],[Leverandør]],Kontaktinfo[],4,FALSE),\"\")","v":""}]
["VestProgram og Prosjektgjennomføring16",null,null,null,null,{"$f":"+IFERROR(VLOOKUP(Database2[[#This Row],[Leverandør]],Kontaktinfo[],4,FALSE),\"\")","v":""}]
["VestProgram og Prosjektgjennomføring17",null,null,null,null,{"$f":"+IFERROR(VLOOKUP(Database2[[#This Row],[Leverandør]],Kontaktinfo[],4,FALSE),\"\")","v":""}]
["VestProgram og Prosjektgjennomføring18",null,null,null,null,{"$f":"+IFERROR(VLOOKUP(Database2[[#This Row],[Leverandør]],Kontaktinfo[],4,FALSE),\"\")","v":""}]
["VestProgram og Prosjektgjennomføring19",null,null,null,null,{"$f":"+IFERROR(VLOOKUP(Database2[[#This Row],[Leverandør]],Kontaktinfo[],4,FALSE),\"\")","v":""}]
["VestProgram og Prosjektgjennomføring20",null,null,null,null,{"$f":"+IFERROR(VLOOKUP(Database2[[#This Row],[Leverandør]],Kontaktinfo[],4,FALSE),\"\")","v":""}]
["VestProgram og Prosjektgjennomføring21",null,null,null,null,{"$f":"+IFERROR(VLOOKUP(Database2[[#This Row],[Leverandør]],Kontaktinfo[],4,FALSE),\"\")","v":""}]
["VestProgram og Prosjektgjennomføring22",null,null,null,null,{"$f":"+IFERROR(VLOOKUP(Database2[[#This Row],[Leverandør]],Kontaktinfo[],4,FALSE),\"\")","v":""}]
["VestProgram og Prosjektgjennomføring23",null,null,null,null,{"$f":"+IFERROR(VLOOKUP(Database2[[#This Row],[Leverandør]],Kontaktinfo[],4,FALSE),\"\")","v":""}]
["VestProgram og Prosjektgjennomføring24",null,null,null,null,{"$f":"+IFERROR(VLOOKUP(Database2[[#This Row],[Leverandør]],Kontaktinfo[],4,FALSE),\"\")","v":""}]
["VestProgram og Prosjektgjennomføring25",null,null,null,null,{"$f":"+IFERROR(VLOOKUP(Database2[[#This Row],[Leverandør]],Kontaktinfo[],4,FALSE),\"\")","v":""}]
["VestProgram og Prosjektgjennomføring26",null,null,null,null,{"$f":"+IFERROR(VLOOKUP(Database2[[#This Row],[Leverandør]],Kontaktinfo[],4,FALSE),\"\")","v":""}]
["VestProgram og Prosjektgjennomføring27",null,null,null,null,{"$f":"+IFERROR(VLOOKUP(Database2[[#This Row],[Leverandør]],Kontaktinfo[],4,FALSE),\"\")","v":""}]
["VestProgram og Prosjektgjennomføring28",null,null,null,null,{"$f":"+IFERROR(VLOOKUP(Database2[[#This Row],[Leverandør]],Kontaktinfo[],4,FALSE),\"\")","v":""}]
["VestProgram og Prosjektgjennomføring29",null,null,null,null,{"$f":"+IFERROR(VLOOKUP(Database2[[#This Row],[Leverandør]],Kontaktinfo[],4,FALSE),\"\")","v":""}]
["VestProgram og Prosjektgjennomføring30",null,null,null,null,{"$f":"+IFERROR(VLOOKUP(Database2[[#This Row],[Leverandør]],Kontaktinfo[],4,FALSE),\"\")","v":""}]
[null,null,null,null,null,{"$f":"+IFERROR(VLOOKUP(Database2[[#This Row],[Leverandør]],Kontaktinfo[],4,FALSE),\"\")","v":""}]
["VestStrategiplanlegging, rådgivning og innovasjon1",null,null,null,null,{"$f":"+IFERROR(VLOOKUP(Database2[[#This Row],[Leverandør]],Kontaktinfo[],4,FALSE),\"\")","v":""}]
["VestStrategiplanlegging, rådgivning og innovasjon2",null,null,null,null,{"$f":"+IFERROR(VLOOKUP(Database2[[#This Row],[Leverandør]],Kontaktinfo[],4,FALSE),\"\")","v":""}]
["VestStrategiplanlegging, rådgivning og innovasjon3",null,null,null,null,{"$f":"+IFERROR(VLOOKUP(Database2[[#This Row],[Leverandør]],Kontaktinfo[],4,FALSE),\"\")","v":""}]
["VestStrategiplanlegging, rådgivning og innovasjon4",null,null,null,null,{"$f":"+IFERROR(VLOOKUP(Database2[[#This Row],[Leverandør]],Kontaktinfo[],4,FALSE),\"\")","v":""}]
["VestStrategiplanlegging, rådgivning og innovasjon5",null,null,null,null,{"$f":"+IFERROR(VLOOKUP(Database2[[#This Row],[Leverandør]],Kontaktinfo[],4,FALSE),\"\")","v":""}]
["VestStrategiplanlegging, rådgivning og innovasjon6",null,null,null,null,{"$f":"+IFERROR(VLOOKUP(Database2[[#This Row],[Leverandør]],Kontaktinfo[],4,FALSE),\"\")","v":""}]
["VestStrategiplanlegging, rådgivning og innovasjon7",null,null,null,null,{"$f":"+IFERROR(VLOOKUP(Database2[[#This Row],[Leverandør]],Kontaktinfo[],4,FALSE),\"\")","v":""}]
["VestStrategiplanlegging, rådgivning og innovasjon8",null,null,null,null,{"$f":"+IFERROR(VLOOKUP(Database2[[#This Row],[Leverandør]],Kontaktinfo[],4,FALSE),\"\")","v":""}]
["VestStrategiplanlegging, rådgivning og innovasjon9",null,null,null,null,{"$f":"+IFERROR(VLOOKUP(Database2[[#This Row],[Leverandør]],Kontaktinfo[],4,FALSE),\"\")","v":""}]
["VestStrategiplanlegging, rådgivning og innovasjon10",null,null,null,null,{"$f":"+IFERROR(VLOOKUP(Database2[[#This Row],[Leverandør]],Kontaktinfo[],4,FALSE),\"\")","v":""}]
["VestStrategiplanlegging, rådgivning og innovasjon11",null,null,null,null,{"$f":"+IFERROR(VLOOKUP(Database2[[#This Row],[Leverandør]],Kontaktinfo[],4,FALSE),\"\")","v":""}]
["VestStrategiplanlegging, rådgivning og innovasjon12",null,null,null,null,{"$f":"+IFERROR(VLOOKUP(Database2[[#This Row],[Leverandør]],Kontaktinfo[],4,FALSE),\"\")","v":""}]
["VestStrategiplanlegging, rådgivning og innovasjon13",null,null,null,null,{"$f":"+IFERROR(VLOOKUP(Database2[[#This Row],[Leverandør]],Kontaktinfo[],4,FALSE),\"\")","v":""}]
["VestStrategiplanlegging, rådgivning og innovasjon14",null,null,null,null,{"$f":"+IFERROR(VLOOKUP(Database2[[#This Row],[Leverandør]],Kontaktinfo[],4,FALSE),\"\")","v":""}]
["VestStrategiplanlegging, rådgivning og innovasjon15",null,null,null,null,{"$f":"+IFERROR(VLOOKUP(Database2[[#This Row],[Leverandør]],Kontaktinfo[],4,FALSE),\"\")","v":""}]
["VestStrategiplanlegging, rådgivning og innovasjon16",null,null,null,null,{"$f":"+IFERROR(VLOOKUP(Database2[[#This Row],[Leverandør]],Kontaktinfo[],4,FALSE),\"\")","v":""}]
["VestStrategiplanlegging, rådgivning og innovasjon17",null,null,null,null,{"$f":"+IFERROR(VLOOKUP(Database2[[#This Row],[Leverandør]],Kontaktinfo[],4,FALSE),\"\")","v":""}]
["VestStrategiplanlegging, rådgivning og innovasjon18",null,null,null,null,{"$f":"+IFERROR(VLOOKUP(Database2[[#This Row],[Leverandør]],Kontaktinfo[],4,FALSE),\"\")","v":""}]
["VestStrategiplanlegging, rådgivning og innovasjon19",null,null,null,null,{"$f":"+IFERROR(VLOOKUP(Database2[[#This Row],[Leverandør]],Kontaktinfo[],4,FALSE),\"\")","v":""}]
["VestStrategiplanlegging, rådgivning og innovasjon20",null,null,null,null,{"$f":"+IFERROR(VLOOKUP(Database2[[#This Row],[Leverandør]],Kontaktinfo[],4,FALSE),\"\")","v":""}]
["VestStrategiplanlegging, rådgivning og innovasjon21",null,null,null,null,{"$f":"+IFERROR(VLOOKUP(Database2[[#This Row],[Leverandør]],Kontaktinfo[],4,FALSE),\"\")","v":""}]
["VestStrategiplanlegging, rådgivning og innovasjon22",null,null,null,null,{"$f":"+IFERROR(VLOOKUP(Database2[[#This Row],[Leverandør]],Kontaktinfo[],4,FALSE),\"\")","v":""}]
["VestStrategiplanlegging, rådgivning og innovasjon23",null,null,null,null,{"$f":"+IFERROR(VLOOKUP(Database2[[#This Row],[Leverandør]],Kontaktinfo[],4,FALSE),\"\")","v":""}]
["VestStrategiplanlegging, rådgivning og innovasjon24",null,null,null,null,{"$f":"+IFERROR(VLOOKUP(Database2[[#This Row],[Leverandør]],Kontaktinfo[],4,FALSE),\"\")","v":""}]
["VestStrategiplanlegging, rådgivning og innovasjon25",null,null,null,null,{"$f":"+IFERROR(VLOOKUP(Database2[[#This Row],[Leverandør]],Kontaktinfo[],4,FALSE),\"\")","v":""}]
["VestStrategiplanlegging, rådgivning og innovasjon26",null,null,null,null,{"$f":"+IFERROR(VLOOKUP(Database2[[#This Row],[Leverandør]],Kontaktinfo[],4,FALSE),\"\")","v":""}]
[null,null,null,null,null,{"$f":"+IFERROR(VLOOKUP(Database2[[#This Row],[Leverandør]],Kontaktinfo[],4,FALSE),\"\")","v":""}]
["VestArkitektur1",null,null,null,null,{"$f":"+IFERROR(VLOOKUP(Database2[[#This Row],[Leverandør]],Kontaktinfo[],4,FALSE),\"\")","v":""}]
["VestArkitektur2",null,null,null,null,{"$f":"+IFERROR(VLOOKUP(Database2[[#This Row],[Leverandør]],Kontaktinfo[],4,FALSE),\"\")","v":""}]
["VestArkitektur3",null,null,null,null,{"$f":"+IFERROR(VLOOKUP(Database2[[#This Row],[Leverandør]],Kontaktinfo[],4,FALSE),\"\")","v":""}]
["VestArkitektur4",null,null,null,null,{"$f":"+IFERROR(VLOOKUP(Database2[[#This Row],[Leverandør]],Kontaktinfo[],4,FALSE),\"\")","v":""}]
["VestArkitektur5",null,null,null,null,{"$f":"+IFERROR(VLOOKUP(Database2[[#This Row],[Leverandør]],Kontaktinfo[],4,FALSE),\"\")","v":""}]
["VestArkitektur6",null,null,null,null,{"$f":"+IFERROR(VLOOKUP(Database2[[#This Row],[Leverandør]],Kontaktinfo[],4,FALSE),\"\")","v":""}]
["VestArkitektur7",null,null,null,null,{"$f":"+IFERROR(VLOOKUP(Database2[[#This Row],[Leverandør]],Kontaktinfo[],4,FALSE),\"\")","v":""}]
["VestArkitektur8",null,null,null,null,{"$f":"+IFERROR(VLOOKUP(Database2[[#This Row],[Leverandør]],Kontaktinfo[],4,FALSE),\"\")","v":""}]
["VestArkitektur9",null,null,null,null,{"$f":"+IFERROR(VLOOKUP(Database2[[#This Row],[Leverandør]],Kontaktinfo[],4,FALSE),\"\")","v":""}]
["VestArkitektur10",null,null,null,null,{"$f":"+IFERROR(VLOOKUP(Database2[[#This Row],[Leverandør]],Kontaktinfo[],4,FALSE),\"\")","v":""}]
["VestArkitektur11",null,null,null,null,{"$f":"+IFERROR(VLOOKUP(Database2[[#This Row],[Leverandør]],Kontaktinfo[],4,FALSE),\"\")","v":""}]
["VestArkitektur12",null,null,null,null,{"$f":"+IFERROR(VLOOKUP(Database2[[#This Row],[Leverandør]],Kontaktinfo[],4,FALSE),\"\")","v":""}]
["VestArkitektur13",null,null,null,null,{"$f":"+IFERROR(VLOOKUP(Database2[[#This Row],[Leverandør]],Kontaktinfo[],4,FALSE),\"\")","v":""}]
["VestArkitektur14",null,null,null,null,{"$f":"+IFERROR(VLOOKUP(Database2[[#This Row],[Leverandør]],Kontaktinfo[],4,FALSE),\"\")","v":""}]
["VestArkitektur15",null,null,null,null,{"$f":"+IFERROR(VLOOKUP(Database2[[#This Row],[Leverandør]],Kontaktinfo[],4,FALSE),\"\")","v":""}]
["VestArkitektur16",null,null,null,null,{"$f":"+IFERROR(VLOOKUP(Database2[[#This Row],[Leverandør]],Kontaktinfo[],4,FALSE),\"\")","v":""}]
["VestArkitektur17",null,null,null,null,{"$f":"+IFERROR(VLOOKUP(Database2[[#This Row],[Leverandør]],Kontaktinfo[],4,FALSE),\"\")","v":""}]
["VestArkitektur18",null,null,null,null,{"$f":"+IFERROR(VLOOKUP(Database2[[#This Row],[Leverandør]],Kontaktinfo[],4,FALSE),\"\")","v":""}]
["VestArkitektur19",null,null,null,null,{"$f":"+IFERROR(VLOOKUP(Database2[[#This Row],[Leverandør]],Kontaktinfo[],4,FALSE),\"\")","v":""}]
["VestArkitektur20",null,null,null,null,{"$f":"+IFERROR(VLOOKUP(Database2[[#This Row],[Leverandør]],Kontaktinfo[],4,FALSE),\"\")","v":""}]
["VestArkitektur21",null,null,null,null,{"$f":"+IFERROR(VLOOKUP(Database2[[#This Row],[Leverandør]],Kontaktinfo[],4,FALSE),\"\")","v":""}]
["VestArkitektur22",null,null,null,null,{"$f":"+IFERROR(VLOOKUP(Database2[[#This Row],[Leverandør]],Kontaktinfo[],4,FALSE),\"\")","v":""}]
["VestArkitektur23",null,null,null,null,{"$f":"+IFERROR(VLOOKUP(Database2[[#This Row],[Leverandør]],Kontaktinfo[],4,FALSE),\"\")","v":""}]
["VestArkitektur24",null,null,null,null,{"$f":"+IFERROR(VLOOKUP(Database2[[#This Row],[Leverandør]],Kontaktinfo[],4,FALSE),\"\")","v":""}]
["VestArkitektur25",null,null,null,null,{"$f":"+IFERROR(VLOOKUP(Database2[[#This Row],[Leverandør]],Kontaktinfo[],4,FALSE),\"\")","v":""}]
["VestArkitektur26",null,null,null,null,{"$f":"+IFERROR(VLOOKUP(Database2[[#This Row],[Leverandør]],Kontaktinfo[],4,FALSE),\"\")","v":""}]
[null,null,null,null,null,{"$f":"+IFERROR(VLOOKUP(Database2[[#This Row],[Leverandør]],Kontaktinfo[],4,FALSE),\"\")","v":""}]
["VestInformasjonssikkerhet1",null,null,null,null,{"$f":"+IFERROR(VLOOKUP(Database2[[#This Row],[Leverandør]],Kontaktinfo[],4,FALSE),\"\")","v":""}]
["VestInformasjonssikkerhet2",null,null,null,null,{"$f":"+IFERROR(VLOOKUP(Database2[[#This Row],[Leverandør]],Kontaktinfo[],4,FALSE),\"\")","v":""}]
["VestInformasjonssikkerhet3",null,null,null,null,{"$f":"+IFERROR(VLOOKUP(Database2[[#This Row],[Leverandør]],Kontaktinfo[],4,FALSE),\"\")","v":""}]
["VestInformasjonssikkerhet4",null,null,null,null,{"$f":"+IFERROR(VLOOKUP(Database2[[#This Row],[Leverandør]],Kontaktinfo[],4,FALSE),\"\")","v":""}]
["VestInformasjonssikkerhet5",null,null,null,null,{"$f":"+IFERROR(VLOOKUP(Database2[[#This Row],[Leverandør]],Kontaktinfo[],4,FALSE),\"\")","v":""}]
["VestInformasjonssikkerhet6",null,null,null,null,{"$f":"+IFERROR(VLOOKUP(Database2[[#This Row],[Leverandør]],Kontaktinfo[],4,FALSE),\"\")","v":""}]
["VestInformasjonssikkerhet7",null,null,null,null,{"$f":"+IFERROR(VLOOKUP(Database2[[#This Row],[Leverandør]],Kontaktinfo[],4,FALSE),\"\")","v":""}]
["VestInformasjonssikkerhet8",null,null,null,null,{"$f":"+IFERROR(VLOOKUP(Database2[[#This Row],[Leverandør]],Kontaktinfo[],4,FALSE),\"\")","v":""}]
["VestInformasjonssikkerhet9",null,null,null,null,{"$f":"+IFERROR(VLOOKUP(Database2[[#This Row],[Leverandør]],Kontaktinfo[],4,FALSE),\"\")","v":""}]
["VestInformasjonssikkerhet10",null,null,null,null,{"$f":"+IFERROR(VLOOKUP(Database2[[#This Row],[Leverandør]],Kontaktinfo[],4,FALSE),\"\")","v":""}]
["VestInformasjonssikkerhet11",null,null,null,null,{"$f":"+IFERROR(VLOOKUP(Database2[[#This Row],[Leverandør]],Kontaktinfo[],4,FALSE),\"\")","v":""}]
["VestInformasjonssikkerhet12",null,null,null,null,{"$f":"+IFERROR(VLOOKUP(Database2[[#This Row],[Leverandør]],Kontaktinfo[],4,FALSE),\"\")","v":""}]
["VestInformasjonssikkerhet13",null,null,null,null,{"$f":"+IFERROR(VLOOKUP(Database2[[#This Row],[Leverandør]],Kontaktinfo[],4,FALSE),\"\")","v":""}]
["VestInformasjonssikkerhet14",null,null,null,null,{"$f":"+IFERROR(VLOOKUP(Database2[[#This Row],[Leverandør]],Kontaktinfo[],4,FALSE),\"\")","v":""}]
["VestInformasjonssikkerhet15",null,null,null,null,{"$f":"+IFERROR(VLOOKUP(Database2[[#This Row],[Leverandør]],Kontaktinfo[],4,FALSE),\"\")","v":""}]
["VestInformasjonssikkerhet16",null,null,null,null,{"$f":"+IFERROR(VLOOKUP(Database2[[#This Row],[Leverandør]],Kontaktinfo[],4,FALSE),\"\")","v":""}]
["VestInformasjonssikkerhet17",null,null,null,null,{"$f":"+IFERROR(VLOOKUP(Database2[[#This Row],[Leverandør]],Kontaktinfo[],4,FALSE),\"\")","v":""}]
["VestInformasjonssikkerhet18",null,null,null,null,{"$f":"+IFERROR(VLOOKUP(Database2[[#This Row],[Leverandør]],Kontaktinfo[],4,FALSE),\"\")","v":""}]
["VestInformasjonssikkerhet19",null,null,null,null,{"$f":"+IFERROR(VLOOKUP(Database2[[#This Row],[Leverandør]],Kontaktinfo[],4,FALSE),\"\")","v":""}]
["VestInformasjonssikkerhet20",null,null,null,null,{"$f":"+IFERROR(VLOOKUP(Database2[[#This Row],[Leverandør]],Kontaktinfo[],4,FALSE),\"\")","v":""}]
["VestInformasjonssikkerhet21",null,null,null,null,{"$f":"+IFERROR(VLOOKUP(Database2[[#This Row],[Leverandør]],Kontaktinfo[],4,FALSE),\"\")","v":""}]
["VestInformasjonssikkerhet22",null,null,null,null,{"$f":"+IFERROR(VLOOKUP(Database2[[#This Row],[Leverandør]],Kontaktinfo[],4,FALSE),\"\")","v":""}]
["VestInformasjonssikkerhet23",null,null,null,null,{"$f":"+IFERROR(VLOOKUP(Database2[[#This Row],[Leverandør]],Kontaktinfo[],4,FALSE),\"\")","v":""}]
["VestInformasjonssikkerhet24",null,null,null,null,{"$f":"+IFERROR(VLOOKUP(Database2[[#This Row],[Leverandør]],Kontaktinfo[],4,FALSE),\"\")","v":""}]
["VestInformasjonssikkerhet25",null,null,null,null,{"$f":"+IFERROR(VLOOKUP(Database2[[#This Row],[Leverandør]],Kontaktinfo[],4,FALSE),\"\")","v":""}]
["VestInformasjonssikkerhet26",null,null,null,null,{"$f":"+IFERROR(VLOOKUP(Database2[[#This Row],[Leverandør]],Kontaktinfo[],4,FALSE),\"\")","v":""}]
[null,null,null,null,null,{"$f":"+IFERROR(VLOOKUP(Database2[[#This Row],[Leverandør]],Kontaktinfo[],4,FALSE),\"\")","v":""}]
["VestTestledelse og Release-gjennomføring1",null,null,null,null,{"$f":"+IFERROR(VLOOKUP(Database2[[#This Row],[Leverandør]],Kontaktinfo[],4,FALSE),\"\")","v":""}]
["VestTestledelse og Release-gjennomføring2",null,null,null,null,{"$f":"+IFERROR(VLOOKUP(Database2[[#This Row],[Leverandør]],Kontaktinfo[],4,FALSE),\"\")","v":""}]
["VestTestledelse og Release-gjennomføring3",null,null,null,null,{"$f":"+IFERROR(VLOOKUP(Database2[[#This Row],[Leverandør]],Kontaktinfo[],4,FALSE),\"\")","v":""}]
["VestTestledelse og Release-gjennomføring4",null,null,null,null,{"$f":"+IFERROR(VLOOKUP(Database2[[#This Row],[Leverandør]],Kontaktinfo[],4,FALSE),\"\")","v":""}]
["VestTestledelse og Release-gjennomføring5",null,null,null,null,{"$f":"+IFERROR(VLOOKUP(Database2[[#This Row],[Leverandør]],Kontaktinfo[],4,FALSE),\"\")","v":""}]
["VestTestledelse og Release-gjennomføring6",null,null,null,null,{"$f":"+IFERROR(VLOOKUP(Database2[[#This Row],[Leverandør]],Kontaktinfo[],4,FALSE),\"\")","v":""}]
["VestTestledelse og Release-gjennomføring7",null,null,null,null,{"$f":"+IFERROR(VLOOKUP(Database2[[#This Row],[Leverandør]],Kontaktinfo[],4,FALSE),\"\")","v":""}]
["VestTestledelse og Release-gjennomføring8",null,null,null,null,{"$f":"+IFERROR(VLOOKUP(Database2[[#This Row],[Leverandør]],Kontaktinfo[],4,FALSE),\"\")","v":""}]
["VestTestledelse og Release-gjennomføring9",null,null,null,null,{"$f":"+IFERROR(VLOOKUP(Database2[[#This Row],[Leverandør]],Kontaktinfo[],4,FALSE),\"\")","v":""}]
["VestTestledelse og Release-gjennomføring10",null,null,null,null,{"$f":"+IFERROR(VLOOKUP(Database2[[#This Row],[Leverandør]],Kontaktinfo[],4,FALSE),\"\")","v":""}]
["VestTestledelse og Release-gjennomføring11",null,null,null,null,{"$f":"+IFERROR(VLOOKUP(Database2[[#This Row],[Leverandør]],Kontaktinfo[],4,FALSE),\"\")","v":""}]
["VestTestledelse og Release-gjennomføring12",null,null,null,null,{"$f":"+IFERROR(VLOOKUP(Database2[[#This Row],[Leverandør]],Kontaktinfo[],4,FALSE),\"\")","v":""}]
["VestTestledelse og Release-gjennomføring13",null,null,null,null,{"$f":"+IFERROR(VLOOKUP(Database2[[#This Row],[Leverandør]],Kontaktinfo[],4,FALSE),\"\")","v":""}]
["VestTestledelse og Release-gjennomføring14",null,null,null,null,{"$f":"+IFERROR(VLOOKUP(Database2[[#This Row],[Leverandør]],Kontaktinfo[],4,FALSE),\"\")","v":""}]
["VestTestledelse og Release-gjennomføring15",null,null,null,null,{"$f":"+IFERROR(VLOOKUP(Database2[[#This Row],[Leverandør]],Kontaktinfo[],4,FALSE),\"\")","v":""}]
["VestTestledelse og Release-gjennomføring16",null,null,null,null,{"$f":"+IFERROR(VLOOKUP(Database2[[#This Row],[Leverandør]],Kontaktinfo[],4,FALSE),\"\")","v":""}]
["VestTestledelse og Release-gjennomføring17",null,null,null,null,{"$f":"+IFERROR(VLOOKUP(Database2[[#This Row],[Leverandør]],Kontaktinfo[],4,FALSE),\"\")","v":""}]
["VestTestledelse og Release-gjennomføring18",null,null,null,null,{"$f":"+IFERROR(VLOOKUP(Database2[[#This Row],[Leverandør]],Kontaktinfo[],4,FALSE),\"\")","v":""}]
["VestTestledelse og Release-gjennomføring19",null,null,null,null,{"$f":"+IFERROR(VLOOKUP(Database2[[#This Row],[Leverandør]],Kontaktinfo[],4,FALSE),\"\")","v":""}]
["VestTestledelse og Release-gjennomføring20",null,null,null,null,{"$f":"+IFERROR(VLOOKUP(Database2[[#This Row],[Leverandør]],Kontaktinfo[],4,FALSE),\"\")","v":""}]
["VestTestledelse og Release-gjennomføring21",null,null,null,null,{"$f":"+IFERROR(VLOOKUP(Database2[[#This Row],[Leverandør]],Kontaktinfo[],4,FALSE),\"\")","v":""}]
["VestTestledelse og Release-gjennomføring22",null,null,null,null,{"$f":"+IFERROR(VLOOKUP(Database2[[#This Row],[Leverandør]],Kontaktinfo[],4,FALSE),\"\")","v":""}]
["VestTestledelse og Release-gjennomføring23",null,null,null,null,{"$f":"+IFERROR(VLOOKUP(Database2[[#This Row],[Leverandør]],Kontaktinfo[],4,FALSE),\"\")","v":""}]
["VestTestledelse og Release-gjennomføring24",null,null,null,null,{"$f":"+IFERROR(VLOOKUP(Database2[[#This Row],[Leverandør]],Kontaktinfo[],4,FALSE),\"\")","v":""}]
["VestTestledelse og Release-gjennomføring25",null,null,null,null,{"$f":"+IFERROR(VLOOKUP(Database2[[#This Row],[Leverandør]],Kontaktinfo[],4,FALSE),\"\")","v":""}]
["VestTestledelse og Release-gjennomføring26",null,null,null,null,{"$f":"+IFERROR(VLOOKUP(Database2[[#This Row],[Leverandør]],Kontaktinfo[],4,FALSE),\"\")","v":""}]
[null,null,null,null,null,{"$f":"+IFERROR(VLOOKUP(Database2[[#This Row],[Leverandør]],Kontaktinfo[],4,FALSE),\"\")","v":""}]
["VestElektronisk samhandling/integrasjoner/systemutvikling1",null,null,null,null,{"$f":"+IFERROR(VLOOKUP(Database2[[#This Row],[Leverandør]],Kontaktinfo[],4,FALSE),\"\")","v":""}]
["VestElektronisk samhandling/integrasjoner/systemutvikling2",null,null,null,null,{"$f":"+IFERROR(VLOOKUP(Database2[[#This Row],[Leverandør]],Kontaktinfo[],4,FALSE),\"\")","v":""}]
["VestElektronisk samhandling/integrasjoner/systemutvikling3",null,null,null,null,{"$f":"+IFERROR(VLOOKUP(Database2[[#This Row],[Leverandør]],Kontaktinfo[],4,FALSE),\"\")","v":""}]
["VestElektronisk samhandling/integrasjoner/systemutvikling4",null,null,null,null,{"$f":"+IFERROR(VLOOKUP(Database2[[#This Row],[Leverandør]],Kontaktinfo[],4,FALSE),\"\")","v":""}]
["VestElektronisk samhandling/integrasjoner/systemutvikling5",null,null,null,null,{"$f":"+IFERROR(VLOOKUP(Database2[[#This Row],[Leverandør]],Kontaktinfo[],4,FALSE),\"\")","v":""}]
["VestElektronisk samhandling/integrasjoner/systemutvikling6",null,null,null,null,{"$f":"+IFERROR(VLOOKUP(Database2[[#This Row],[Leverandør]],Kontaktinfo[],4,FALSE),\"\")","v":""}]
["VestElektronisk samhandling/integrasjoner/systemutvikling7",null,null,null,null,{"$f":"+IFERROR(VLOOKUP(Database2[[#This Row],[Leverandør]],Kontaktinfo[],4,FALSE),\"\")","v":""}]
["VestElektronisk samhandling/integrasjoner/systemutvikling8",null,null,null,null,{"$f":"+IFERROR(VLOOKUP(Database2[[#This Row],[Leverandør]],Kontaktinfo[],4,FALSE),\"\")","v":""}]
["VestElektronisk samhandling/integrasjoner/systemutvikling9",null,null,null,null,{"$f":"+IFERROR(VLOOKUP(Database2[[#This Row],[Leverandør]],Kontaktinfo[],4,FALSE),\"\")","v":""}]
["VestElektronisk samhandling/integrasjoner/systemutvikling10",null,null,null,null,{"$f":"+IFERROR(VLOOKUP(Database2[[#This Row],[Leverandør]],Kontaktinfo[],4,FALSE),\"\")","v":""}]
["VestElektronisk samhandling/integrasjoner/systemutvikling11",null,null,null,null,{"$f":"+IFERROR(VLOOKUP(Database2[[#This Row],[Leverandør]],Kontaktinfo[],4,FALSE),\"\")","v":""}]
["VestElektronisk samhandling/integrasjoner/systemutvikling12",null,null,null,null,{"$f":"+IFERROR(VLOOKUP(Database2[[#This Row],[Leverandør]],Kontaktinfo[],4,FALSE),\"\")","v":""}]
["VestElektronisk samhandling/integrasjoner/systemutvikling13",null,null,null,null,{"$f":"+IFERROR(VLOOKUP(Database2[[#This Row],[Leverandør]],Kontaktinfo[],4,FALSE),\"\")","v":""}]
["VestElektronisk samhandling/integrasjoner/systemutvikling14",null,null,null,null,{"$f":"+IFERROR(VLOOKUP(Database2[[#This Row],[Leverandør]],Kontaktinfo[],4,FALSE),\"\")","v":""}]
["VestElektronisk samhandling/integrasjoner/systemutvikling15",null,null,null,null,{"$f":"+IFERROR(VLOOKUP(Database2[[#This Row],[Leverandør]],Kontaktinfo[],4,FALSE),\"\")","v":""}]
["VestElektronisk samhandling/integrasjoner/systemutvikling16",null,null,null,null,{"$f":"+IFERROR(VLOOKUP(Database2[[#This Row],[Leverandør]],Kontaktinfo[],4,FALSE),\"\")","v":""}]
["VestElektronisk samhandling/integrasjoner/systemutvikling17",null,null,null,null,{"$f":"+IFERROR(VLOOKUP(Database2[[#This Row],[Leverandør]],Kontaktinfo[],4,FALSE),\"\")","v":""}]
["VestElektronisk samhandling/integrasjoner/systemutvikling18",null,null,null,null,{"$f":"+IFERROR(VLOOKUP(Database2[[#This Row],[Leverandør]],Kontaktinfo[],4,FALSE),\"\")","v":""}]
["VestElektronisk samhandling/integrasjoner/systemutvikling19",null,null,null,null,{"$f":"+IFERROR(VLOOKUP(Database2[[#This Row],[Leverandør]],Kontaktinfo[],4,FALSE),\"\")","v":""}]
["VestElektronisk samhandling/integrasjoner/systemutvikling20",null,null,null,null,{"$f":"+IFERROR(VLOOKUP(Database2[[#This Row],[Leverandør]],Kontaktinfo[],4,FALSE),\"\")","v":""}]
["VestElektronisk samhandling/integrasjoner/systemutvikling21",null,null,null,null,{"$f":"+IFERROR(VLOOKUP(Database2[[#This Row],[Leverandør]],Kontaktinfo[],4,FALSE),\"\")","v":""}]
["VestElektronisk samhandling/integrasjoner/systemutvikling22",null,null,null,null,{"$f":"+IFERROR(VLOOKUP(Database2[[#This Row],[Leverandør]],Kontaktinfo[],4,FALSE),\"\")","v":""}]
["VestElektronisk samhandling/integrasjoner/systemutvikling23",null,null,null,null,{"$f":"+IFERROR(VLOOKUP(Database2[[#This Row],[Leverandør]],Kontaktinfo[],4,FALSE),\"\")","v":""}]
["VestElektronisk samhandling/integrasjoner/systemutvikling24",null,null,null,null,{"$f":"+IFERROR(VLOOKUP(Database2[[#This Row],[Leverandør]],Kontaktinfo[],4,FALSE),\"\")","v":""}]
["VestElektronisk samhandling/integrasjoner/systemutvikling25",null,null,null,null,{"$f":"+IFERROR(VLOOKUP(Database2[[#This Row],[Leverandør]],Kontaktinfo[],4,FALSE),\"\")","v":""}]
["VestElektronisk samhandling/integrasjoner/systemutvikling26",null,null,null,null,{"$f":"+IFERROR(VLOOKUP(Database2[[#This Row],[Leverandør]],Kontaktinfo[],4,FALSE),\"\")","v":""}]
["VestElektronisk samhandling/integrasjoner/systemutvikling",null,null,null,null,{"$f":"+IFERROR(VLOOKUP(Database2[[#This Row],[Leverandør]],Kontaktinfo[],4,FALSE),\"\")","v":""}]
[null,null,null,null,null,{"$f":"+IFERROR(VLOOKUP(Database2[[#This Row],[Leverandør]],Kontaktinfo[],4,FALSE),\"\")","v":""}]
["VestDrift og Forvaltning av IT-systemer og plattformer1",null,null,null,null,{"$f":"+IFERROR(VLOOKUP(Database2[[#This Row],[Leverandør]],Kontaktinfo[],4,FALSE),\"\")","v":""}]
["VestDrift og Forvaltning av IT-systemer og plattformer2",null,null,null,null,{"$f":"+IFERROR(VLOOKUP(Database2[[#This Row],[Leverandør]],Kontaktinfo[],4,FALSE),\"\")","v":""}]
["VestDrift og Forvaltning av IT-systemer og plattformer3",null,null,null,null,{"$f":"+IFERROR(VLOOKUP(Database2[[#This Row],[Leverandør]],Kontaktinfo[],4,FALSE),\"\")","v":""}]
["VestDrift og Forvaltning av IT-systemer og plattformer4",null,null,null,null,{"$f":"+IFERROR(VLOOKUP(Database2[[#This Row],[Leverandør]],Kontaktinfo[],4,FALSE),\"\")","v":""}]
["VestDrift og Forvaltning av IT-systemer og plattformer5",null,null,null,null,{"$f":"+IFERROR(VLOOKUP(Database2[[#This Row],[Leverandør]],Kontaktinfo[],4,FALSE),\"\")","v":""}]
["VestDrift og Forvaltning av IT-systemer og plattformer6",null,null,null,null,{"$f":"+IFERROR(VLOOKUP(Database2[[#This Row],[Leverandør]],Kontaktinfo[],4,FALSE),\"\")","v":""}]
["VestDrift og Forvaltning av IT-systemer og plattformer7",null,null,null,null,{"$f":"+IFERROR(VLOOKUP(Database2[[#This Row],[Leverandør]],Kontaktinfo[],4,FALSE),\"\")","v":""}]
["VestDrift og Forvaltning av IT-systemer og plattformer8",null,null,null,null,{"$f":"+IFERROR(VLOOKUP(Database2[[#This Row],[Leverandør]],Kontaktinfo[],4,FALSE),\"\")","v":""}]
["VestDrift og Forvaltning av IT-systemer og plattformer9",null,null,null,null,{"$f":"+IFERROR(VLOOKUP(Database2[[#This Row],[Leverandør]],Kontaktinfo[],4,FALSE),\"\")","v":""}]
["VestDrift og Forvaltning av IT-systemer og plattformer10",null,null,null,null,{"$f":"+IFERROR(VLOOKUP(Database2[[#This Row],[Leverandør]],Kontaktinfo[],4,FALSE),\"\")","v":""}]
["VestDrift og Forvaltning av IT-systemer og plattformer11",null,null,null,null,{"$f":"+IFERROR(VLOOKUP(Database2[[#This Row],[Leverandør]],Kontaktinfo[],4,FALSE),\"\")","v":""}]
["VestDrift og Forvaltning av IT-systemer og plattformer12",null,null,null,null,{"$f":"+IFERROR(VLOOKUP(Database2[[#This Row],[Leverandør]],Kontaktinfo[],4,FALSE),\"\")","v":""}]
["VestDrift og Forvaltning av IT-systemer og plattformer13",null,null,null,null,{"$f":"+IFERROR(VLOOKUP(Database2[[#This Row],[Leverandør]],Kontaktinfo[],4,FALSE),\"\")","v":""}]
["VestDrift og Forvaltning av IT-systemer og plattformer14",null,null,null,null,{"$f":"+IFERROR(VLOOKUP(Database2[[#This Row],[Leverandør]],Kontaktinfo[],4,FALSE),\"\")","v":""}]
["VestDrift og Forvaltning av IT-systemer og plattformer15",null,null,null,null,{"$f":"+IFERROR(VLOOKUP(Database2[[#This Row],[Leverandør]],Kontaktinfo[],4,FALSE),\"\")","v":""}]
["VestDrift og Forvaltning av IT-systemer og plattformer16",null,null,null,null,{"$f":"+IFERROR(VLOOKUP(Database2[[#This Row],[Leverandør]],Kontaktinfo[],4,FALSE),\"\")","v":""}]
["VestDrift og Forvaltning av IT-systemer og plattformer17",null,null,null,null,{"$f":"+IFERROR(VLOOKUP(Database2[[#This Row],[Leverandør]],Kontaktinfo[],4,FALSE),\"\")","v":""}]
["VestDrift og Forvaltning av IT-systemer og plattformer18",null,null,null,null,{"$f":"+IFERROR(VLOOKUP(Database2[[#This Row],[Leverandør]],Kontaktinfo[],4,FALSE),\"\")","v":""}]
["VestDrift og Forvaltning av IT-systemer og plattformer19",null,null,null,null,{"$f":"+IFERROR(VLOOKUP(Database2[[#This Row],[Leverandør]],Kontaktinfo[],4,FALSE),\"\")","v":""}]
["VestDrift og Forvaltning av IT-systemer og plattformer20",null,null,null,null,{"$f":"+IFERROR(VLOOKUP(Database2[[#This Row],[Leverandør]],Kontaktinfo[],4,FALSE),\"\")","v":""}]
["VestDrift og Forvaltning av IT-systemer og plattformer21",null,null,null,null,{"$f":"+IFERROR(VLOOKUP(Database2[[#This Row],[Leverandør]],Kontaktinfo[],4,FALSE),\"\")","v":""}]
["VestDrift og Forvaltning av IT-systemer og plattformer22",null,null,null,null,{"$f":"+IFERROR(VLOOKUP(Database2[[#This Row],[Leverandør]],Kontaktinfo[],4,FALSE),\"\")","v":""}]
["VestDrift og Forvaltning av IT-systemer og plattformer23",null,null,null,null,{"$f":"+IFERROR(VLOOKUP(Database2[[#This Row],[Leverandør]],Kontaktinfo[],4,FALSE),\"\")","v":""}]
["VestDrift og Forvaltning av IT-systemer og plattformer24",null,null,null,null,{"$f":"+IFERROR(VLOOKUP(Database2[[#This Row],[Leverandør]],Kontaktinfo[],4,FALSE),\"\")","v":""}]
["VestDrift og Forvaltning av IT-systemer og plattformer25",null,null,null,null,{"$f":"+IFERROR(VLOOKUP(Database2[[#This Row],[Leverandør]],Kontaktinfo[],4,FALSE),\"\")","v":""}]
["VestDrift og Forvaltning av IT-systemer og plattformer26",null,null,null,null,{"$f":"+IFERROR(VLOOKUP(Database2[[#This Row],[Leverandør]],Kontaktinfo[],4,FALSE),\"\")","v":""}]
[null,null,null,null,null,{"$f":"+IFERROR(VLOOKUP(Database2[[#This Row],[Leverandør]],Kontaktinfo[],4,FALSE),\"\")","v":""}]
["VestDatakommunikasjon og Telekommunikasjon1",null,null,null,null,{"$f":"+IFERROR(VLOOKUP(Database2[[#This Row],[Leverandør]],Kontaktinfo[],4,FALSE),\"\")","v":""}]
["VestDatakommunikasjon og Telekommunikasjon2",null,null,null,null,{"$f":"+IFERROR(VLOOKUP(Database2[[#This Row],[Leverandør]],Kontaktinfo[],4,FALSE),\"\")","v":""}]
["VestDatakommunikasjon og Telekommunikasjon3",null,null,null,null,{"$f":"+IFERROR(VLOOKUP(Database2[[#This Row],[Leverandør]],Kontaktinfo[],4,FALSE),\"\")","v":""}]
["VestDatakommunikasjon og Telekommunikasjon4",null,null,null,null,{"$f":"+IFERROR(VLOOKUP(Database2[[#This Row],[Leverandør]],Kontaktinfo[],4,FALSE),\"\")","v":""}]
["VestDatakommunikasjon og Telekommunikasjon5",null,null,null,null,{"$f":"+IFERROR(VLOOKUP(Database2[[#This Row],[Leverandør]],Kontaktinfo[],4,FALSE),\"\")","v":""}]
["VestDatakommunikasjon og Telekommunikasjon6",null,null,null,null,{"$f":"+IFERROR(VLOOKUP(Database2[[#This Row],[Leverandør]],Kontaktinfo[],4,FALSE),\"\")","v":""}]
["VestDatakommunikasjon og Telekommunikasjon7",null,null,null,null,{"$f":"+IFERROR(VLOOKUP(Database2[[#This Row],[Leverandør]],Kontaktinfo[],4,FALSE),\"\")","v":""}]
["VestDatakommunikasjon og Telekommunikasjon8",null,null,null,null,{"$f":"+IFERROR(VLOOKUP(Database2[[#This Row],[Leverandør]],Kontaktinfo[],4,FALSE),\"\")","v":""}]
["VestDatakommunikasjon og Telekommunikasjon9",null,null,null,null,{"$f":"+IFERROR(VLOOKUP(Database2[[#This Row],[Leverandør]],Kontaktinfo[],4,FALSE),\"\")","v":""}]
["VestDatakommunikasjon og Telekommunikasjon10",null,null,null,null,{"$f":"+IFERROR(VLOOKUP(Database2[[#This Row],[Leverandør]],Kontaktinfo[],4,FALSE),\"\")","v":""}]
["VestDatakommunikasjon og Telekommunikasjon11",null,null,null,null,{"$f":"+IFERROR(VLOOKUP(Database2[[#This Row],[Leverandør]],Kontaktinfo[],4,FALSE),\"\")","v":""}]
["VestDatakommunikasjon og Telekommunikasjon12",null,null,null,null,{"$f":"+IFERROR(VLOOKUP(Database2[[#This Row],[Leverandør]],Kontaktinfo[],4,FALSE),\"\")","v":""}]
["VestDatakommunikasjon og Telekommunikasjon13",null,null,null,null,{"$f":"+IFERROR(VLOOKUP(Database2[[#This Row],[Leverandør]],Kontaktinfo[],4,FALSE),\"\")","v":""}]
["VestDatakommunikasjon og Telekommunikasjon14",null,null,null,null,{"$f":"+IFERROR(VLOOKUP(Database2[[#This Row],[Leverandør]],Kontaktinfo[],4,FALSE),\"\")","v":""}]
["VestDatakommunikasjon og Telekommunikasjon15",null,null,null,null,{"$f":"+IFERROR(VLOOKUP(Database2[[#This Row],[Leverandør]],Kontaktinfo[],4,FALSE),\"\")","v":""}]
["VestDatakommunikasjon og Telekommunikasjon16",null,null,null,null,{"$f":"+IFERROR(VLOOKUP(Database2[[#This Row],[Leverandør]],Kontaktinfo[],4,FALSE),\"\")","v":""}]
["VestDatakommunikasjon og Telekommunikasjon17",null,null,null,null,{"$f":"+IFERROR(VLOOKUP(Database2[[#This Row],[Leverandør]],Kontaktinfo[],4,FALSE),\"\")","v":""}]
["VestDatakommunikasjon og Telekommunikasjon18",null,null,null,null,{"$f":"+IFERROR(VLOOKUP(Database2[[#This Row],[Leverandør]],Kontaktinfo[],4,FALSE),\"\")","v":""}]
["VestDatakommunikasjon og Telekommunikasjon19",null,null,null,null,{"$f":"+IFERROR(VLOOKUP(Database2[[#This Row],[Leverandør]],Kontaktinfo[],4,FALSE),\"\")","v":""}]
["VestDatakommunikasjon og Telekommunikasjon20",null,null,null,null,{"$f":"+IFERROR(VLOOKUP(Database2[[#This Row],[Leverandør]],Kontaktinfo[],4,FALSE),\"\")","v":""}]
["VestDatakommunikasjon og Telekommunikasjon21",null,null,null,null,{"$f":"+IFERROR(VLOOKUP(Database2[[#This Row],[Leverandør]],Kontaktinfo[],4,FALSE),\"\")","v":""}]
["VestDatakommunikasjon og Telekommunikasjon22",null,null,null,null,{"$f":"+IFERROR(VLOOKUP(Database2[[#This Row],[Leverandør]],Kontaktinfo[],4,FALSE),\"\")","v":""}]
["VestDatakommunikasjon og Telekommunikasjon23",null,null,null,null,{"$f":"+IFERROR(VLOOKUP(Database2[[#This Row],[Leverandør]],Kontaktinfo[],4,FALSE),\"\")","v":""}]
["VestDatakommunikasjon og Telekommunikasjon24",null,null,null,null,{"$f":"+IFERROR(VLOOKUP(Database2[[#This Row],[Leverandør]],Kontaktinfo[],4,FALSE),\"\")","v":""}]
["VestDatakommunikasjon og Telekommunikasjon25",null,null,null,null,{"$f":"+IFERROR(VLOOKUP(Database2[[#This Row],[Leverandør]],Kontaktinfo[],4,FALSE),\"\")","v":""}]
["VestDatakommunikasjon og Telekommunikasjon26",null,null,null,null,{"$f":"+IFERROR(VLOOKUP(Database2[[#This Row],[Leverandør]],Kontaktinfo[],4,FALSE),\"\")","v":""}]
[null,null,null,null,null,{"$f":"+IFERROR(VLOOKUP(Database2[[#This Row],[Leverandør]],Kontaktinfo[],4,FALSE),\"\")","v":""}]
["VestApplikasjonsforvaltning1",null,null,null,null,{"$f":"+IFERROR(VLOOKUP(Database2[[#This Row],[Leverandør]],Kontaktinfo[],4,FALSE),\"\")","v":""}]
["VestApplikasjonsforvaltning2",null,null,null,null,{"$f":"+IFERROR(VLOOKUP(Database2[[#This Row],[Leverandør]],Kontaktinfo[],4,FALSE),\"\")","v":""}]
["VestApplikasjonsforvaltning3",null,null,null,null,{"$f":"+IFERROR(VLOOKUP(Database2[[#This Row],[Leverandør]],Kontaktinfo[],4,FALSE),\"\")","v":""}]
["VestApplikasjonsforvaltning4",null,null,null,null,{"$f":"+IFERROR(VLOOKUP(Database2[[#This Row],[Leverandør]],Kontaktinfo[],4,FALSE),\"\")","v":""}]
["VestApplikasjonsforvaltning5",null,null,null,null,{"$f":"+IFERROR(VLOOKUP(Database2[[#This Row],[Leverandør]],Kontaktinfo[],4,FALSE),\"\")","v":""}]
["VestApplikasjonsforvaltning6",null,null,null,null,{"$f":"+IFERROR(VLOOKUP(Database2[[#This Row],[Leverandør]],Kontaktinfo[],4,FALSE),\"\")","v":""}]
["VestApplikasjonsforvaltning7",null,null,null,null,{"$f":"+IFERROR(VLOOKUP(Database2[[#This Row],[Leverandør]],Kontaktinfo[],4,FALSE),\"\")","v":""}]
["VestApplikasjonsforvaltning8",null,null,null,null,{"$f":"+IFERROR(VLOOKUP(Database2[[#This Row],[Leverandør]],Kontaktinfo[],4,FALSE),\"\")","v":""}]
["VestApplikasjonsforvaltning9",null,null,null,null,{"$f":"+IFERROR(VLOOKUP(Database2[[#This Row],[Leverandør]],Kontaktinfo[],4,FALSE),\"\")","v":""}]
["VestApplikasjonsforvaltning10",null,null,null,null,{"$f":"+IFERROR(VLOOKUP(Database2[[#This Row],[Leverandør]],Kontaktinfo[],4,FALSE),\"\")","v":""}]
["VestApplikasjonsforvaltning11",null,null,null,null,{"$f":"+IFERROR(VLOOKUP(Database2[[#This Row],[Leverandør]],Kontaktinfo[],4,FALSE),\"\")","v":""}]
["VestApplikasjonsforvaltning12",null,null,null,null,{"$f":"+IFERROR(VLOOKUP(Database2[[#This Row],[Leverandør]],Kontaktinfo[],4,FALSE),\"\")","v":""}]
["VestApplikasjonsforvaltning13",null,null,null,null,{"$f":"+IFERROR(VLOOKUP(Database2[[#This Row],[Leverandør]],Kontaktinfo[],4,FALSE),\"\")","v":""}]
["VestApplikasjonsforvaltning14",null,null,null,null,{"$f":"+IFERROR(VLOOKUP(Database2[[#This Row],[Leverandør]],Kontaktinfo[],4,FALSE),\"\")","v":""}]
["VestApplikasjonsforvaltning15",null,null,null,null,{"$f":"+IFERROR(VLOOKUP(Database2[[#This Row],[Leverandør]],Kontaktinfo[],4,FALSE),\"\")","v":""}]
["VestApplikasjonsforvaltning16",null,null,null,null,{"$f":"+IFERROR(VLOOKUP(Database2[[#This Row],[Leverandør]],Kontaktinfo[],4,FALSE),\"\")","v":""}]
["VestApplikasjonsforvaltning17",null,null,null,null,{"$f":"+IFERROR(VLOOKUP(Database2[[#This Row],[Leverandør]],Kontaktinfo[],4,FALSE),\"\")","v":""}]
["VestApplikasjonsforvaltning18",null,null,null,null,{"$f":"+IFERROR(VLOOKUP(Database2[[#This Row],[Leverandør]],Kontaktinfo[],4,FALSE),\"\")","v":""}]
["VestApplikasjonsforvaltning19",null,null,null,null,{"$f":"+IFERROR(VLOOKUP(Database2[[#This Row],[Leverandør]],Kontaktinfo[],4,FALSE),\"\")","v":""}]
["VestApplikasjonsforvaltning20",null,null,null,null,{"$f":"+IFERROR(VLOOKUP(Database2[[#This Row],[Leverandør]],Kontaktinfo[],4,FALSE),\"\")","v":""}]
["VestApplikasjonsforvaltning21",null,null,null,null,{"$f":"+IFERROR(VLOOKUP(Database2[[#This Row],[Leverandør]],Kontaktinfo[],4,FALSE),\"\")","v":""}]
["VestApplikasjonsforvaltning22",null,null,null,null,{"$f":"+IFERROR(VLOOKUP(Database2[[#This Row],[Leverandør]],Kontaktinfo[],4,FALSE),\"\")","v":""}]
["VestApplikasjonsforvaltning23",null,null,null,null,{"$f":"+IFERROR(VLOOKUP(Database2[[#This Row],[Leverandør]],Kontaktinfo[],4,FALSE),\"\")","v":""}]
["VestApplikasjonsforvaltning24",null,null,null,null,{"$f":"+IFERROR(VLOOKUP(Database2[[#This Row],[Leverandør]],Kontaktinfo[],4,FALSE),\"\")","v":""}]
["VestApplikasjonsforvaltning25",null,null,null,null,{"$f":"+IFERROR(VLOOKUP(Database2[[#This Row],[Leverandør]],Kontaktinfo[],4,FALSE),\"\")","v":""}]
["VestApplikasjonsforvaltning26",null,null,null,null,{"$f":"+IFERROR(VLOOKUP(Database2[[#This Row],[Leverandør]],Kontaktinfo[],4,FALSE),\"\")","v":""}]
[null,null,null,null,null,{"$f":"+IFERROR(VLOOKUP(Database2[[#This Row],[Leverandør]],Kontaktinfo[],4,FALSE),\"\")","v":""}]
["VestKlientplattform1",null,null,null,null,{"$f":"+IFERROR(VLOOKUP(Database2[[#This Row],[Leverandør]],Kontaktinfo[],4,FALSE),\"\")","v":""}]
["VestKlientplattform2",null,null,null,null,{"$f":"+IFERROR(VLOOKUP(Database2[[#This Row],[Leverandør]],Kontaktinfo[],4,FALSE),\"\")","v":""}]
["VestKlientplattform3",null,null,null,null,{"$f":"+IFERROR(VLOOKUP(Database2[[#This Row],[Leverandør]],Kontaktinfo[],4,FALSE),\"\")","v":""}]
["VestKlientplattform4",null,null,null,null,{"$f":"+IFERROR(VLOOKUP(Database2[[#This Row],[Leverandør]],Kontaktinfo[],4,FALSE),\"\")","v":""}]
["VestKlientplattform5",null,null,null,null,{"$f":"+IFERROR(VLOOKUP(Database2[[#This Row],[Leverandør]],Kontaktinfo[],4,FALSE),\"\")","v":""}]
["VestKlientplattform6",null,null,null,null,{"$f":"+IFERROR(VLOOKUP(Database2[[#This Row],[Leverandør]],Kontaktinfo[],4,FALSE),\"\")","v":""}]
["VestKlientplattform7",null,null,null,null,{"$f":"+IFERROR(VLOOKUP(Database2[[#This Row],[Leverandør]],Kontaktinfo[],4,FALSE),\"\")","v":""}]
["VestKlientplattform8",null,null,null,null,{"$f":"+IFERROR(VLOOKUP(Database2[[#This Row],[Leverandør]],Kontaktinfo[],4,FALSE),\"\")","v":""}]
["VestKlientplattform9",null,null,null,null,{"$f":"+IFERROR(VLOOKUP(Database2[[#This Row],[Leverandør]],Kontaktinfo[],4,FALSE),\"\")","v":""}]
["VestKlientplattform10",null,null,null,null,{"$f":"+IFERROR(VLOOKUP(Database2[[#This Row],[Leverandør]],Kontaktinfo[],4,FALSE),\"\")","v":""}]
["VestKlientplattform11",null,null,null,null,{"$f":"+IFERROR(VLOOKUP(Database2[[#This Row],[Leverandør]],Kontaktinfo[],4,FALSE),\"\")","v":""}]
["VestKlientplattform12",null,null,null,null,{"$f":"+IFERROR(VLOOKUP(Database2[[#This Row],[Leverandør]],Kontaktinfo[],4,FALSE),\"\")","v":""}]
["VestKlientplattform13",null,null,null,null,{"$f":"+IFERROR(VLOOKUP(Database2[[#This Row],[Leverandør]],Kontaktinfo[],4,FALSE),\"\")","v":""}]
["VestKlientplattform14",null,null,null,null,{"$f":"+IFERROR(VLOOKUP(Database2[[#This Row],[Leverandør]],Kontaktinfo[],4,FALSE),\"\")","v":""}]
["VestKlientplattform15",null,null,null,null,{"$f":"+IFERROR(VLOOKUP(Database2[[#This Row],[Leverandør]],Kontaktinfo[],4,FALSE),\"\")","v":""}]
["VestKlientplattform16",null,null,null,null,{"$f":"+IFERROR(VLOOKUP(Database2[[#This Row],[Leverandør]],Kontaktinfo[],4,FALSE),\"\")","v":""}]
["VestKlientplattform17",null,null,null,null,{"$f":"+IFERROR(VLOOKUP(Database2[[#This Row],[Leverandør]],Kontaktinfo[],4,FALSE),\"\")","v":""}]
["VestKlientplattform18",null,null,null,null,{"$f":"+IFERROR(VLOOKUP(Database2[[#This Row],[Leverandør]],Kontaktinfo[],4,FALSE),\"\")","v":""}]
["VestKlientplattform19",null,null,null,null,{"$f":"+IFERROR(VLOOKUP(Database2[[#This Row],[Leverandør]],Kontaktinfo[],4,FALSE),\"\")","v":""}]
["VestKlientplattform20",null,null,null,null,{"$f":"+IFERROR(VLOOKUP(Database2[[#This Row],[Leverandør]],Kontaktinfo[],4,FALSE),\"\")","v":""}]
["VestKlientplattform21",null,null,null,null,{"$f":"+IFERROR(VLOOKUP(Database2[[#This Row],[Leverandør]],Kontaktinfo[],4,FALSE),\"\")","v":""}]
["VestKlientplattform22",null,null,null,null,{"$f":"+IFERROR(VLOOKUP(Database2[[#This Row],[Leverandør]],Kontaktinfo[],4,FALSE),\"\")","v":""}]
["VestKlientplattform23",null,null,null,null,{"$f":"+IFERROR(VLOOKUP(Database2[[#This Row],[Leverandør]],Kontaktinfo[],4,FALSE),\"\")","v":""}]
["VestKlientplattform24",null,null,null,null,{"$f":"+IFERROR(VLOOKUP(Database2[[#This Row],[Leverandør]],Kontaktinfo[],4,FALSE),\"\")","v":""}]
["VestKlientplattform25",null,null,null,null,{"$f":"+IFERROR(VLOOKUP(Database2[[#This Row],[Leverandør]],Kontaktinfo[],4,FALSE),\"\")","v":""}]
["VestKlientplattform26",null,null,null,null,{"$f":"+IFERROR(VLOOKUP(Database2[[#This Row],[Leverandør]],Kontaktinfo[],4,FALSE),\"\")","v":""}]
[null,null,null,null,null,{"$f":"+IFERROR(VLOOKUP(Database2[[#This Row],[Leverandør]],Kontaktinfo[],4,FALSE),\"\")","v":""}]
["Sør-ØstProgram og Prosjektgjennomføring1",null,null,null,null,{"$f":"+IFERROR(VLOOKUP(Database2[[#This Row],[Leverandør]],Kontaktinfo[],4,FALSE),\"\")","v":""}]
["Sør-ØstProgram og Prosjektgjennomføring2",null,null,null,null,{"$f":"+IFERROR(VLOOKUP(Database2[[#This Row],[Leverandør]],Kontaktinfo[],4,FALSE),\"\")","v":""}]
["Sør-ØstProgram og Prosjektgjennomføring3",null,null,null,null,{"$f":"+IFERROR(VLOOKUP(Database2[[#This Row],[Leverandør]],Kontaktinfo[],4,FALSE),\"\")","v":""}]
["Sør-ØstProgram og Prosjektgjennomføring4",null,null,null,null,{"$f":"+IFERROR(VLOOKUP(Database2[[#This Row],[Leverandør]],Kontaktinfo[],4,FALSE),\"\")","v":""}]
["Sør-ØstProgram og Prosjektgjennomføring5",null,null,null,null,{"$f":"+IFERROR(VLOOKUP(Database2[[#This Row],[Leverandør]],Kontaktinfo[],4,FALSE),\"\")","v":""}]
["Sør-ØstProgram og Prosjektgjennomføring6",null,null,null,null,{"$f":"+IFERROR(VLOOKUP(Database2[[#This Row],[Leverandør]],Kontaktinfo[],4,FALSE),\"\")","v":""}]
["Sør-ØstProgram og Prosjektgjennomføring7",null,null,null,null,{"$f":"+IFERROR(VLOOKUP(Database2[[#This Row],[Leverandør]],Kontaktinfo[],4,FALSE),\"\")","v":""}]
["Sør-ØstProgram og Prosjektgjennomføring8",null,null,null,null,{"$f":"+IFERROR(VLOOKUP(Database2[[#This Row],[Leverandør]],Kontaktinfo[],4,FALSE),\"\")","v":""}]
["Sør-ØstProgram og Prosjektgjennomføring9",null,null,null,null,{"$f":"+IFERROR(VLOOKUP(Database2[[#This Row],[Leverandør]],Kontaktinfo[],4,FALSE),\"\")","v":""}]
["Sør-ØstProgram og Prosjektgjennomføring10",null,null,null,null,{"$f":"+IFERROR(VLOOKUP(Database2[[#This Row],[Leverandør]],Kontaktinfo[],4,FALSE),\"\")","v":""}]
["Sør-ØstProgram og Prosjektgjennomføring11",null,null,null,null,{"$f":"+IFERROR(VLOOKUP(Database2[[#This Row],[Leverandør]],Kontaktinfo[],4,FALSE),\"\")","v":""}]
["Sør-ØstProgram og Prosjektgjennomføring12",null,null,null,null,{"$f":"+IFERROR(VLOOKUP(Database2[[#This Row],[Leverandør]],Kontaktinfo[],4,FALSE),\"\")","v":""}]
["Sør-ØstProgram og Prosjektgjennomføring13",null,null,null,null,{"$f":"+IFERROR(VLOOKUP(Database2[[#This Row],[Leverandør]],Kontaktinfo[],4,FALSE),\"\")","v":""}]
["Sør-ØstProgram og Prosjektgjennomføring14",null,null,null,null,{"$f":"+IFERROR(VLOOKUP(Database2[[#This Row],[Leverandør]],Kontaktinfo[],4,FALSE),\"\")","v":""}]
["Sør-ØstProgram og Prosjektgjennomføring15",null,null,null,null,{"$f":"+IFERROR(VLOOKUP(Database2[[#This Row],[Leverandør]],Kontaktinfo[],4,FALSE),\"\")","v":""}]
["Sør-ØstProgram og Prosjektgjennomføring16",null,null,null,null,{"$f":"+IFERROR(VLOOKUP(Database2[[#This Row],[Leverandør]],Kontaktinfo[],4,FALSE),\"\")","v":""}]
["Sør-ØstProgram og Prosjektgjennomføring17",null,null,null,null,{"$f":"+IFERROR(VLOOKUP(Database2[[#This Row],[Leverandør]],Kontaktinfo[],4,FALSE),\"\")","v":""}]
["Sør-ØstProgram og Prosjektgjennomføring18",null,null,null,null,{"$f":"+IFERROR(VLOOKUP(Database2[[#This Row],[Leverandør]],Kontaktinfo[],4,FALSE),\"\")","v":""}]
["Sør-ØstProgram og Prosjektgjennomføring19",null,null,null,null,{"$f":"+IFERROR(VLOOKUP(Database2[[#This Row],[Leverandør]],Kontaktinfo[],4,FALSE),\"\")","v":""}]
["Sør-ØstProgram og Prosjektgjennomføring20",null,null,null,null,{"$f":"+IFERROR(VLOOKUP(Database2[[#This Row],[Leverandør]],Kontaktinfo[],4,FALSE),\"\")","v":""}]
["Sør-ØstProgram og Prosjektgjennomføring21",null,null,null,null,{"$f":"+IFERROR(VLOOKUP(Database2[[#This Row],[Leverandør]],Kontaktinfo[],4,FALSE),\"\")","v":""}]
["Sør-ØstProgram og Prosjektgjennomføring22",null,null,null,null,{"$f":"+IFERROR(VLOOKUP(Database2[[#This Row],[Leverandør]],Kontaktinfo[],4,FALSE),\"\")","v":""}]
["Sør-ØstProgram og Prosjektgjennomføring23",null,null,null,null,{"$f":"+IFERROR(VLOOKUP(Database2[[#This Row],[Leverandør]],Kontaktinfo[],4,FALSE),\"\")","v":""}]
["Sør-ØstProgram og Prosjektgjennomføring24",null,null,null,null,{"$f":"+IFERROR(VLOOKUP(Database2[[#This Row],[Leverandør]],Kontaktinfo[],4,FALSE),\"\")","v":""}]
["Sør-ØstProgram og Prosjektgjennomføring25",null,null,null,null,{"$f":"+IFERROR(VLOOKUP(Database2[[#This Row],[Leverandør]],Kontaktinfo[],4,FALSE),\"\")","v":""}]
["Sør-ØstProgram og Prosjektgjennomføring26",null,null,null,null,{"$f":"+IFERROR(VLOOKUP(Database2[[#This Row],[Leverandør]],Kontaktinfo[],4,FALSE),\"\")","v":""}]
["Sør-ØstProgram og Prosjektgjennomføring27",null,null,null,null,{"$f":"+IFERROR(VLOOKUP(Database2[[#This Row],[Leverandør]],Kontaktinfo[],4,FALSE),\"\")","v":""}]
["Sør-ØstProgram og Prosjektgjennomføring28",null,null,null,null,{"$f":"+IFERROR(VLOOKUP(Database2[[#This Row],[Leverandør]],Kontaktinfo[],4,FALSE),\"\")","v":""}]
["Sør-ØstProgram og Prosjektgjennomføring29",null,null,null,null,{"$f":"+IFERROR(VLOOKUP(Database2[[#This Row],[Leverandør]],Kontaktinfo[],4,FALSE),\"\")","v":""}]
["Sør-ØstProgram og Prosjektgjennomføring30",null,null,null,null,{"$f":"+IFERROR(VLOOKUP(Database2[[#This Row],[Leverandør]],Kontaktinfo[],4,FALSE),\"\")","v":""}]
[null,null,null,null,null,{"$f":"+IFERROR(VLOOKUP(Database2[[#This Row],[Leverandør]],Kontaktinfo[],4,FALSE),\"\")","v":""}]
["Sør-ØstStrategiplanlegging, rådgivning og innovasjon1",null,null,null,null,{"$f":"+IFERROR(VLOOKUP(Database2[[#This Row],[Leverandør]],Kontaktinfo[],4,FALSE),\"\")","v":""}]
["Sør-ØstStrategiplanlegging, rådgivning og innovasjon2",null,null,null,null,{"$f":"+IFERROR(VLOOKUP(Database2[[#This Row],[Leverandør]],Kontaktinfo[],4,FALSE),\"\")","v":""}]
["Sør-ØstStrategiplanlegging, rådgivning og innovasjon3",null,null,null,null,{"$f":"+IFERROR(VLOOKUP(Database2[[#This Row],[Leverandør]],Kontaktinfo[],4,FALSE),\"\")","v":""}]
["Sør-ØstStrategiplanlegging, rådgivning og innovasjon4",null,null,null,null,{"$f":"+IFERROR(VLOOKUP(Database2[[#This Row],[Leverandør]],Kontaktinfo[],4,FALSE),\"\")","v":""}]
["Sør-ØstStrategiplanlegging, rådgivning og innovasjon5",null,null,null,null,{"$f":"+IFERROR(VLOOKUP(Database2[[#This Row],[Leverandør]],Kontaktinfo[],4,FALSE),\"\")","v":""}]
["Sør-ØstStrategiplanlegging, rådgivning og innovasjon6",null,null,null,null,{"$f":"+IFERROR(VLOOKUP(Database2[[#This Row],[Leverandør]],Kontaktinfo[],4,FALSE),\"\")","v":""}]
["Sør-ØstStrategiplanlegging, rådgivning og innovasjon7",null,null,null,null,{"$f":"+IFERROR(VLOOKUP(Database2[[#This Row],[Leverandør]],Kontaktinfo[],4,FALSE),\"\")","v":""}]
["Sør-ØstStrategiplanlegging, rådgivning og innovasjon8",null,null,null,null,{"$f":"+IFERROR(VLOOKUP(Database2[[#This Row],[Leverandør]],Kontaktinfo[],4,FALSE),\"\")","v":""}]
["Sør-ØstStrategiplanlegging, rådgivning og innovasjon9",null,null,null,null,{"$f":"+IFERROR(VLOOKUP(Database2[[#This Row],[Leverandør]],Kontaktinfo[],4,FALSE),\"\")","v":""}]
["Sør-ØstStrategiplanlegging, rådgivning og innovasjon10",null,null,null,null,{"$f":"+IFERROR(VLOOKUP(Database2[[#This Row],[Leverandør]],Kontaktinfo[],4,FALSE),\"\")","v":""}]
["Sør-ØstStrategiplanlegging, rådgivning og innovasjon11",null,null,null,null,{"$f":"+IFERROR(VLOOKUP(Database2[[#This Row],[Leverandør]],Kontaktinfo[],4,FALSE),\"\")","v":""}]
["Sør-ØstStrategiplanlegging, rådgivning og innovasjon12",null,null,null,null,{"$f":"+IFERROR(VLOOKUP(Database2[[#This Row],[Leverandør]],Kontaktinfo[],4,FALSE),\"\")","v":""}]
["Sør-ØstStrategiplanlegging, rådgivning og innovasjon13",null,null,null,null,{"$f":"+IFERROR(VLOOKUP(Database2[[#This Row],[Leverandør]],Kontaktinfo[],4,FALSE),\"\")","v":""}]
["Sør-ØstStrategiplanlegging, rådgivning og innovasjon14",null,null,null,null,{"$f":"+IFERROR(VLOOKUP(Database2[[#This Row],[Leverandør]],Kontaktinfo[],4,FALSE),\"\")","v":""}]
["Sør-ØstStrategiplanlegging, rådgivning og innovasjon15",null,null,null,null,{"$f":"+IFERROR(VLOOKUP(Database2[[#This Row],[Leverandør]],Kontaktinfo[],4,FALSE),\"\")","v":""}]
["Sør-ØstStrategiplanlegging, rådgivning og innovasjon16",null,null,null,null,{"$f":"+IFERROR(VLOOKUP(Database2[[#This Row],[Leverandør]],Kontaktinfo[],4,FALSE),\"\")","v":""}]
["Sør-ØstStrategiplanlegging, rådgivning og innovasjon17",null,null,null,null,{"$f":"+IFERROR(VLOOKUP(Database2[[#This Row],[Leverandør]],Kontaktinfo[],4,FALSE),\"\")","v":""}]
["Sør-ØstStrategiplanlegging, rådgivning og innovasjon18",null,null,null,null,{"$f":"+IFERROR(VLOOKUP(Database2[[#This Row],[Leverandør]],Kontaktinfo[],4,FALSE),\"\")","v":""}]
["Sør-ØstStrategiplanlegging, rådgivning og innovasjon19",null,null,null,null,{"$f":"+IFERROR(VLOOKUP(Database2[[#This Row],[Leverandør]],Kontaktinfo[],4,FALSE),\"\")","v":""}]
["Sør-ØstStrategiplanlegging, rådgivning og innovasjon20",null,null,null,null,{"$f":"+IFERROR(VLOOKUP(Database2[[#This Row],[Leverandør]],Kontaktinfo[],4,FALSE),\"\")","v":""}]
["Sør-ØstStrategiplanlegging, rådgivning og innovasjon21",null,null,null,null,{"$f":"+IFERROR(VLOOKUP(Database2[[#This Row],[Leverandør]],Kontaktinfo[],4,FALSE),\"\")","v":""}]
["Sør-ØstStrategiplanlegging, rådgivning og innovasjon22",null,null,null,null,{"$f":"+IFERROR(VLOOKUP(Database2[[#This Row],[Leverandør]],Kontaktinfo[],4,FALSE),\"\")","v":""}]
["Sør-ØstStrategiplanlegging, rådgivning og innovasjon23",null,null,null,null,{"$f":"+IFERROR(VLOOKUP(Database2[[#This Row],[Leverandør]],Kontaktinfo[],4,FALSE),\"\")","v":""}]
["Sør-ØstStrategiplanlegging, rådgivning og innovasjon24",null,null,null,null,{"$f":"+IFERROR(VLOOKUP(Database2[[#This Row],[Leverandør]],Kontaktinfo[],4,FALSE),\"\")","v":""}]
["Sør-ØstStrategiplanlegging, rådgivning og innovasjon25",null,null,null,null,{"$f":"+IFERROR(VLOOKUP(Database2[[#This Row],[Leverandør]],Kontaktinfo[],4,FALSE),\"\")","v":""}]
["Sør-ØstStrategiplanlegging, rådgivning og innovasjon26",null,null,null,null,{"$f":"+IFERROR(VLOOKUP(Database2[[#This Row],[Leverandør]],Kontaktinfo[],4,FALSE),\"\")","v":""}]
["Sør-ØstStrategiplanlegging, rådgivning og innovasjon27",null,null,null,null,{"$f":"+IFERROR(VLOOKUP(Database2[[#This Row],[Leverandør]],Kontaktinfo[],4,FALSE),\"\")","v":""}]
[null,null,null,null,null,{"$f":"+IFERROR(VLOOKUP(Database2[[#This Row],[Leverandør]],Kontaktinfo[],4,FALSE),\"\")","v":""}]
["Sør-ØstArkitektur1",null,null,null,null,{"$f":"+IFERROR(VLOOKUP(Database2[[#This Row],[Leverandør]],Kontaktinfo[],4,FALSE),\"\")","v":""}]
["Sør-ØstArkitektur2",null,null,null,null,{"$f":"+IFERROR(VLOOKUP(Database2[[#This Row],[Leverandør]],Kontaktinfo[],4,FALSE),\"\")","v":""}]
["Sør-ØstArkitektur3",null,null,null,null,{"$f":"+IFERROR(VLOOKUP(Database2[[#This Row],[Leverandør]],Kontaktinfo[],4,FALSE),\"\")","v":""}]
["Sør-ØstArkitektur4",null,null,null,null,{"$f":"+IFERROR(VLOOKUP(Database2[[#This Row],[Leverandør]],Kontaktinfo[],4,FALSE),\"\")","v":""}]
["Sør-ØstArkitektur5",null,null,null,null,{"$f":"+IFERROR(VLOOKUP(Database2[[#This Row],[Leverandør]],Kontaktinfo[],4,FALSE),\"\")","v":""}]
["Sør-ØstArkitektur6",null,null,null,null,{"$f":"+IFERROR(VLOOKUP(Database2[[#This Row],[Leverandør]],Kontaktinfo[],4,FALSE),\"\")","v":""}]
["Sør-ØstArkitektur7",null,null,null,null,{"$f":"+IFERROR(VLOOKUP(Database2[[#This Row],[Leverandør]],Kontaktinfo[],4,FALSE),\"\")","v":""}]
["Sør-ØstArkitektur8",null,null,null,null,{"$f":"+IFERROR(VLOOKUP(Database2[[#This Row],[Leverandør]],Kontaktinfo[],4,FALSE),\"\")","v":""}]
["Sør-ØstArkitektur9",null,null,null,null,{"$f":"+IFERROR(VLOOKUP(Database2[[#This Row],[Leverandør]],Kontaktinfo[],4,FALSE),\"\")","v":""}]
["Sør-ØstArkitektur10",null,null,null,null,{"$f":"+IFERROR(VLOOKUP(Database2[[#This Row],[Leverandør]],Kontaktinfo[],4,FALSE),\"\")","v":""}]
["Sør-ØstArkitektur11",null,null,null,null,{"$f":"+IFERROR(VLOOKUP(Database2[[#This Row],[Leverandør]],Kontaktinfo[],4,FALSE),\"\")","v":""}]
["Sør-ØstArkitektur12",null,null,null,null,{"$f":"+IFERROR(VLOOKUP(Database2[[#This Row],[Leverandør]],Kontaktinfo[],4,FALSE),\"\")","v":""}]
["Sør-ØstArkitektur13",null,null,null,null,{"$f":"+IFERROR(VLOOKUP(Database2[[#This Row],[Leverandør]],Kontaktinfo[],4,FALSE),\"\")","v":""}]
["Sør-ØstArkitektur14",null,null,null,null,{"$f":"+IFERROR(VLOOKUP(Database2[[#This Row],[Leverandør]],Kontaktinfo[],4,FALSE),\"\")","v":""}]
["Sør-ØstArkitektur15",null,null,null,null,{"$f":"+IFERROR(VLOOKUP(Database2[[#This Row],[Leverandør]],Kontaktinfo[],4,FALSE),\"\")","v":""}]
["Sør-ØstArkitektur16",null,null,null,null,{"$f":"+IFERROR(VLOOKUP(Database2[[#This Row],[Leverandør]],Kontaktinfo[],4,FALSE),\"\")","v":""}]
["Sør-ØstArkitektur17",null,null,null,null,{"$f":"+IFERROR(VLOOKUP(Database2[[#This Row],[Leverandør]],Kontaktinfo[],4,FALSE),\"\")","v":""}]
["Sør-ØstArkitektur18",null,null,null,null,{"$f":"+IFERROR(VLOOKUP(Database2[[#This Row],[Leverandør]],Kontaktinfo[],4,FALSE),\"\")","v":""}]
["Sør-ØstArkitektur19",null,null,null,null,{"$f":"+IFERROR(VLOOKUP(Database2[[#This Row],[Leverandør]],Kontaktinfo[],4,FALSE),\"\")","v":""}]
["Sør-ØstArkitektur20",null,null,null,null,{"$f":"+IFERROR(VLOOKUP(Database2[[#This Row],[Leverandør]],Kontaktinfo[],4,FALSE),\"\")","v":""}]
["Sør-ØstArkitektur21",null,null,null,null,{"$f":"+IFERROR(VLOOKUP(Database2[[#This Row],[Leverandør]],Kontaktinfo[],4,FALSE),\"\")","v":""}]
["Sør-ØstArkitektur22",null,null,null,null,{"$f":"+IFERROR(VLOOKUP(Database2[[#This Row],[Leverandør]],Kontaktinfo[],4,FALSE),\"\")","v":""}]
["Sør-ØstArkitektur23",null,null,null,null,{"$f":"+IFERROR(VLOOKUP(Database2[[#This Row],[Leverandør]],Kontaktinfo[],4,FALSE),\"\")","v":""}]
["Sør-ØstArkitektur24",null,null,null,null,{"$f":"+IFERROR(VLOOKUP(Database2[[#This Row],[Leverandør]],Kontaktinfo[],4,FALSE),\"\")","v":""}]
["Sør-ØstArkitektur25",null,null,null,null,{"$f":"+IFERROR(VLOOKUP(Database2[[#This Row],[Leverandør]],Kontaktinfo[],4,FALSE),\"\")","v":""}]
["Sør-ØstArkitektur26",null,null,null,null,{"$f":"+IFERROR(VLOOKUP(Database2[[#This Row],[Leverandør]],Kontaktinfo[],4,FALSE),\"\")","v":""}]
[null,null,null,null,null,{"$f":"+IFERROR(VLOOKUP(Database2[[#This Row],[Leverandør]],Kontaktinfo[],4,FALSE),\"\")","v":""}]
["Sør-ØstInformasjonssikkerhet1",null,null,null,null,{"$f":"+IFERROR(VLOOKUP(Database2[[#This Row],[Leverandør]],Kontaktinfo[],4,FALSE),\"\")","v":""}]
["Sør-ØstInformasjonssikkerhet2",null,null,null,null,{"$f":"+IFERROR(VLOOKUP(Database2[[#This Row],[Leverandør]],Kontaktinfo[],4,FALSE),\"\")","v":""}]
["Sør-ØstInformasjonssikkerhet3",null,null,null,null,{"$f":"+IFERROR(VLOOKUP(Database2[[#This Row],[Leverandør]],Kontaktinfo[],4,FALSE),\"\")","v":""}]
["Sør-ØstInformasjonssikkerhet4",null,null,null,null,{"$f":"+IFERROR(VLOOKUP(Database2[[#This Row],[Leverandør]],Kontaktinfo[],4,FALSE),\"\")","v":""}]
["Sør-ØstInformasjonssikkerhet5",null,null,null,null,{"$f":"+IFERROR(VLOOKUP(Database2[[#This Row],[Leverandør]],Kontaktinfo[],4,FALSE),\"\")","v":""}]
["Sør-ØstInformasjonssikkerhet6",null,null,null,null,{"$f":"+IFERROR(VLOOKUP(Database2[[#This Row],[Leverandør]],Kontaktinfo[],4,FALSE),\"\")","v":""}]
["Sør-ØstInformasjonssikkerhet7",null,null,null,null,{"$f":"+IFERROR(VLOOKUP(Database2[[#This Row],[Leverandør]],Kontaktinfo[],4,FALSE),\"\")","v":""}]
["Sør-ØstInformasjonssikkerhet8",null,null,null,null,{"$f":"+IFERROR(VLOOKUP(Database2[[#This Row],[Leverandør]],Kontaktinfo[],4,FALSE),\"\")","v":""}]
["Sør-ØstInformasjonssikkerhet9",null,null,null,null,{"$f":"+IFERROR(VLOOKUP(Database2[[#This Row],[Leverandør]],Kontaktinfo[],4,FALSE),\"\")","v":""}]
["Sør-ØstInformasjonssikkerhet10",null,null,null,null,{"$f":"+IFERROR(VLOOKUP(Database2[[#This Row],[Leverandør]],Kontaktinfo[],4,FALSE),\"\")","v":""}]
["Sør-ØstInformasjonssikkerhet11",null,null,null,null,{"$f":"+IFERROR(VLOOKUP(Database2[[#This Row],[Leverandør]],Kontaktinfo[],4,FALSE),\"\")","v":""}]
["Sør-ØstInformasjonssikkerhet12",null,null,null,null,{"$f":"+IFERROR(VLOOKUP(Database2[[#This Row],[Leverandør]],Kontaktinfo[],4,FALSE),\"\")","v":""}]
["Sør-ØstInformasjonssikkerhet13",null,null,null,null,{"$f":"+IFERROR(VLOOKUP(Database2[[#This Row],[Leverandør]],Kontaktinfo[],4,FALSE),\"\")","v":""}]
["Sør-ØstInformasjonssikkerhet14",null,null,null,null,{"$f":"+IFERROR(VLOOKUP(Database2[[#This Row],[Leverandør]],Kontaktinfo[],4,FALSE),\"\")","v":""}]
["Sør-ØstInformasjonssikkerhet15",null,null,null,null,{"$f":"+IFERROR(VLOOKUP(Database2[[#This Row],[Leverandør]],Kontaktinfo[],4,FALSE),\"\")","v":""}]
["Sør-ØstInformasjonssikkerhet16",null,null,null,null,{"$f":"+IFERROR(VLOOKUP(Database2[[#This Row],[Leverandør]],Kontaktinfo[],4,FALSE),\"\")","v":""}]
["Sør-ØstInformasjonssikkerhet17",null,null,null,null,{"$f":"+IFERROR(VLOOKUP(Database2[[#This Row],[Leverandør]],Kontaktinfo[],4,FALSE),\"\")","v":""}]
["Sør-ØstInformasjonssikkerhet18",null,null,null,null,{"$f":"+IFERROR(VLOOKUP(Database2[[#This Row],[Leverandør]],Kontaktinfo[],4,FALSE),\"\")","v":""}]
["Sør-ØstInformasjonssikkerhet19",null,null,null,null,{"$f":"+IFERROR(VLOOKUP(Database2[[#This Row],[Leverandør]],Kontaktinfo[],4,FALSE),\"\")","v":""}]
["Sør-ØstInformasjonssikkerhet20",null,null,null,null,{"$f":"+IFERROR(VLOOKUP(Database2[[#This Row],[Leverandør]],Kontaktinfo[],4,FALSE),\"\")","v":""}]
["Sør-ØstInformasjonssikkerhet21",null,null,null,null,{"$f":"+IFERROR(VLOOKUP(Database2[[#This Row],[Leverandør]],Kontaktinfo[],4,FALSE),\"\")","v":""}]
["Sør-ØstInformasjonssikkerhet22",null,null,null,null,{"$f":"+IFERROR(VLOOKUP(Database2[[#This Row],[Leverandør]],Kontaktinfo[],4,FALSE),\"\")","v":""}]
["Sør-ØstInformasjonssikkerhet23",null,null,null,null,{"$f":"+IFERROR(VLOOKUP(Database2[[#This Row],[Leverandør]],Kontaktinfo[],4,FALSE),\"\")","v":""}]
["Sør-ØstInformasjonssikkerhet24",null,null,null,null,{"$f":"+IFERROR(VLOOKUP(Database2[[#This Row],[Leverandør]],Kontaktinfo[],4,FALSE),\"\")","v":""}]
["Sør-ØstInformasjonssikkerhet25",null,null,null,null,{"$f":"+IFERROR(VLOOKUP(Database2[[#This Row],[Leverandør]],Kontaktinfo[],4,FALSE),\"\")","v":""}]
["Sør-ØstInformasjonssikkerhet26",null,null,null,null,{"$f":"+IFERROR(VLOOKUP(Database2[[#This Row],[Leverandør]],Kontaktinfo[],4,FALSE),\"\")","v":""}]
[null,null,null,null,null,{"$f":"+IFERROR(VLOOKUP(Database2[[#This Row],[Leverandør]],Kontaktinfo[],4,FALSE),\"\")","v":""}]
["Sør-ØstTestledelse og Release-gjennomføring1",null,null,null,null,{"$f":"+IFERROR(VLOOKUP(Database2[[#This Row],[Leverandør]],Kontaktinfo[],4,FALSE),\"\")","v":""}]
["Sør-ØstTestledelse og Release-gjennomføring2",null,null,null,null,{"$f":"+IFERROR(VLOOKUP(Database2[[#This Row],[Leverandør]],Kontaktinfo[],4,FALSE),\"\")","v":""}]
["Sør-ØstTestledelse og Release-gjennomføring3",null,null,null,null,{"$f":"+IFERROR(VLOOKUP(Database2[[#This Row],[Leverandør]],Kontaktinfo[],4,FALSE),\"\")","v":""}]
["Sør-ØstTestledelse og Release-gjennomføring4",null,null,null,null,{"$f":"+IFERROR(VLOOKUP(Database2[[#This Row],[Leverandør]],Kontaktinfo[],4,FALSE),\"\")","v":""}]
["Sør-ØstTestledelse og Release-gjennomføring5",null,null,null,null,{"$f":"+IFERROR(VLOOKUP(Database2[[#This Row],[Leverandør]],Kontaktinfo[],4,FALSE),\"\")","v":""}]
["Sør-ØstTestledelse og Release-gjennomføring6",null,null,null,null,{"$f":"+IFERROR(VLOOKUP(Database2[[#This Row],[Leverandør]],Kontaktinfo[],4,FALSE),\"\")","v":""}]
["Sør-ØstTestledelse og Release-gjennomføring7",null,null,null,null,{"$f":"+IFERROR(VLOOKUP(Database2[[#This Row],[Leverandør]],Kontaktinfo[],4,FALSE),\"\")","v":""}]
["Sør-ØstTestledelse og Release-gjennomføring8",null,null,null,null,{"$f":"+IFERROR(VLOOKUP(Database2[[#This Row],[Leverandør]],Kontaktinfo[],4,FALSE),\"\")","v":""}]
["Sør-ØstTestledelse og Release-gjennomføring9",null,null,null,null,{"$f":"+IFERROR(VLOOKUP(Database2[[#This Row],[Leverandør]],Kontaktinfo[],4,FALSE),\"\")","v":""}]
["Sør-ØstTestledelse og Release-gjennomføring10",null,null,null,null,{"$f":"+IFERROR(VLOOKUP(Database2[[#This Row],[Leverandør]],Kontaktinfo[],4,FALSE),\"\")","v":""}]
["Sør-ØstTestledelse og Release-gjennomføring11",null,null,null,null,{"$f":"+IFERROR(VLOOKUP(Database2[[#This Row],[Leverandør]],Kontaktinfo[],4,FALSE),\"\")","v":""}]
["Sør-ØstTestledelse og Release-gjennomføring12",null,null,null,null,{"$f":"+IFERROR(VLOOKUP(Database2[[#This Row],[Leverandør]],Kontaktinfo[],4,FALSE),\"\")","v":""}]
["Sør-ØstTestledelse og Release-gjennomføring13",null,null,null,null,{"$f":"+IFERROR(VLOOKUP(Database2[[#This Row],[Leverandør]],Kontaktinfo[],4,FALSE),\"\")","v":""}]
["Sør-ØstTestledelse og Release-gjennomføring14",null,null,null,null,{"$f":"+IFERROR(VLOOKUP(Database2[[#This Row],[Leverandør]],Kontaktinfo[],4,FALSE),\"\")","v":""}]
["Sør-ØstTestledelse og Release-gjennomføring15",null,null,null,null,{"$f":"+IFERROR(VLOOKUP(Database2[[#This Row],[Leverandør]],Kontaktinfo[],4,FALSE),\"\")","v":""}]
["Sør-ØstTestledelse og Release-gjennomføring16",null,null,null,null,{"$f":"+IFERROR(VLOOKUP(Database2[[#This Row],[Leverandør]],Kontaktinfo[],4,FALSE),\"\")","v":""}]
["Sør-ØstTestledelse og Release-gjennomføring17",null,null,null,null,{"$f":"+IFERROR(VLOOKUP(Database2[[#This Row],[Leverandør]],Kontaktinfo[],4,FALSE),\"\")","v":""}]
["Sør-ØstTestledelse og Release-gjennomføring18",null,null,null,null,{"$f":"+IFERROR(VLOOKUP(Database2[[#This Row],[Leverandør]],Kontaktinfo[],4,FALSE),\"\")","v":""}]
["Sør-ØstTestledelse og Release-gjennomføring19",null,null,null,null,{"$f":"+IFERROR(VLOOKUP(Database2[[#This Row],[Leverandør]],Kontaktinfo[],4,FALSE),\"\")","v":""}]
["Sør-ØstTestledelse og Release-gjennomføring20",null,null,null,null,{"$f":"+IFERROR(VLOOKUP(Database2[[#This Row],[Leverandør]],Kontaktinfo[],4,FALSE),\"\")","v":""}]
["Sør-ØstTestledelse og Release-gjennomføring21",null,null,null,null,{"$f":"+IFERROR(VLOOKUP(Database2[[#This Row],[Leverandør]],Kontaktinfo[],4,FALSE),\"\")","v":""}]
["Sør-ØstTestledelse og Release-gjennomføring22",null,null,null,null,{"$f":"+IFERROR(VLOOKUP(Database2[[#This Row],[Leverandør]],Kontaktinfo[],4,FALSE),\"\")","v":""}]
["Sør-ØstTestledelse og Release-gjennomføring23",null,null,null,null,{"$f":"+IFERROR(VLOOKUP(Database2[[#This Row],[Leverandør]],Kontaktinfo[],4,FALSE),\"\")","v":""}]
["Sør-ØstTestledelse og Release-gjennomføring24",null,null,null,null,{"$f":"+IFERROR(VLOOKUP(Database2[[#This Row],[Leverandør]],Kontaktinfo[],4,FALSE),\"\")","v":""}]
["Sør-ØstTestledelse og Release-gjennomføring25",null,null,null,null,{"$f":"+IFERROR(VLOOKUP(Database2[[#This Row],[Leverandør]],Kontaktinfo[],4,FALSE),\"\")","v":""}]
["Sør-ØstTestledelse og Release-gjennomføring26",null,null,null,null,{"$f":"+IFERROR(VLOOKUP(Database2[[#This Row],[Leverandør]],Kontaktinfo[],4,FALSE),\"\")","v":""}]
[null,null,null,null,null,{"$f":"+IFERROR(VLOOKUP(Database2[[#This Row],[Leverandør]],Kontaktinfo[],4,FALSE),\"\")","v":""}]
["Sør-ØstElektronisk samhandling/integrasjoner/systemutvikling1",null,null,null,null,{"$f":"+IFERROR(VLOOKUP(Database2[[#This Row],[Leverandør]],Kontaktinfo[],4,FALSE),\"\")","v":""}]
["Sør-ØstElektronisk samhandling/integrasjoner/systemutvikling2",null,null,null,null,{"$f":"+IFERROR(VLOOKUP(Database2[[#This Row],[Leverandør]],Kontaktinfo[],4,FALSE),\"\")","v":""}]
["Sør-ØstElektronisk samhandling/integrasjoner/systemutvikling3",null,null,null,null,{"$f":"+IFERROR(VLOOKUP(Database2[[#This Row],[Leverandør]],Kontaktinfo[],4,FALSE),\"\")","v":""}]
["Sør-ØstElektronisk samhandling/integrasjoner/systemutvikling4",null,null,null,null,{"$f":"+IFERROR(VLOOKUP(Database2[[#This Row],[Leverandør]],Kontaktinfo[],4,FALSE),\"\")","v":""}]
["Sør-ØstElektronisk samhandling/integrasjoner/systemutvikling5",null,null,null,null,{"$f":"+IFERROR(VLOOKUP(Database2[[#This Row],[Leverandør]],Kontaktinfo[],4,FALSE),\"\")","v":""}]
["Sør-ØstElektronisk samhandling/integrasjoner/systemutvikling6",null,null,null,null,{"$f":"+IFERROR(VLOOKUP(Database2[[#This Row],[Leverandør]],Kontaktinfo[],4,FALSE),\"\")","v":""}]
["Sør-ØstElektronisk samhandling/integrasjoner/systemutvikling7",null,null,null,null,{"$f":"+IFERROR(VLOOKUP(Database2[[#This Row],[Leverandør]],Kontaktinfo[],4,FALSE),\"\")","v":""}]
["Sør-ØstElektronisk samhandling/integrasjoner/systemutvikling8",null,null,null,null,{"$f":"+IFERROR(VLOOKUP(Database2[[#This Row],[Leverandør]],Kontaktinfo[],4,FALSE),\"\")","v":""}]
["Sør-ØstElektronisk samhandling/integrasjoner/systemutvikling9",null,null,null,null,{"$f":"+IFERROR(VLOOKUP(Database2[[#This Row],[Leverandør]],Kontaktinfo[],4,FALSE),\"\")","v":""}]
["Sør-ØstElektronisk samhandling/integrasjoner/systemutvikling10",null,null,null,null,{"$f":"+IFERROR(VLOOKUP(Database2[[#This Row],[Leverandør]],Kontaktinfo[],4,FALSE),\"\")","v":""}]
["Sør-ØstElektronisk samhandling/integrasjoner/systemutvikling11",null,null,null,null,{"$f":"+IFERROR(VLOOKUP(Database2[[#This Row],[Leverandør]],Kontaktinfo[],4,FALSE),\"\")","v":""}]
["Sør-ØstElektronisk samhandling/integrasjoner/systemutvikling12",null,null,null,null,{"$f":"+IFERROR(VLOOKUP(Database2[[#This Row],[Leverandør]],Kontaktinfo[],4,FALSE),\"\")","v":""}]
["Sør-ØstElektronisk samhandling/integrasjoner/systemutvikling13",null,null,null,null,{"$f":"+IFERROR(VLOOKUP(Database2[[#This Row],[Leverandør]],Kontaktinfo[],4,FALSE),\"\")","v":""}]
["Sør-ØstElektronisk samhandling/integrasjoner/systemutvikling14",null,null,null,null,{"$f":"+IFERROR(VLOOKUP(Database2[[#This Row],[Leverandør]],Kontaktinfo[],4,FALSE),\"\")","v":""}]
["Sør-ØstElektronisk samhandling/integrasjoner/systemutvikling15",null,null,null,null,{"$f":"+IFERROR(VLOOKUP(Database2[[#This Row],[Leverandør]],Kontaktinfo[],4,FALSE),\"\")","v":""}]
["Sør-ØstElektronisk samhandling/integrasjoner/systemutvikling16",null,null,null,null,{"$f":"+IFERROR(VLOOKUP(Database2[[#This Row],[Leverandør]],Kontaktinfo[],4,FALSE),\"\")","v":""}]
["Sør-ØstElektronisk samhandling/integrasjoner/systemutvikling17",null,null,null,null,{"$f":"+IFERROR(VLOOKUP(Database2[[#This Row],[Leverandør]],Kontaktinfo[],4,FALSE),\"\")","v":""}]
["Sør-ØstElektronisk samhandling/integrasjoner/systemutvikling18",null,null,null,null,{"$f":"+IFERROR(VLOOKUP(Database2[[#This Row],[Leverandør]],Kontaktinfo[],4,FALSE),\"\")","v":""}]
["Sør-ØstElektronisk samhandling/integrasjoner/systemutvikling19",null,null,null,null,{"$f":"+IFERROR(VLOOKUP(Database2[[#This Row],[Leverandør]],Kontaktinfo[],4,FALSE),\"\")","v":""}]
["Sør-ØstElektronisk samhandling/integrasjoner/systemutvikling20",null,null,null,null,{"$f":"+IFERROR(VLOOKUP(Database2[[#This Row],[Leverandør]],Kontaktinfo[],4,FALSE),\"\")","v":""}]
["Sør-ØstElektronisk samhandling/integrasjoner/systemutvikling21",null,null,null,null,{"$f":"+IFERROR(VLOOKUP(Database2[[#This Row],[Leverandør]],Kontaktinfo[],4,FALSE),\"\")","v":""}]
["Sør-ØstElektronisk samhandling/integrasjoner/systemutvikling22",null,null,null,null,{"$f":"+IFERROR(VLOOKUP(Database2[[#This Row],[Leverandør]],Kontaktinfo[],4,FALSE),\"\")","v":""}]
["Sør-ØstElektronisk samhandling/integrasjoner/systemutvikling23",null,null,null,null,{"$f":"+IFERROR(VLOOKUP(Database2[[#This Row],[Leverandør]],Kontaktinfo[],4,FALSE),\"\")","v":""}]
["Sør-ØstElektronisk samhandling/integrasjoner/systemutvikling24",null,null,null,null,{"$f":"+IFERROR(VLOOKUP(Database2[[#This Row],[Leverandør]],Kontaktinfo[],4,FALSE),\"\")","v":""}]
["Sør-ØstElektronisk samhandling/integrasjoner/systemutvikling25",null,null,null,null,{"$f":"+IFERROR(VLOOKUP(Database2[[#This Row],[Leverandør]],Kontaktinfo[],4,FALSE),\"\")","v":""}]
["Sør-ØstElektronisk samhandling/integrasjoner/systemutvikling26",null,null,null,null,{"$f":"+IFERROR(VLOOKUP(Database2[[#This Row],[Leverandør]],Kontaktinfo[],4,FALSE),\"\")","v":""}]
["Sør-ØstElektronisk samhandling/integrasjoner/systemutvikling",null,null,null,null,{"$f":"+IFERROR(VLOOKUP(Database2[[#This Row],[Leverandør]],Kontaktinfo[],4,FALSE),\"\")","v":""}]
[null,null,null,null,null,{"$f":"+IFERROR(VLOOKUP(Database2[[#This Row],[Leverandør]],Kontaktinfo[],4,FALSE),\"\")","v":""}]
["Sør-ØstDrift og Forvaltning av IT-systemer og plattformer1",null,null,null,null,{"$f":"+IFERROR(VLOOKUP(Database2[[#This Row],[Leverandør]],Kontaktinfo[],4,FALSE),\"\")","v":""}]
["Sør-ØstDrift og Forvaltning av IT-systemer og plattformer2",null,null,null,null,{"$f":"+IFERROR(VLOOKUP(Database2[[#This Row],[Leverandør]],Kontaktinfo[],4,FALSE),\"\")","v":""}]
["Sør-ØstDrift og Forvaltning av IT-systemer og plattformer3",null,null,null,null,{"$f":"+IFERROR(VLOOKUP(Database2[[#This Row],[Leverandør]],Kontaktinfo[],4,FALSE),\"\")","v":""}]
["Sør-ØstDrift og Forvaltning av IT-systemer og plattformer4",null,null,null,null,{"$f":"+IFERROR(VLOOKUP(Database2[[#This Row],[Leverandør]],Kontaktinfo[],4,FALSE),\"\")","v":""}]
["Sør-ØstDrift og Forvaltning av IT-systemer og plattformer5",null,null,null,null,{"$f":"+IFERROR(VLOOKUP(Database2[[#This Row],[Leverandør]],Kontaktinfo[],4,FALSE),\"\")","v":""}]
["Sør-ØstDrift og Forvaltning av IT-systemer og plattformer6",null,null,null,null,{"$f":"+IFERROR(VLOOKUP(Database2[[#This Row],[Leverandør]],Kontaktinfo[],4,FALSE),\"\")","v":""}]
["Sør-ØstDrift og Forvaltning av IT-systemer og plattformer7",null,null,null,null,{"$f":"+IFERROR(VLOOKUP(Database2[[#This Row],[Leverandør]],Kontaktinfo[],4,FALSE),\"\")","v":""}]
["Sør-ØstDrift og Forvaltning av IT-systemer og plattformer8",null,null,null,null,{"$f":"+IFERROR(VLOOKUP(Database2[[#This Row],[Leverandør]],Kontaktinfo[],4,FALSE),\"\")","v":""}]
["Sør-ØstDrift og Forvaltning av IT-systemer og plattformer9",null,null,null,null,{"$f":"+IFERROR(VLOOKUP(Database2[[#This Row],[Leverandør]],Kontaktinfo[],4,FALSE),\"\")","v":""}]
["Sør-ØstDrift og Forvaltning av IT-systemer og plattformer10",null,null,null,null,{"$f":"+IFERROR(VLOOKUP(Database2[[#This Row],[Leverandør]],Kontaktinfo[],4,FALSE),\"\")","v":""}]
["Sør-ØstDrift og Forvaltning av IT-systemer og plattformer11",null,null,null,null,{"$f":"+IFERROR(VLOOKUP(Database2[[#This Row],[Leverandør]],Kontaktinfo[],4,FALSE),\"\")","v":""}]
["Sør-ØstDrift og Forvaltning av IT-systemer og plattformer12",null,null,null,null,{"$f":"+IFERROR(VLOOKUP(Database2[[#This Row],[Leverandør]],Kontaktinfo[],4,FALSE),\"\")","v":""}]
["Sør-ØstDrift og Forvaltning av IT-systemer og plattformer13",null,null,null,null,{"$f":"+IFERROR(VLOOKUP(Database2[[#This Row],[Leverandør]],Kontaktinfo[],4,FALSE),\"\")","v":""}]
["Sør-ØstDrift og Forvaltning av IT-systemer og plattformer14",null,null,null,null,{"$f":"+IFERROR(VLOOKUP(Database2[[#This Row],[Leverandør]],Kontaktinfo[],4,FALSE),\"\")","v":""}]
["Sør-ØstDrift og Forvaltning av IT-systemer og plattformer15",null,null,null,null,{"$f":"+IFERROR(VLOOKUP(Database2[[#This Row],[Leverandør]],Kontaktinfo[],4,FALSE),\"\")","v":""}]
["Sør-ØstDrift og Forvaltning av IT-systemer og plattformer16",null,null,null,null,{"$f":"+IFERROR(VLOOKUP(Database2[[#This Row],[Leverandør]],Kontaktinfo[],4,FALSE),\"\")","v":""}]
["Sør-ØstDrift og Forvaltning av IT-systemer og plattformer17",null,null,null,null,{"$f":"+IFERROR(VLOOKUP(Database2[[#This Row],[Leverandør]],Kontaktinfo[],4,FALSE),\"\")","v":""}]
["Sør-ØstDrift og Forvaltning av IT-systemer og plattformer18",null,null,null,null,{"$f":"+IFERROR(VLOOKUP(Database2[[#This Row],[Leverandør]],Kontaktinfo[],4,FALSE),\"\")","v":""}]
["Sør-ØstDrift og Forvaltning av IT-systemer og plattformer19",null,null,null,null,{"$f":"+IFERROR(VLOOKUP(Database2[[#This Row],[Leverandør]],Kontaktinfo[],4,FALSE),\"\")","v":""}]
["Sør-ØstDrift og Forvaltning av IT-systemer og plattformer20",null,null,null,null,{"$f":"+IFERROR(VLOOKUP(Database2[[#This Row],[Leverandør]],Kontaktinfo[],4,FALSE),\"\")","v":""}]
["Sør-ØstDrift og Forvaltning av IT-systemer og plattformer21",null,null,null,null,{"$f":"+IFERROR(VLOOKUP(Database2[[#This Row],[Leverandør]],Kontaktinfo[],4,FALSE),\"\")","v":""}]
["Sør-ØstDrift og Forvaltning av IT-systemer og plattformer22",null,null,null,null,{"$f":"+IFERROR(VLOOKUP(Database2[[#This Row],[Leverandør]],Kontaktinfo[],4,FALSE),\"\")","v":""}]
["Sør-ØstDrift og Forvaltning av IT-systemer og plattformer23",null,null,null,null,{"$f":"+IFERROR(VLOOKUP(Database2[[#This Row],[Leverandør]],Kontaktinfo[],4,FALSE),\"\")","v":""}]
["Sør-ØstDrift og Forvaltning av IT-systemer og plattformer24",null,null,null,null,{"$f":"+IFERROR(VLOOKUP(Database2[[#This Row],[Leverandør]],Kontaktinfo[],4,FALSE),\"\")","v":""}]
["Sør-ØstDrift og Forvaltning av IT-systemer og plattformer25",null,null,null,null,{"$f":"+IFERROR(VLOOKUP(Database2[[#This Row],[Leverandør]],Kontaktinfo[],4,FALSE),\"\")","v":""}]
["Sør-ØstDrift og Forvaltning av IT-systemer og plattformer26",null,null,null,null,{"$f":"+IFERROR(VLOOKUP(Database2[[#This Row],[Leverandør]],Kontaktinfo[],4,FALSE),\"\")","v":""}]
[null,null,null,null,null,{"$f":"+IFERROR(VLOOKUP(Database2[[#This Row],[Leverandør]],Kontaktinfo[],4,FALSE),\"\")","v":""}]
["Sør-ØstDatakommunikasjon og Telekommunikasjon1",null,null,null,null,{"$f":"+IFERROR(VLOOKUP(Database2[[#This Row],[Leverandør]],Kontaktinfo[],4,FALSE),\"\")","v":""}]
["Sør-ØstDatakommunikasjon og Telekommunikasjon2",null,null,null,null,{"$f":"+IFERROR(VLOOKUP(Database2[[#This Row],[Leverandør]],Kontaktinfo[],4,FALSE),\"\")","v":""}]
["Sør-ØstDatakommunikasjon og Telekommunikasjon3",null,null,null,null,{"$f":"+IFERROR(VLOOKUP(Database2[[#This Row],[Leverandør]],Kontaktinfo[],4,FALSE),\"\")","v":""}]
["Sør-ØstDatakommunikasjon og Telekommunikasjon4",null,null,null,null,{"$f":"+IFERROR(VLOOKUP(Database2[[#This Row],[Leverandør]],Kontaktinfo[],4,FALSE),\"\")","v":""}]
["Sør-ØstDatakommunikasjon og Telekommunikasjon5",null,null,null,null,{"$f":"+IFERROR(VLOOKUP(Database2[[#This Row],[Leverandør]],Kontaktinfo[],4,FALSE),\"\")","v":""}]
["Sør-ØstDatakommunikasjon og Telekommunikasjon6",null,null,null,null,{"$f":"+IFERROR(VLOOKUP(Database2[[#This Row],[Leverandør]],Kontaktinfo[],4,FALSE),\"\")","v":""}]
["Sør-ØstDatakommunikasjon og Telekommunikasjon7",null,null,null,null,{"$f":"+IFERROR(VLOOKUP(Database2[[#This Row],[Leverandør]],Kontaktinfo[],4,FALSE),\"\")","v":""}]
["Sør-ØstDatakommunikasjon og Telekommunikasjon8",null,null,null,null,{"$f":"+IFERROR(VLOOKUP(Database2[[#This Row],[Leverandør]],Kontaktinfo[],4,FALSE),\"\")","v":""}]
["Sør-ØstDatakommunikasjon og Telekommunikasjon9",null,null,null,null,{"$f":"+IFERROR(VLOOKUP(Database2[[#This Row],[Leverandør]],Kontaktinfo[],4,FALSE),\"\")","v":""}]
["Sør-ØstDatakommunikasjon og Telekommunikasjon10",null,null,null,null,{"$f":"+IFERROR(VLOOKUP(Database2[[#This Row],[Leverandør]],Kontaktinfo[],4,FALSE),\"\")","v":""}]
["Sør-ØstDatakommunikasjon og Telekommunikasjon11",null,null,null,null,{"$f":"+IFERROR(VLOOKUP(Database2[[#This Row],[Leverandør]],Kontaktinfo[],4,FALSE),\"\")","v":""}]
["Sør-ØstDatakommunikasjon og Telekommunikasjon12",null,null,null,null,{"$f":"+IFERROR(VLOOKUP(Database2[[#This Row],[Leverandør]],Kontaktinfo[],4,FALSE),\"\")","v":""}]
["Sør-ØstDatakommunikasjon og Telekommunikasjon13",null,null,null,null,{"$f":"+IFERROR(VLOOKUP(Database2[[#This Row],[Leverandør]],Kontaktinfo[],4,FALSE),\"\")","v":""}]
["Sør-ØstDatakommunikasjon og Telekommunikasjon14",null,null,null,null,{"$f":"+IFERROR(VLOOKUP(Database2[[#This Row],[Leverandør]],Kontaktinfo[],4,FALSE),\"\")","v":""}]
["Sør-ØstDatakommunikasjon og Telekommunikasjon15",null,null,null,null,{"$f":"+IFERROR(VLOOKUP(Database2[[#This Row],[Leverandør]],Kontaktinfo[],4,FALSE),\"\")","v":""}]
["Sør-ØstDatakommunikasjon og Telekommunikasjon16",null,null,null,null,{"$f":"+IFERROR(VLOOKUP(Database2[[#This Row],[Leverandør]],Kontaktinfo[],4,FALSE),\"\")","v":""}]
["Sør-ØstDatakommunikasjon og Telekommunikasjon17",null,null,null,null,{"$f":"+IFERROR(VLOOKUP(Database2[[#This Row],[Leverandør]],Kontaktinfo[],4,FALSE),\"\")","v":""}]
["Sør-ØstDatakommunikasjon og Telekommunikasjon18",null,null,null,null,{"$f":"+IFERROR(VLOOKUP(Database2[[#This Row],[Leverandør]],Kontaktinfo[],4,FALSE),\"\")","v":""}]
["Sør-ØstDatakommunikasjon og Telekommunikasjon19",null,null,null,null,{"$f":"+IFERROR(VLOOKUP(Database2[[#This Row],[Leverandør]],Kontaktinfo[],4,FALSE),\"\")","v":""}]
["Sør-ØstDatakommunikasjon og Telekommunikasjon20",null,null,null,null,{"$f":"+IFERROR(VLOOKUP(Database2[[#This Row],[Leverandør]],Kontaktinfo[],4,FALSE),\"\")","v":""}]
["Sør-ØstDatakommunikasjon og Telekommunikasjon21",null,null,null,null,{"$f":"+IFERROR(VLOOKUP(Database2[[#This Row],[Leverandør]],Kontaktinfo[],4,FALSE),\"\")","v":""}]
["Sør-ØstDatakommunikasjon og Telekommunikasjon22",null,null,null,null,{"$f":"+IFERROR(VLOOKUP(Database2[[#This Row],[Leverandør]],Kontaktinfo[],4,FALSE),\"\")","v":""}]
["Sør-ØstDatakommunikasjon og Telekommunikasjon23",null,null,null,null,{"$f":"+IFERROR(VLOOKUP(Database2[[#This Row],[Leverandør]],Kontaktinfo[],4,FALSE),\"\")","v":""}]
["Sør-ØstDatakommunikasjon og Telekommunikasjon24",null,null,null,null,{"$f":"+IFERROR(VLOOKUP(Database2[[#This Row],[Leverandør]],Kontaktinfo[],4,FALSE),\"\")","v":""}]
["Sør-ØstDatakommunikasjon og Telekommunikasjon25",null,null,null,null,{"$f":"+IFERROR(VLOOKUP(Database2[[#This Row],[Leverandør]],Kontaktinfo[],4,FALSE),\"\")","v":""}]
["Sør-ØstDatakommunikasjon og Telekommunikasjon26",null,null,null,null,{"$f":"+IFERROR(VLOOKUP(Database2[[#This Row],[Leverandør]],Kontaktinfo[],4,FALSE),\"\")","v":""}]
[null,null,null,null,null,{"$f":"+IFERROR(VLOOKUP(Database2[[#This Row],[Leverandør]],Kontaktinfo[],4,FALSE),\"\")","v":""}]
["Sør-ØstApplikasjonsforvaltning1",null,null,null,null,{"$f":"+IFERROR(VLOOKUP(Database2[[#This Row],[Leverandør]],Kontaktinfo[],4,FALSE),\"\")","v":""}]
["Sør-ØstApplikasjonsforvaltning2",null,null,null,null,{"$f":"+IFERROR(VLOOKUP(Database2[[#This Row],[Leverandør]],Kontaktinfo[],4,FALSE),\"\")","v":""}]
["Sør-ØstApplikasjonsforvaltning3",null,null,null,null,{"$f":"+IFERROR(VLOOKUP(Database2[[#This Row],[Leverandør]],Kontaktinfo[],4,FALSE),\"\")","v":""}]
["Sør-ØstApplikasjonsforvaltning4",null,null,null,null,{"$f":"+IFERROR(VLOOKUP(Database2[[#This Row],[Leverandør]],Kontaktinfo[],4,FALSE),\"\")","v":""}]
["Sør-ØstApplikasjonsforvaltning5",null,null,null,null,{"$f":"+IFERROR(VLOOKUP(Database2[[#This Row],[Leverandør]],Kontaktinfo[],4,FALSE),\"\")","v":""}]
["Sør-ØstApplikasjonsforvaltning6",null,null,null,null,{"$f":"+IFERROR(VLOOKUP(Database2[[#This Row],[Leverandør]],Kontaktinfo[],4,FALSE),\"\")","v":""}]
["Sør-ØstApplikasjonsforvaltning7",null,null,null,null,{"$f":"+IFERROR(VLOOKUP(Database2[[#This Row],[Leverandør]],Kontaktinfo[],4,FALSE),\"\")","v":""}]
["Sør-ØstApplikasjonsforvaltning8",null,null,null,null,{"$f":"+IFERROR(VLOOKUP(Database2[[#This Row],[Leverandør]],Kontaktinfo[],4,FALSE),\"\")","v":""}]
["Sør-ØstApplikasjonsforvaltning9",null,null,null,null,{"$f":"+IFERROR(VLOOKUP(Database2[[#This Row],[Leverandør]],Kontaktinfo[],4,FALSE),\"\")","v":""}]
["Sør-ØstApplikasjonsforvaltning10",null,null,null,null,{"$f":"+IFERROR(VLOOKUP(Database2[[#This Row],[Leverandør]],Kontaktinfo[],4,FALSE),\"\")","v":""}]
["Sør-ØstApplikasjonsforvaltning11",null,null,null,null,{"$f":"+IFERROR(VLOOKUP(Database2[[#This Row],[Leverandør]],Kontaktinfo[],4,FALSE),\"\")","v":""}]
["Sør-ØstApplikasjonsforvaltning12",null,null,null,null,{"$f":"+IFERROR(VLOOKUP(Database2[[#This Row],[Leverandør]],Kontaktinfo[],4,FALSE),\"\")","v":""}]
["Sør-ØstApplikasjonsforvaltning13",null,null,null,null,{"$f":"+IFERROR(VLOOKUP(Database2[[#This Row],[Leverandør]],Kontaktinfo[],4,FALSE),\"\")","v":""}]
["Sør-ØstApplikasjonsforvaltning14",null,null,null,null,{"$f":"+IFERROR(VLOOKUP(Database2[[#This Row],[Leverandør]],Kontaktinfo[],4,FALSE),\"\")","v":""}]
["Sør-ØstApplikasjonsforvaltning15",null,null,null,null,{"$f":"+IFERROR(VLOOKUP(Database2[[#This Row],[Leverandør]],Kontaktinfo[],4,FALSE),\"\")","v":""}]
["Sør-ØstApplikasjonsforvaltning16",null,null,null,null,{"$f":"+IFERROR(VLOOKUP(Database2[[#This Row],[Leverandør]],Kontaktinfo[],4,FALSE),\"\")","v":""}]
["Sør-ØstApplikasjonsforvaltning17",null,null,null,null,{"$f":"+IFERROR(VLOOKUP(Database2[[#This Row],[Leverandør]],Kontaktinfo[],4,FALSE),\"\")","v":""}]
["Sør-ØstApplikasjonsforvaltning18",null,null,null,null,{"$f":"+IFERROR(VLOOKUP(Database2[[#This Row],[Leverandør]],Kontaktinfo[],4,FALSE),\"\")","v":""}]
["Sør-ØstApplikasjonsforvaltning19",null,null,null,null,{"$f":"+IFERROR(VLOOKUP(Database2[[#This Row],[Leverandør]],Kontaktinfo[],4,FALSE),\"\")","v":""}]
["Sør-ØstApplikasjonsforvaltning20",null,null,null,null,{"$f":"+IFERROR(VLOOKUP(Database2[[#This Row],[Leverandør]],Kontaktinfo[],4,FALSE),\"\")","v":""}]
["Sør-ØstApplikasjonsforvaltning21",null,null,null,null,{"$f":"+IFERROR(VLOOKUP(Database2[[#This Row],[Leverandør]],Kontaktinfo[],4,FALSE),\"\")","v":""}]
["Sør-ØstApplikasjonsforvaltning22",null,null,null,null,{"$f":"+IFERROR(VLOOKUP(Database2[[#This Row],[Leverandør]],Kontaktinfo[],4,FALSE),\"\")","v":""}]
["Sør-ØstApplikasjonsforvaltning23",null,null,null,null,{"$f":"+IFERROR(VLOOKUP(Database2[[#This Row],[Leverandør]],Kontaktinfo[],4,FALSE),\"\")","v":""}]
["Sør-ØstApplikasjonsforvaltning24",null,null,null,null,{"$f":"+IFERROR(VLOOKUP(Database2[[#This Row],[Leverandør]],Kontaktinfo[],4,FALSE),\"\")","v":""}]
["Sør-ØstApplikasjonsforvaltning25",null,null,null,null,{"$f":"+IFERROR(VLOOKUP(Database2[[#This Row],[Leverandør]],Kontaktinfo[],4,FALSE),\"\")","v":""}]
["Sør-ØstApplikasjonsforvaltning26",null,null,null,null,{"$f":"+IFERROR(VLOOKUP(Database2[[#This Row],[Leverandør]],Kontaktinfo[],4,FALSE),\"\")","v":""}]
[null,null,null,null,null,{"$f":"+IFERROR(VLOOKUP(Database2[[#This Row],[Leverandør]],Kontaktinfo[],4,FALSE),\"\")","v":""}]
["Sør-ØstKlientplattform1",null,null,null,null,{"$f":"+IFERROR(VLOOKUP(Database2[[#This Row],[Leverandør]],Kontaktinfo[],4,FALSE),\"\")","v":""}]
["Sør-ØstKlientplattform2",null,null,null,null,{"$f":"+IFERROR(VLOOKUP(Database2[[#This Row],[Leverandør]],Kontaktinfo[],4,FALSE),\"\")","v":""}]
["Sør-ØstKlientplattform3",null,null,null,null,{"$f":"+IFERROR(VLOOKUP(Database2[[#This Row],[Leverandør]],Kontaktinfo[],4,FALSE),\"\")","v":""}]
["Sør-ØstKlientplattform4",null,null,null,null,{"$f":"+IFERROR(VLOOKUP(Database2[[#This Row],[Leverandør]],Kontaktinfo[],4,FALSE),\"\")","v":""}]
["Sør-ØstKlientplattform5",null,null,null,null,{"$f":"+IFERROR(VLOOKUP(Database2[[#This Row],[Leverandør]],Kontaktinfo[],4,FALSE),\"\")","v":""}]
["Sør-ØstKlientplattform6",null,null,null,null,{"$f":"+IFERROR(VLOOKUP(Database2[[#This Row],[Leverandør]],Kontaktinfo[],4,FALSE),\"\")","v":""}]
["Sør-ØstKlientplattform7",null,null,null,null,{"$f":"+IFERROR(VLOOKUP(Database2[[#This Row],[Leverandør]],Kontaktinfo[],4,FALSE),\"\")","v":""}]
["Sør-ØstKlientplattform8",null,null,null,null,{"$f":"+IFERROR(VLOOKUP(Database2[[#This Row],[Leverandør]],Kontaktinfo[],4,FALSE),\"\")","v":""}]
["Sør-ØstKlientplattform9",null,null,null,null,{"$f":"+IFERROR(VLOOKUP(Database2[[#This Row],[Leverandør]],Kontaktinfo[],4,FALSE),\"\")","v":""}]
["Sør-ØstKlientplattform10",null,null,null,null,{"$f":"+IFERROR(VLOOKUP(Database2[[#This Row],[Leverandør]],Kontaktinfo[],4,FALSE),\"\")","v":""}]
["Sør-ØstKlientplattform11",null,null,null,null,{"$f":"+IFERROR(VLOOKUP(Database2[[#This Row],[Leverandør]],Kontaktinfo[],4,FALSE),\"\")","v":""}]
["Sør-ØstKlientplattform12",null,null,null,null,{"$f":"+IFERROR(VLOOKUP(Database2[[#This Row],[Leverandør]],Kontaktinfo[],4,FALSE),\"\")","v":""}]
["Sør-ØstKlientplattform13",null,null,null,null,{"$f":"+IFERROR(VLOOKUP(Database2[[#This Row],[Leverandør]],Kontaktinfo[],4,FALSE),\"\")","v":""}]
["Sør-ØstKlientplattform14",null,null,null,null,{"$f":"+IFERROR(VLOOKUP(Database2[[#This Row],[Leverandør]],Kontaktinfo[],4,FALSE),\"\")","v":""}]
["Sør-ØstKlientplattform15",null,null,null,null,{"$f":"+IFERROR(VLOOKUP(Database2[[#This Row],[Leverandør]],Kontaktinfo[],4,FALSE),\"\")","v":""}]
["Sør-ØstKlientplattform16",null,null,null,null,{"$f":"+IFERROR(VLOOKUP(Database2[[#This Row],[Leverandør]],Kontaktinfo[],4,FALSE),\"\")","v":""}]
["Sør-ØstKlientplattform17",null,null,null,null,{"$f":"+IFERROR(VLOOKUP(Database2[[#This Row],[Leverandør]],Kontaktinfo[],4,FALSE),\"\")","v":""}]
["Sør-ØstKlientplattform18",null,null,null,null,{"$f":"+IFERROR(VLOOKUP(Database2[[#This Row],[Leverandør]],Kontaktinfo[],4,FALSE),\"\")","v":""}]
["Sør-ØstKlientplattform19",null,null,null,null,{"$f":"+IFERROR(VLOOKUP(Database2[[#This Row],[Leverandør]],Kontaktinfo[],4,FALSE),\"\")","v":""}]
["Sør-ØstKlientplattform20",null,null,null,null,{"$f":"+IFERROR(VLOOKUP(Database2[[#This Row],[Leverandør]],Kontaktinfo[],4,FALSE),\"\")","v":""}]
["Sør-ØstKlientplattform21",null,null,null,null,{"$f":"+IFERROR(VLOOKUP(Database2[[#This Row],[Leverandør]],Kontaktinfo[],4,FALSE),\"\")","v":""}]
["Sør-ØstKlientplattform22",null,null,null,null,{"$f":"+IFERROR(VLOOKUP(Database2[[#This Row],[Leverandør]],Kontaktinfo[],4,FALSE),\"\")","v":""}]
["Sør-ØstKlientplattform23",null,null,null,null,{"$f":"+IFERROR(VLOOKUP(Database2[[#This Row],[Leverandør]],Kontaktinfo[],4,FALSE),\"\")","v":""}]
["Sør-ØstKlientplattform24",null,null,null,null,{"$f":"+IFERROR(VLOOKUP(Database2[[#This Row],[Leverandør]],Kontaktinfo[],4,FALSE),\"\")","v":""}]
["Sør-ØstKlientplattform25",null,null,null,null,{"$f":"+IFERROR(VLOOKUP(Database2[[#This Row],[Leverandør]],Kontaktinfo[],4,FALSE),\"\")","v":""}]
["Sør-ØstKlientplattform26",null,null,null,null,{"$f":"+IFERROR(VLOOKUP(Database2[[#This Row],[Leverandør]],Kontaktinfo[],4,FALSE),\"\")","v":""}]
[null,null,null,null,null,{"$f":"+IFERROR(VLOOKUP(Database2[[#This Row],[Leverandør]],Kontaktinfo[],4,FALSE),\"\")","v":""}]
["Sør-ØstKonsulentformidling/Broker1",null,null,null,null,{"$f":"+IFERROR(VLOOKUP(Database2[[#This Row],[Leverandør]],Kontaktinfo[],4,FALSE),\"\")","v":""}]
["Sør-ØstKonsulentformidling/Broker2",null,null,null,null,{"$f":"+IFERROR(VLOOKUP(Database2[[#This Row],[Leverandør]],Kontaktinfo[],4,FALSE),\"\")","v":""}]
["Sør-ØstKonsulentformidling/Broker3",null,null,null,null,{"$f":"+IFERROR(VLOOKUP(Database2[[#This Row],[Leverandør]],Kontaktinfo[],4,FALSE),\"\")","v":""}]
["Sør-ØstKonsulentformidling/Broker4",null,null,null,null,{"$f":"+IFERROR(VLOOKUP(Database2[[#This Row],[Leverandør]],Kontaktinfo[],4,FALSE),\"\")","v":""}]
["Sør-ØstKonsulentformidling/Broker5",null,null,null,null,{"$f":"+IFERROR(VLOOKUP(Database2[[#This Row],[Leverandør]],Kontaktinfo[],4,FALSE),\"\")","v":""}]
["Sør-ØstKonsulentformidling/Broker6",null,null,null,null,{"$f":"+IFERROR(VLOOKUP(Database2[[#This Row],[Leverandør]],Kontaktinfo[],4,FALSE),\"\")","v":""}]
["Sør-ØstKonsulentformidling/Broker7",null,null,null,null,{"$f":"+IFERROR(VLOOKUP(Database2[[#This Row],[Leverandør]],Kontaktinfo[],4,FALSE),\"\")","v":""}]
["Sør-ØstKonsulentformidling/Broker8",null,null,null,null,{"$f":"+IFERROR(VLOOKUP(Database2[[#This Row],[Leverandør]],Kontaktinfo[],4,FALSE),\"\")","v":""}]
["Sør-ØstKonsulentformidling/Broker9",null,null,null,null,{"$f":"+IFERROR(VLOOKUP(Database2[[#This Row],[Leverandør]],Kontaktinfo[],4,FALSE),\"\")","v":""}]
["Sør-ØstKonsulentformidling/Broker10",null,null,null,null,{"$f":"+IFERROR(VLOOKUP(Database2[[#This Row],[Leverandør]],Kontaktinfo[],4,FALSE),\"\")","v":""}]
["Sør-ØstKonsulentformidling/Broker11",null,null,null,null,{"$f":"+IFERROR(VLOOKUP(Database2[[#This Row],[Leverandør]],Kontaktinfo[],4,FALSE),\"\")","v":""}]
["Sør-ØstKonsulentformidling/Broker12",null,null,null,null,{"$f":"+IFERROR(VLOOKUP(Database2[[#This Row],[Leverandør]],Kontaktinfo[],4,FALSE),\"\")","v":""}]
["Sør-ØstKonsulentformidling/Broker13",null,null,null,null,{"$f":"+IFERROR(VLOOKUP(Database2[[#This Row],[Leverandør]],Kontaktinfo[],4,FALSE),\"\")","v":""}]
["Sør-ØstKonsulentformidling/Broker14",null,null,null,null,{"$f":"+IFERROR(VLOOKUP(Database2[[#This Row],[Leverandør]],Kontaktinfo[],4,FALSE),\"\")","v":""}]
["Sør-ØstKonsulentformidling/Broker15",null,null,null,null,{"$f":"+IFERROR(VLOOKUP(Database2[[#This Row],[Leverandør]],Kontaktinfo[],4,FALSE),\"\")","v":""}]
["Sør-ØstKonsulentformidling/Broker16",null,null,null,null,{"$f":"+IFERROR(VLOOKUP(Database2[[#This Row],[Leverandør]],Kontaktinfo[],4,FALSE),\"\")","v":""}]
["Sør-ØstKonsulentformidling/Broker17",null,null,null,null,{"$f":"+IFERROR(VLOOKUP(Database2[[#This Row],[Leverandør]],Kontaktinfo[],4,FALSE),\"\")","v":""}]
["Sør-ØstKonsulentformidling/Broker18",null,null,null,null,{"$f":"+IFERROR(VLOOKUP(Database2[[#This Row],[Leverandør]],Kontaktinfo[],4,FALSE),\"\")","v":""}]
["Sør-ØstKonsulentformidling/Broker19",null,null,null,null,{"$f":"+IFERROR(VLOOKUP(Database2[[#This Row],[Leverandør]],Kontaktinfo[],4,FALSE),\"\")","v":""}]
["Sør-ØstKonsulentformidling/Broker20",null,null,null,null,{"$f":"+IFERROR(VLOOKUP(Database2[[#This Row],[Leverandør]],Kontaktinfo[],4,FALSE),\"\")","v":""}]
["Sør-ØstKonsulentformidling/Broker21",null,null,null,null,{"$f":"+IFERROR(VLOOKUP(Database2[[#This Row],[Leverandør]],Kontaktinfo[],4,FALSE),\"\")","v":""}]
["Sør-ØstKonsulentformidling/Broker22",null,null,null,null,{"$f":"+IFERROR(VLOOKUP(Database2[[#This Row],[Leverandør]],Kontaktinfo[],4,FALSE),\"\")","v":""}]
["Sør-ØstKonsulentformidling/Broker23",null,null,null,null,{"$f":"+IFERROR(VLOOKUP(Database2[[#This Row],[Leverandør]],Kontaktinfo[],4,FALSE),\"\")","v":""}]
["Sør-ØstKonsulentformidling/Broker24",null,null,null,null,{"$f":"+IFERROR(VLOOKUP(Database2[[#This Row],[Leverandør]],Kontaktinfo[],4,FALSE),\"\")","v":""}]
["Sør-ØstKonsulentformidling/Broker25",null,null,null,null,{"$f":"+IFERROR(VLOOKUP(Database2[[#This Row],[Leverandør]],Kontaktinfo[],4,FALSE),\"\")","v":""}]
["Sør-ØstKonsulentformidling/Broker26",null,null,null,null,{"$f":"+IFERROR(VLOOKUP(Database2[[#This Row],[Leverandør]],Kontaktinfo[],4,FALSE),\"\")","v":""}]
[{"$f":"Database!$B3057&Database!$C3057&Database!$D3057","v":""},null,null,null,null,{"$f":"+IFERROR(VLOOKUP(Database2[[#This Row],[Leverandør]],Kontaktinfo[],4,FALSE),\"\")","v":""}]

{"sheet":"kontaktinfo","index":2,"n_rows":537,"n_cols":4,"rows_kept":537,"cut":false,"hidden":true,"merged":[]}
["Leverandør","Delkontrakt","RHF","Generisk epost"]
["A-2 Norge AS","A. Program- og prosjektgjennomføring","Helse Nord","utlysninger@a-2.no"]
["A-2 Norge AS","A. Program- og prosjektgjennomføring","Helse Sør-Øst","utlysninger@a-2.no"]
["A-2 Norge AS","A. Program- og prosjektgjennomføring","Helse Midt-Norge","utlysninger@a-2.no"]
["A-2 Norge AS","A. Program- og prosjektgjennomføring","Helse Vest","utlysninger@a-2.no"]
["A-2 Norge AS","B. Strategiplanlegging, rådgivning og innovasjon","Helse Nord","utlysninger@a-2.no"]
["A-2 Norge AS","B. Strategiplanlegging, rådgivning og innovasjon","Helse Sør-Øst","utlysninger@a-2.no"]
["A-2 Norge AS","B. Strategiplanlegging, rådgivning og innovasjon","Helse Midt-Norge","utlysninger@a-2.no"]
["A-2 Norge AS","B. Strategiplanlegging, rådgivning og innovasjon","Helse Vest","utlysninger@a-2.no"]
["A-2 Norge AS","C. Arkitektur","Helse Nord","utlysninger@a-2.no"]
["A-2 Norge AS","C. Arkitektur","Helse Sør-Øst","utlysninger@a-2.no"]
["A-2 Norge AS","C. Arkitektur","Helse Midt-Norge","utlysninger@a-2.no"]
["A-2 Norge AS","C. Arkitektur","Helse Vest","utlysninger@a-2.no"]
["A-2 Norge AS","D. Informasjonssikkerhet og ROS-analyser","Helse Nord","utlysninger@a-2.no"]
["A-2 Norge AS","D. Informasjonssikkerhet og ROS-analyser","Helse Sør-Øst","utlysninger@a-2.no"]
["A-2 Norge AS","D. Informasjonssikkerhet og ROS-analyser","Helse Midt-Norge","utlysninger@a-2.no"]
["A-2 Norge AS","D. Informasjonssikkerhet og ROS-analyser","Helse Vest","utlysninger@a-2.no"]
["A-2 Norge AS","E. Test og release","Helse Nord","utlysninger@a-2.no"]
["A-2 Norge AS","E. Test og release","Helse Midt-Norge","utlysninger@a-2.no"]
["A-2 Norge AS","E. Test og release","Helse Vest","utlysninger@a-2.no"]
["A-2 Norge AS","F. Systemutvikling","Helse Nord","utlysninger@a-2.no"]
["A-2 Norge AS","F. Systemutvikling","Helse Midt-Norge","utlysninger@a-2.no"]
["A-2 Norge AS","F. Systemutvikling","Helse Vest","utlysninger@a-2.no"]
["A-2 Norge AS","G. Applikasjonsforvaltning, drift og forvaltning av IT-systemer og plattformer","Helse Nord","utlysninger@a-2.no"]
["A-2 Norge AS","G. Applikasjonsforvaltning, drift og forvaltning av IT-systemer og plattformer","Helse Sør-Øst","utlysninger@a-2.no"]
["A-2 Norge AS","G. Applikasjonsforvaltning, drift og forvaltning av IT-systemer og plattformer","Helse Midt-Norge","utlysninger@a-2.no"]
["A-2 Norge AS","G. Applikasjonsforvaltning, drift og forvaltning av IT-systemer og plattformer","Helse Vest","utlysninger@a-2.no"]
["A-2 Norge AS","H. Nettverk","Helse Nord","utlysninger@a-2.no"]
["A-2 Norge AS","H. Nettverk","Helse Sør-Øst","utlysninger@a-2.no"]
["A-2 Norge AS","H. Nettverk","Helse Midt-Norge","utlysninger@a-2.no"]
["A-2 Norge AS","H. Nettverk","Helse Vest","utlysninger@a-2.no"]
["A-2 Norge AS","I. Telekommunikasjon","Helse Nord","utlysninger@a-2.no"]
["A-2 Norge AS","I. Telekommunikasjon","Helse Sør-Øst","utlysninger@a-2.no"]
["A-2 Norge AS","I. Telekommunikasjon","Helse Midt-Norge","utlysninger@a-2.no"]
["A-2 Norge AS","I. Telekommunikasjon","Helse Vest","utlysninger@a-2.no"]
["A-2 Norge AS","J. Tverrfaglige team","Helse Nord","utlysninger@a-2.no"]
["A-2 Norge AS","J. Tverrfaglige team","Helse Sør-Øst","utlysninger@a-2.no"]
["A-2 Norge AS","J. Tverrfaglige team","Helse Midt-Norge","utlysninger@a-2.no"]
["A-2 Norge AS","J. Tverrfaglige team","Helse Vest","utlysninger@a-2.no"]
["Aboveit AS ","E. Test og release","Helse Nord","salg@aboveit.no "]
["Aboveit AS ","E. Test og release","Helse Sør-Øst","salg@aboveit.no "]
["Aboveit AS ","E. Test og release","Helse Midt-Norge","salg@aboveit.no "]
["Aboveit AS ","E. Test og release","Helse Vest","salg@aboveit.no "]
["Aboveit AS ","F. Systemutvikling","Helse Nord","salg@aboveit.no "]
["Aboveit AS ","F. Systemutvikling","Helse Sør-Øst","salg@aboveit.no "]
["Aboveit AS ","F. Systemutvikling","Helse Midt-Norge","salg@aboveit.no "]
["Aboveit AS ","F. Systemutvikling","Helse Vest","salg@aboveit.no "]
["Accenture AS ","A. Program- og prosjektgjennomføring","Helse Sør-Øst","rammeavtale.helse@accenture.com"]
["Accenture AS ","A. Program- og prosjektgjennomføring","Helse Nord","rammeavtale.helse@accenture.com"]
["Accenture AS ","A. Program- og prosjektgjennomføring","Helse Vest","rammeavtale.helse@accenture.com"]
["Accenture AS ","B. Strategiplanlegging, rådgivning og innovasjon","Helse Sør-Øst","rammeavtale.helse@accenture.com"]
["Accenture AS ","B. Strategiplanlegging, rådgivning og innovasjon","Helse Midt-Norge","rammeavtale.helse@accenture.com"]
["Accenture AS ","B. Strategiplanlegging, rådgivning og innovasjon","Helse Vest","rammeavtale.helse@accenture.com"]
["Accenture AS ","C. Arkitektur","Helse Sør-Øst","rammeavtale.helse@accenture.com"]
["Accenture AS ","C. Arkitektur","Helse Midt-Norge","rammeavtale.helse@accenture.com"]
["Accenture AS ","C. Arkitektur","Helse Vest","rammeavtale.helse@accenture.com"]
["Accenture AS ","D. Informasjonssikkerhet og ROS-analyser","Helse Nord","rammeavtale.helse@accenture.com"]
["Accenture AS ","D. Informasjonssikkerhet og ROS-analyser","Helse Midt-Norge","rammeavtale.helse@accenture.com"]
["Accenture AS ","D. Informasjonssikkerhet og ROS-analyser","Helse Vest","rammeavtale.helse@accenture.com"]
["Accenture AS ","E. Test og release","Helse Nord","rammeavtale.helse@accenture.com"]
["Accenture AS ","E. Test og release","Helse Midt-Norge","rammeavtale.helse@accenture.com"]
["Accenture AS ","E. Test og release","Helse Vest","rammeavtale.helse@accenture.com"]
["Accenture AS ","F. Systemutvikling","Helse Nord","rammeavtale.helse@accenture.com"]
["Accenture AS ","F. Systemutvikling","Helse Midt-Norge","rammeavtale.helse@accenture.com"]
["Accenture AS ","F. Systemutvikling","Helse Vest","rammeavtale.helse@accenture.com"]
["Accenture AS ","J. Tverrfaglige team","Helse Nord","rammeavtale.helse@accenture.com"]
["Accenture AS ","J. Tverrfaglige team","Helse Sør-Øst","rammeavtale.helse@accenture.com"]
["Accenture AS ","J. Tverrfaglige team","Helse Midt-Norge","rammeavtale.helse@accenture.com"]
["Accenture AS ","J. Tverrfaglige team","Helse Vest","rammeavtale.helse@accenture.com"]
["Systra Norge AS ","A. Program- og prosjektgjennomføring","Helse Nord","firmapost@systra.com"]
["Systra Norge AS ","A. Program- og prosjektgjennomføring","Helse Sør-Øst","firmapost@systra.com"]
["Systra Norge AS ","A. Program- og prosjektgjennomføring","Helse Midt-Norge","firmapost@systra.com"]
["Systra Norge AS ","A. Program- og prosjektgjennomføring","Helse Vest","firmapost@systra.com"]
["Systra Norge AS ","B. Strategiplanlegging, rådgivning og innovasjon","Helse Nord","firmapost@systra.com"]
["Systra Norge AS ","B. Strategiplanlegging, rådgivning og innovasjon","Helse Sør-Øst","firmapost@systra.com"]
["Systra Norge AS ","B. Strategiplanlegging, rådgivning og innovasjon","Helse Midt-Norge","firmapost@systra.com"]
["Systra Norge AS ","B. Strategiplanlegging, rådgivning og innovasjon","Helse Vest","firmapost@systra.com"]
["Systra Norge AS ","C. Arkitektur","Helse Nord","firmapost@systra.com"]
["Systra Norge AS ","C. Arkitektur","Helse Sør-Øst","firmapost@systra.com"]
["Systra Norge AS ","C. Arkitektur","Helse Midt-Norge","firmapost@systra.com"]
["Systra Norge AS ","C. Arkitektur","Helse Vest","firmapost@systra.com"]
["Systra Norge AS ","D. Informasjonssikkerhet og ROS-analyser","Helse Nord","firmapost@systra.com"]
["Systra Norge AS ","D. Informasjonssikkerhet og ROS-analyser","Helse Sør-Øst","firmapost@systra.com"]
["Systra Norge AS ","D. Informasjonssikkerhet og ROS-analyser","Helse Midt-Norge","firmapost@systra.com"]
["Systra Norge AS ","D. Informasjonssikkerhet og ROS-analyser","Helse Vest","firmapost@systra.com"]
["Systra Norge AS ","E. Test og release","Helse Nord","firmapost@systra.com"]
["Systra Norge AS ","E. Test og release","Helse Sør-Øst","firmapost@systra.com"]
["Systra Norge AS ","E. Test og release","Helse Midt-Norge","firmapost@systra.com"]
["Systra Norge AS ","E. Test og release","Helse Vest","firmapost@systra.com"]
["Systra Norge AS ","F. Systemutvikling","Helse Nord","firmapost@systra.com"]
["Systra Norge AS ","F. Systemutvikling","Helse Sør-Øst","firmapost@systra.com"]
["Systra Norge AS ","F. Systemutvikling","Helse Midt-Norge","firmapost@systra.com"]
["Systra Norge AS ","F. Systemutvikling","Helse Vest","firmapost@systra.com"]
["Bouvet Norge AS ","A. Program- og prosjektgjennomføring","Helse Nord","Sykehusinnkjop2023@bouvet.no"]
["Bouvet Norge AS ","A. Program- og prosjektgjennomføring","Helse Sør-Øst","Sykehusinnkjop2023@bouvet.no"]
["Bouvet Norge AS ","A. Program- og prosjektgjennomføring","Helse Midt-Norge","Sykehusinnkjop2023@bouvet.no"]
["Bouvet Norge AS ","A. Program- og prosjektgjennomføring","Helse Vest","Sykehusinnkjop2023@bouvet.no"]
["Bouvet Norge AS ","B. Strategiplanlegging, rådgivning og innovasjon","Helse Nord","Sykehusinnkjop2023@bouvet.no"]
["Bouvet Norge AS ","B. Strategiplanlegging, rådgivning og innovasjon","Helse Sør-Øst","Sykehusinnkjop2023@bouvet.no"]
["Bouvet Norge AS ","B. Strategiplanlegging, rådgivning og innovasjon","Helse Midt-Norge","Sykehusinnkjop2023@bouvet.no"]
["Bouvet Norge AS ","B. Strategiplanlegging, rådgivning og innovasjon","Helse Vest","Sykehusinnkjop2023@bouvet.no"]
["Bouvet Norge AS ","C. Arkitektur","Helse Nord","Sykehusinnkjop2023@bouvet.no"]
["Bouvet Norge AS ","C. Arkitektur","Helse Sør-Øst","Sykehusinnkjop2023@bouvet.no"]
["Bouvet Norge AS ","C. Arkitektur","Helse Midt-Norge","Sykehusinnkjop2023@bouvet.no"]
["Bouvet Norge AS ","C. Arkitektur","Helse Vest","Sykehusinnkjop2023@bouvet.no"]
["Bouvet Norge AS ","D. Informasjonssikkerhet og ROS-analyser","Helse Nord","Sykehusinnkjop2023@bouvet.no"]
["Bouvet Norge AS ","D. Informasjonssikkerhet og ROS-analyser","Helse Sør-Øst","Sykehusinnkjop2023@bouvet.no"]
["Bouvet Norge AS ","D. Informasjonssikkerhet og ROS-analyser","Helse Midt-Norge","Sykehusinnkjop2023@bouvet.no"]
["Bouvet Norge AS ","D. Informasjonssikkerhet og ROS-analyser","Helse Vest","Sykehusinnkjop2023@bouvet.no"]
["Bouvet Norge AS ","E. Test og release","Helse Nord","Sykehusinnkjop2023@bouvet.no"]
["Bouvet Norge AS ","E. Test og release","Helse Sør-Øst","Sykehusinnkjop2023@bouvet.no"]
["Bouvet Norge AS ","E. Test og release","Helse Midt-Norge","Sykehusinnkjop2023@bouvet.no"]
["Bouvet Norge AS ","E. Test og release","Helse Vest","Sykehusinnkjop2023@bouvet.no"]
["Bouvet Norge AS ","F. Systemutvikling","Helse Nord","Sykehusinnkjop2023@bouvet.no"]
["Bouvet Norge AS ","F. Systemutvikling","Helse Sør-Øst","Sykehusinnkjop2023@bouvet.no"]
["Bouvet Norge AS ","F. Systemutvikling","Helse Midt-Norge","Sykehusinnkjop2023@bouvet.no"]
["Bouvet Norge AS ","F. Systemutvikling","Helse Vest","Sykehusinnkjop2023@bouvet.no"]
["Bouvet Norge AS ","G. Applikasjonsforvaltning, drift og forvaltning av IT-systemer og plattformer","Helse Nord","Sykehusinnkjop2023@bouvet.no"]
["Bouvet Norge AS ","G. Applikasjonsforvaltning, drift og forvaltning av IT-systemer og plattformer","Helse Sør-Øst","Sykehusinnkjop2023@bouvet.no"]
["Bouvet Norge AS ","G. Applikasjonsforvaltning, drift og forvaltning av IT-systemer og plattformer","Helse Midt-Norge","Sykehusinnkjop2023@bouvet.no"]
["Bouvet Norge AS ","G. Applikasjonsforvaltning, drift og forvaltning av IT-systemer og plattformer","Helse Vest","Sykehusinnkjop2023@bouvet.no"]
["Bouvet Norge AS ","J. Tverrfaglige team","Helse Nord","Sykehusinnkjop2023@bouvet.no"]
["Bouvet Norge AS ","J. Tverrfaglige team","Helse Sør-Øst","Sykehusinnkjop2023@bouvet.no"]
["Bouvet Norge AS ","J. Tverrfaglige team","Helse Midt-Norge","Sykehusinnkjop2023@bouvet.no"]
["Bouvet Norge AS ","J. Tverrfaglige team","Helse Vest","Sykehusinnkjop2023@bouvet.no"]
["Capgemini Norge AS ","A. Program- og prosjektgjennomføring","Helse Nord","helsenord.no@capgemini.com"]
["Capgemini Norge AS ","A. Program- og prosjektgjennomføring","Helse Sør-Øst","helsenord.no@capgemini.com"]
["Capgemini Norge AS ","A. Program- og prosjektgjennomføring","Helse Midt-Norge","helsenord.no@capgemini.com"]
["Capgemini Norge AS ","A. Program- og prosjektgjennomføring","Helse Vest","helsenord.no@capgemini.com"]
["Capgemini Norge AS ","B. Strategiplanlegging, rådgivning og innovasjon","Helse Nord","helsenord.no@capgemini.com"]
["Capgemini Norge AS ","B. Strategiplanlegging, rådgivning og innovasjon","Helse Sør-Øst","helsenord.no@capgemini.com"]
["Capgemini Norge AS ","B. Strategiplanlegging, rådgivning og innovasjon","Helse Midt-Norge","helsenord.no@capgemini.com"]
["Capgemini Norge AS ","B. Strategiplanlegging, rådgivning og innovasjon","Helse Vest","helsenord.no@capgemini.com"]
["Capgemini Norge AS ","C. Arkitektur","Helse Nord","helsenord.no@capgemini.com"]
["Capgemini Norge AS ","C. Arkitektur","Helse Sør-Øst","helsenord.no@capgemini.com"]
["Capgemini Norge AS ","C. Arkitektur","Helse Midt-Norge","helsenord.no@capgemini.com"]
["Capgemini Norge AS ","C. Arkitektur","Helse Vest","helsenord.no@capgemini.com"]
["Capgemini Norge AS ","D. Informasjonssikkerhet og ROS-analyser","Helse Nord","helsenord.no@capgemini.com"]
["Capgemini Norge AS ","D. Informasjonssikkerhet og ROS-analyser","Helse Sør-Øst","helsenord.no@capgemini.com"]
["Capgemini Norge AS ","D. Informasjonssikkerhet og ROS-analyser","Helse Midt-Norge","helsenord.no@capgemini.com"]
["Capgemini Norge AS ","D. Informasjonssikkerhet og ROS-analyser","Helse Vest","helsenord.no@capgemini.com"]
["Capgemini Norge AS ","E. Test og release","Helse Nord","helsenord.no@capgemini.com"]
["Capgemini Norge AS ","E. Test og release","Helse Sør-Øst","helsenord.no@capgemini.com"]
["Capgemini Norge AS ","E. Test og release","Helse Midt-Norge","helsenord.no@capgemini.com"]
["Capgemini Norge AS ","E. Test og release","Helse Vest","helsenord.no@capgemini.com"]
["Capgemini Norge AS ","F. Systemutvikling","Helse Nord","helsenord.no@capgemini.com"]
["Capgemini Norge AS ","F. Systemutvikling","Helse Sør-Øst","helsenord.no@capgemini.com"]
["Capgemini Norge AS ","F. Systemutvikling","Helse Midt-Norge","helsenord.no@capgemini.com"]
["Capgemini Norge AS ","F. Systemutvikling","Helse Vest","helsenord.no@capgemini.com"]
["Capgemini Norge AS ","G. Applikasjonsforvaltning, drift og forvaltning av IT-systemer og plattformer","Helse Midt-Norge","helsenord.no@capgemini.com"]
["Capgemini Norge AS ","G. Applikasjonsforvaltning, drift og forvaltning av IT-systemer og plattformer","Helse Nord","helsenord.no@capgemini.com"]
["Capgemini Norge AS ","G. Applikasjonsforvaltning, drift og forvaltning av IT-systemer og plattformer","Helse Vest","helsenord.no@capgemini.com"]
["Capgemini Norge AS ","J. Tverrfaglige team","Helse Nord","helsenord.no@capgemini.com"]
["Capgemini Norge AS ","J. Tverrfaglige team","Helse Sør-Øst","helsenord.no@capgemini.com"]
["Capgemini Norge AS ","J. Tverrfaglige team","Helse Midt-Norge","helsenord.no@capgemini.com"]
["Capgemini Norge AS ","J. Tverrfaglige team","Helse Vest","helsenord.no@capgemini.com"]
["CGI Norge AS ","F. Systemutvikling","Helse Vest","avrop@cgi.com"]
["CGI Norge AS ","G. Applikasjonsforvaltning, drift og forvaltning av IT-systemer og plattformer","Helse Nord","avrop@cgi.com"]
["CGI Norge AS ","G. Applikasjonsforvaltning, drift og forvaltning av IT-systemer og plattformer","Helse Midt-Norge","avrop@cgi.com"]
["CGI Norge AS ","G. Applikasjonsforvaltning, drift og forvaltning av IT-systemer og plattformer","Helse Vest","avrop@cgi.com"]
["Conscia Norge AS ","H. Nettverk","Helse Nord","salg@conscia.no "]
["Conscia Norge AS ","H. Nettverk","Helse Sør-Øst","salg@conscia.no "]
["Conscia Norge AS ","H. Nettverk","Helse Midt-Norge","salg@conscia.no "]
["Conscia Norge AS ","H. Nettverk","Helse Vest","salg@conscia.no "]
["Crayon AS ","G. Applikasjonsforvaltning, drift og forvaltning av IT-systemer og plattformer","Helse Nord","firmapost@crayon.com"]
["Crayon AS ","G. Applikasjonsforvaltning, drift og forvaltning av IT-systemer og plattformer","Helse Sør-Øst","firmapost@crayon.com"]
["Crayon AS ","G. Applikasjonsforvaltning, drift og forvaltning av IT-systemer og plattformer","Helse Midt-Norge","firmapost@crayon.com"]
["Crayon AS ","G. Applikasjonsforvaltning, drift og forvaltning av IT-systemer og plattformer","Helse Vest","firmapost@crayon.com"]
["Deloitte AS ","A. Program- og prosjektgjennomføring","Helse Nord","noanbud@DELOITTE.no"]
["Deloitte AS ","A. Program- og prosjektgjennomføring","Helse Sør-Øst","noanbud@DELOITTE.no"]
["Deloitte AS ","A. Program- og prosjektgjennomføring","Helse Midt-Norge","noanbud@DELOITTE.no"]
["Deloitte AS ","A. Program- og prosjektgjennomføring","Helse Vest","noanbud@DELOITTE.no"]
["Deloitte AS ","B. Strategiplanlegging, rådgivning og innovasjon","Helse Nord","noanbud@DELOITTE.no"]
["Deloitte AS ","B. Strategiplanlegging, rådgivning og innovasjon","Helse Sør-Øst","noanbud@DELOITTE.no"]
["Deloitte AS ","B. Strategiplanlegging, rådgivning og innovasjon","Helse Midt-Norge","noanbud@DELOITTE.no"]
["Deloitte AS ","B. Strategiplanlegging, rådgivning og innovasjon","Helse Vest","noanbud@DELOITTE.no"]
["Deloitte AS ","C. Arkitektur","Helse Nord","noanbud@DELOITTE.no"]
["Deloitte AS ","C. Arkitektur","Helse Sør-Øst","noanbud@DELOITTE.no"]
["Deloitte AS ","C. Arkitektur","Helse Midt-Norge","noanbud@DELOITTE.no"]
["Deloitte AS ","C. Arkitektur","Helse Vest","noanbud@DELOITTE.no"]
["Deloitte AS ","D. Informasjonssikkerhet og ROS-analyser","Helse Nord","noanbud@DELOITTE.no"]
["Deloitte AS ","D. Informasjonssikkerhet og ROS-analyser","Helse Sør-Øst","noanbud@DELOITTE.no"]
["Deloitte AS ","D. Informasjonssikkerhet og ROS-analyser","Helse Midt-Norge","noanbud@DELOITTE.no"]
["Deloitte AS ","D. Informasjonssikkerhet og ROS-analyser","Helse Vest","noanbud@DELOITTE.no"]
["Deloitte AS ","E. Test og release","Helse Nord","noanbud@DELOITTE.no"]
["Deloitte AS ","E. Test og release","Helse Sør-Øst","noanbud@DELOITTE.no"]
["Deloitte AS ","E. Test og release","Helse Midt-Norge","noanbud@DELOITTE.no"]
["Deloitte AS ","E. Test og release","Helse Vest","noanbud@DELOITTE.no"]
["Deloitte AS ","J. Tverrfaglige team","Helse Nord","noanbud@DELOITTE.no"]
["Deloitte AS ","J. Tverrfaglige team","Helse Sør-Øst","noanbud@DELOITTE.no"]
["Deloitte AS ","J. Tverrfaglige team","Helse Midt-Norge","noanbud@DELOITTE.no"]
["Deloitte AS ","J. Tverrfaglige team","Helse Vest","noanbud@DELOITTE.no"]
["Dfind Consulting AS ","A. Program- og prosjektgjennomføring","Helse Sør-Øst","consulting@dfind.no"]
["Dfind Consulting AS ","A. Program- og prosjektgjennomføring","Helse Nord","consulting@dfind.no"]
["Dfind Consulting AS ","A. Program- og prosjektgjennomføring","Helse Vest","consulting@dfind.no"]
["Dfind Consulting AS ","C. Arkitektur","Helse Vest","consulting@dfind.no"]
["Dfind Consulting AS ","F. Systemutvikling","Helse Midt-Norge","consulting@dfind.no"]
["Dfind Consulting AS ","F. Systemutvikling","Helse Nord","consulting@dfind.no"]
["Dfind Consulting AS ","F. Systemutvikling","Helse Vest","consulting@dfind.no"]
["Digital Workforce AS ","A. Program- og prosjektgjennomføring","Helse Nord","info@digitalworkforce.com"]
["Digital Workforce AS ","A. Program- og prosjektgjennomføring","Helse Vest","info@digitalworkforce.com"]
["Digital Workforce AS ","F. Systemutvikling","Helse Vest","info@digitalworkforce.com"]
["Emagine AS ","A. Program- og prosjektgjennomføring","Helse Nord","sykehusinnkjop@emagine.no"]
["Emagine AS ","A. Program- og prosjektgjennomføring","Helse Sør-Øst","sykehusinnkjop@emagine.no"]
["Emagine AS ","A. Program- og prosjektgjennomføring","Helse Midt-Norge","sykehusinnkjop@emagine.no"]
["Emagine AS ","A. Program- og prosjektgjennomføring","Helse Vest","sykehusinnkjop@emagine.no"]
["Emagine AS ","B. Strategiplanlegging, rådgivning og innovasjon","Helse Nord","sykehusinnkjop@emagine.no"]
["Emagine AS ","B. Strategiplanlegging, rådgivning og innovasjon","Helse Sør-Øst","sykehusinnkjop@emagine.no"]
["Emagine AS ","B. Strategiplanlegging, rådgivning og innovasjon","Helse Midt-Norge","sykehusinnkjop@emagine.no"]
["Emagine AS ","B. Strategiplanlegging, rådgivning og innovasjon","Helse Vest","sykehusinnkjop@emagine.no"]
["Emagine AS ","C. Arkitektur","Helse Nord","sykehusinnkjop@emagine.no"]
["Emagine AS ","C. Arkitektur","Helse Sør-Øst","sykehusinnkjop@emagine.no"]
["Emagine AS ","C. Arkitektur","Helse Midt-Norge","sykehusinnkjop@emagine.no"]
["Emagine AS ","C. Arkitektur","Helse Vest","sykehusinnkjop@emagine.no"]
["Emagine AS ","D. Informasjonssikkerhet og ROS-analyser","Helse Nord","sykehusinnkjop@emagine.no"]
["Emagine AS ","D. Informasjonssikkerhet og ROS-analyser","Helse Sør-Øst","sykehusinnkjop@emagine.no"]
["Emagine AS ","D. Informasjonssikkerhet og ROS-analyser","Helse Midt-Norge","sykehusinnkjop@emagine.no"]
["Emagine AS ","D. Informasjonssikkerhet og ROS-analyser","Helse Vest","sykehusinnkjop@emagine.no"]
["Emagine AS ","E. Test og release","Helse Midt-Norge","sykehusinnkjop@emagine.no"]
["Emagine AS ","E. Test og release","Helse Nord","sykehusinnkjop@emagine.no"]
["Emagine AS ","E. Test og release","Helse Vest","sykehusinnkjop@emagine.no"]
["Emagine AS ","F. Systemutvikling","Helse Vest","sykehusinnkjop@emagine.no"]
["Emagine AS ","G. Applikasjonsforvaltning, drift og forvaltning av IT-systemer og plattformer","Helse Midt-Norge","sykehusinnkjop@emagine.no"]
["Emagine AS ","G. Applikasjonsforvaltning, drift og forvaltning av IT-systemer og plattformer","Helse Nord","sykehusinnkjop@emagine.no"]
["Emagine AS ","G. Applikasjonsforvaltning, drift og forvaltning av IT-systemer og plattformer","Helse Vest","sykehusinnkjop@emagine.no"]
["Emagine AS ","H. Nettverk","Helse Nord","sykehusinnkjop@emagine.no"]
["Emagine AS ","H. Nettverk","Helse Sør-Øst","sykehusinnkjop@emagine.no"]
["Emagine AS ","H. Nettverk","Helse Midt-Norge","sykehusinnkjop@emagine.no"]
["Emagine AS ","H. Nettverk","Helse Vest","sykehusinnkjop@emagine.no"]
["Ework Group Norway AS ","A. Program- og prosjektgjennomføring","Helse Nord","sykehusinnkjop@eworkgroup.com  "]
["Ework Group Norway AS ","A. Program- og prosjektgjennomføring","Helse Sør-Øst","sykehusinnkjop@eworkgroup.com  "]
["Ework Group Norway AS ","A. Program- og prosjektgjennomføring","Helse Midt-Norge","sykehusinnkjop@eworkgroup.com  "]
["Ework Group Norway AS ","A. Program- og prosjektgjennomføring","Helse Vest","sykehusinnkjop@eworkgroup.com  "]
["Ework Group Norway AS ","B. Strategiplanlegging, rådgivning og innovasjon","Helse Nord","sykehusinnkjop@eworkgroup.com  "]
["Ework Group Norway AS ","B. Strategiplanlegging, rådgivning og innovasjon","Helse Sør-Øst","sykehusinnkjop@eworkgroup.com  "]
["Ework Group Norway AS ","B. Strategiplanlegging, rådgivning og innovasjon","Helse Midt-Norge","sykehusinnkjop@eworkgroup.com  "]
["Ework Group Norway AS ","B. Strategiplanlegging, rådgivning og innovasjon","Helse Vest","sykehusinnkjop@eworkgroup.com  "]
["Ework Group Norway AS ","C. Arkitektur","Helse Nord","sykehusinnkjop@eworkgroup.com  "]
["Ework Group Norway AS ","C. Arkitektur","Helse Sør-Øst","sykehusinnkjop@eworkgroup.com  "]
["Ework Group Norway AS ","C. Arkitektur","Helse Midt-Norge","sykehusinnkjop@eworkgroup.com  "]
["Ework Group Norway AS ","C. Arkitektur","Helse Vest","sykehusinnkjop@eworkgroup.com  "]
["Ework Group Norway AS ","D. Informasjonssikkerhet og ROS-analyser","Helse Nord","sykehusinnkjop@eworkgroup.com  "]
["Ework Group Norway AS ","D. Informasjonssikkerhet og ROS-analyser","Helse Sør-Øst","sykehusinnkjop@eworkgroup.com  "]
["Ework Group Norway AS ","D. Informasjonssikkerhet og ROS-analyser","Helse Midt-Norge","sykehusinnkjop@eworkgroup.com  "]
["Ework Group Norway AS ","D. Informasjonssikkerhet og ROS-analyser","Helse Vest","sykehusinnkjop@eworkgroup.com  "]
["Ework Group Norway AS ","E. Test og release","Helse Nord","sykehusinnkjop@eworkgroup.com  "]
["Ework Group Norway AS ","E. Test og release","Helse Sør-Øst","sykehusinnkjop@eworkgroup.com  "]
["Ework Group Norway AS ","E. Test og release","Helse Midt-Norge","sykehusinnkjop@eworkgroup.com  "]
["Ework Group Norway AS ","E. Test og release","Helse Vest","sykehusinnkjop@eworkgroup.com  "]
["Ework Group Norway AS ","F. Systemutvikling","Helse Nord","sykehusinnkjop@eworkgroup.com  "]
["Ework Group Norway AS ","F. Systemutvikling","Helse Sør-Øst","sykehusinnkjop@eworkgroup.com  "]
["Ework Group Norway AS ","F. Systemutvikling","Helse Midt-Norge","sykehusinnkjop@eworkgroup.com  "]
["Ework Group Norway AS ","F. Systemutvikling","Helse Vest","sykehusinnkjop@eworkgroup.com  "]
["Ework Group Norway AS ","G. Applikasjonsforvaltning, drift og forvaltning av IT-systemer og plattformer","Helse Nord","sykehusinnkjop@eworkgroup.com  "]
["Ework Group Norway AS ","G. Applikasjonsforvaltning, drift og forvaltning av IT-systemer og plattformer","Helse Sør-Øst","sykehusinnkjop@eworkgroup.com  "]
["Ework Group Norway AS ","G. Applikasjonsforvaltning, drift og forvaltning av IT-systemer og plattformer","Helse Midt-Norge","sykehusinnkjop@eworkgroup.com  "]
["Ework Group Norway AS ","G. Applikasjonsforvaltning, drift og forvaltning av IT-systemer og plattformer","Helse Vest","sykehusinnkjop@eworkgroup.com  "]
["Ework Group Norway AS ","H. Nettverk","Helse Nord","sykehusinnkjop@eworkgroup.com  "]
["Ework Group Norway AS ","H. Nettverk","Helse Sør-Øst","sykehusinnkjop@eworkgroup.com  "]
["Ework Group Norway AS ","H. Nettverk","Helse Midt-Norge","sykehusinnkjop@eworkgroup.com  "]
["Ework Group Norway AS ","H. Nettverk","Helse Vest","sykehusinnkjop@eworkgroup.com  "]
["Experis AS ","A. Program- og prosjektgjennomføring","Helse Nord","sykehusinnkjop@no.experis.com"]
["Experis AS ","A. Program- og prosjektgjennomføring","Helse Sør-Øst","sykehusinnkjop@no.experis.com"]
["Experis AS ","A. Program- og prosjektgjennomføring","Helse Midt-Norge","sykehusinnkjop@no.experis.com"]
["Experis AS ","A. Program- og prosjektgjennomføring","Helse Vest","sykehusinnkjop@no.experis.com"]
["Experis AS ","B. Strategiplanlegging, rådgivning og innovasjon","Helse Nord","sykehusinnkjop@no.experis.com"]
["Experis AS ","B. Strategiplanlegging, rådgivning og innovasjon","Helse Sør-Øst","sykehusinnkjop@no.experis.com"]
["Experis AS ","B. Strategiplanlegging, rådgivning og innovasjon","Helse Midt-Norge","sykehusinnkjop@no.experis.com"]
["Experis AS ","B. Strategiplanlegging, rådgivning og innovasjon","Helse Vest","sykehusinnkjop@no.experis.com"]
["Experis AS ","C. Arkitektur","Helse Nord","sykehusinnkjop@no.experis.com"]
["Experis AS ","C. Arkitektur","Helse Sør-Øst","sykehusinnkjop@no.experis.com"]
["Experis AS ","C. Arkitektur","Helse Midt-Norge","sykehusinnkjop@no.experis.com"]
["Experis AS ","C. Arkitektur","Helse Vest","sykehusinnkjop@no.experis.com"]
["Experis AS ","D. Informasjonssikkerhet og ROS-analyser","Helse Nord","sykehusinnkjop@no.experis.com"]
["Experis AS ","D. Informasjonssikkerhet og ROS-analyser","Helse Sør-Øst","sykehusinnkjop@no.experis.com"]
["Experis AS ","D. Informasjonssikkerhet og ROS-analyser","Helse Midt-Norge","sykehusinnkjop@no.experis.com"]
["Experis AS ","D. Informasjonssikkerhet og ROS-analyser","Helse Vest","sykehusinnkjop@no.experis.com"]
["Experis AS ","E. Test og release","Helse Nord","sykehusinnkjop@no.experis.com"]
["Experis AS ","E. Test og release","Helse Sør-Øst","sykehusinnkjop@no.experis.com"]
["Experis AS ","E. Test og release","Helse Midt-Norge","sykehusinnkjop@no.experis.com"]
["Experis AS ","E. Test og release","Helse Vest","sykehusinnkjop@no.experis.com"]
["Experis AS ","F. Systemutvikling","Helse Nord","sykehusinnkjop@no.experis.com"]
["Experis AS ","F. Systemutvikling","Helse Sør-Øst","sykehusinnkjop@no.experis.com"]
["Experis AS ","F. Systemutvikling","Helse Midt-Norge","sykehusinnkjop@no.experis.com"]
["Experis AS ","F. Systemutvikling","Helse Vest","sykehusinnkjop@no.experis.com"]
["Experis AS ","G. Applikasjonsforvaltning, drift og forvaltning av IT-systemer og plattformer","Helse Nord","sykehusinnkjop@no.experis.com"]
["Experis AS ","G. Applikasjonsforvaltning, drift og forvaltning av IT-systemer og plattformer","Helse Sør-Øst","sykehusinnkjop@no.experis.com"]
["Experis AS ","G. Applikasjonsforvaltning, drift og forvaltning av IT-systemer og plattformer","Helse Midt-Norge","sykehusinnkjop@no.experis.com"]
["Experis AS ","G. Applikasjonsforvaltning, drift og forvaltning av IT-systemer og plattformer","Helse Vest","sykehusinnkjop@no.experis.com"]
["Experis AS ","H. Nettverk","Helse Nord","sykehusinnkjop@no.experis.com"]
["Experis AS ","H. Nettverk","Helse Sør-Øst","sykehusinnkjop@no.experis.com"]
["Experis AS ","H. Nettverk","Helse Midt-Norge","sykehusinnkjop@no.experis.com"]
["Experis AS ","H. Nettverk","Helse Vest","sykehusinnkjop@no.experis.com"]
["Experis AS ","I. Telekommunikasjon","Helse Nord","sykehusinnkjop@no.experis.com"]
["Experis AS ","I. Telekommunikasjon","Helse Sør-Øst","sykehusinnkjop@no.experis.com"]
["Experis AS ","I. Telekommunikasjon","Helse Midt-Norge","sykehusinnkjop@no.experis.com"]
["Experis AS ","I. Telekommunikasjon","Helse Vest","sykehusinnkjop@no.experis.com"]
["Ernst & Young AS ","A. Program- og prosjektgjennomføring","Helse Nord","offentlige.anskaffelser@no.ey.com"]
["Ernst & Young AS ","A. Program- og prosjektgjennomføring","Helse Sør-Øst","offentlige.anskaffelser@no.ey.com"]
["Ernst & Young AS ","A. Program- og prosjektgjennomføring","Helse Midt-Norge","offentlige.anskaffelser@no.ey.com"]
["Ernst & Young AS ","A. Program- og prosjektgjennomføring","Helse Vest","offentlige.anskaffelser@no.ey.com"]
["Ernst & Young AS ","B. Strategiplanlegging, rådgivning og innovasjon","Helse Nord","offentlige.anskaffelser@no.ey.com"]
["Ernst & Young AS ","B. Strategiplanlegging, rådgivning og innovasjon","Helse Sør-Øst","offentlige.anskaffelser@no.ey.com"]
["Ernst & Young AS ","B. Strategiplanlegging, rådgivning og innovasjon","Helse Midt-Norge","offentlige.anskaffelser@no.ey.com"]
["Ernst & Young AS ","B. Strategiplanlegging, rådgivning og innovasjon","Helse Vest","offentlige.anskaffelser@no.ey.com"]
["Ernst & Young AS ","C. Arkitektur","Helse Nord","offentlige.anskaffelser@no.ey.com"]
["Ernst & Young AS ","C. Arkitektur","Helse Sør-Øst","offentlige.anskaffelser@no.ey.com"]
["Ernst & Young AS ","C. Arkitektur","Helse Midt-Norge","offentlige.anskaffelser@no.ey.com"]
["Ernst & Young AS ","C. Arkitektur","Helse Vest","offentlige.anskaffelser@no.ey.com"]
["Ernst & Young AS ","D. Informasjonssikkerhet og ROS-analyser","Helse Nord","offentlige.anskaffelser@no.ey.com"]
["Ernst & Young AS ","D. Informasjonssikkerhet og ROS-analyser","Helse Sør-Øst","offentlige.anskaffelser@no.ey.com"]
["Ernst & Young AS ","D. Informasjonssikkerhet og ROS-analyser","Helse Midt-Norge","offentlige.anskaffelser@no.ey.com"]
["Ernst & Young AS ","D. Informasjonssikkerhet og ROS-analyser","Helse Vest","offentlige.anskaffelser@no.ey.com"]
["Ernst & Young AS ","E. Test og release","Helse Midt-Norge","offentlige.anskaffelser@no.ey.com"]
["Ernst & Young AS ","E. Test og release","Helse Nord","offentlige.anskaffelser@no.ey.com"]
["Ernst & Young AS ","E. Test og release","Helse Vest","offentlige.anskaffelser@no.ey.com"]
["Ernst & Young AS ","F. Systemutvikling","Helse Midt-Norge","offentlige.anskaffelser@no.ey.com"]
["Ernst & Young AS ","F. Systemutvikling","Helse Nord","offentlige.anskaffelser@no.ey.com"]
["Ernst & Young AS ","F. Systemutvikling","Helse Vest","offentlige.anskaffelser@no.ey.com"]
["Ernst & Young AS ","G. Applikasjonsforvaltning, drift og forvaltning av IT-systemer og plattformer","Helse Midt-Norge","offentlige.anskaffelser@no.ey.com"]
["Ernst & Young AS ","G. Applikasjonsforvaltning, drift og forvaltning av IT-systemer og plattformer","Helse Nord","offentlige.anskaffelser@no.ey.com"]
["Ernst & Young AS ","G. Applikasjonsforvaltning, drift og forvaltning av IT-systemer og plattformer","Helse Vest","offentlige.anskaffelser@no.ey.com"]
["Ernst & Young AS ","J. Tverrfaglige team","Helse Nord","offentlige.anskaffelser@no.ey.com"]
["Ernst & Young AS ","J. Tverrfaglige team","Helse Sør-Øst","offentlige.anskaffelser@no.ey.com"]
["Ernst & Young AS ","J. Tverrfaglige team","Helse Midt-Norge","offentlige.anskaffelser@no.ey.com"]
["Ernst & Young AS ","J. Tverrfaglige team","Helse Vest","offentlige.anskaffelser@no.ey.com"]
["HRP AS","B. Strategiplanlegging, rådgivning og innovasjon","Helse Vest","marked@hrpas.no"]
["HRP AS","C. Arkitektur","Helse Vest","marked@hrpas.no"]
["HRP AS","D. Informasjonssikkerhet og ROS-analyser","Helse Vest","marked@hrpas.no"]
["HRP AS","E. Test og release","Helse Vest","marked@hrpas.no"]
["HRP AS","G. Applikasjonsforvaltning, drift og forvaltning av IT-systemer og plattformer","Helse Nord","marked@hrpas.no"]
["HRP AS","G. Applikasjonsforvaltning, drift og forvaltning av IT-systemer og plattformer","Helse Vest","marked@hrpas.no"]
["HRP AS","H. Nettverk","Helse Nord","marked@hrpas.no"]
["HRP AS","H. Nettverk","Helse Vest","marked@hrpas.no"]
["HRP AS","I. Telekommunikasjon","Helse Nord","marked@hrpas.no"]
["HRP AS","I. Telekommunikasjon","Helse Vest","marked@hrpas.no"]
["Implement Consulting Group AS ","C. Arkitektur","Helse Vest","tender@implement.dk"]
["Implement Consulting Group AS ","D. Informasjonssikkerhet og ROS-analyser","Helse Vest","tender@implement.dk"]
["Implement Consulting Group AS ","E. Test og release","Helse Vest","tender@implement.dk"]
["IT Consult AS ","C. Arkitektur","Helse Nord","firmapost@itc.no"]
["IT Consult AS ","C. Arkitektur","Helse Sør-Øst","firmapost@itc.no"]
["IT Consult AS ","C. Arkitektur","Helse Midt-Norge","firmapost@itc.no"]
["IT Consult AS ","C. Arkitektur","Helse Vest","firmapost@itc.no"]
["IT Consult AS ","D. Informasjonssikkerhet og ROS-analyser","Helse Nord","firmapost@itc.no"]
["IT Consult AS ","D. Informasjonssikkerhet og ROS-analyser","Helse Sør-Øst","firmapost@itc.no"]
["IT Consult AS ","D. Informasjonssikkerhet og ROS-analyser","Helse Midt-Norge","firmapost@itc.no"]
["IT Consult AS ","D. Informasjonssikkerhet og ROS-analyser","Helse Vest","firmapost@itc.no"]
["IT Consult AS ","E. Test og release","Helse Nord","firmapost@itc.no"]
["IT Consult AS ","E. Test og release","Helse Sør-Øst","firmapost@itc.no"]
["IT Consult AS ","E. Test og release","Helse Midt-Norge","firmapost@itc.no"]
["IT Consult AS ","E. Test og release","Helse Vest","firmapost@itc.no"]
["IT Consult AS ","F. Systemutvikling","Helse Nord","firmapost@itc.no"]
["IT Consult AS ","F. Systemutvikling","Helse Sør-Øst","firmapost@itc.no"]
["IT Consult AS ","F. Systemutvikling","Helse Midt-Norge","firmapost@itc.no"]
["IT Consult AS ","F. Systemutvikling","Helse Vest","firmapost@itc.no"]
["IT Consult AS ","G. Applikasjonsforvaltning, drift og forvaltning av IT-systemer og plattformer","Helse Nord","firmapost@itc.no"]
["IT Consult AS ","G. Applikasjonsforvaltning, drift og forvaltning av IT-systemer og plattformer","Helse Sør-Øst","firmapost@itc.no"]
["IT Consult AS ","G. Applikasjonsforvaltning, drift og forvaltning av IT-systemer og plattformer","Helse Midt-Norge","firmapost@itc.no"]
["IT Consult AS ","G. Applikasjonsforvaltning, drift og forvaltning av IT-systemer og plattformer","Helse Vest","firmapost@itc.no"]
["IT Consult AS ","H. Nettverk","Helse Nord","firmapost@itc.no"]
["IT Consult AS ","H. Nettverk","Helse Sør-Øst","firmapost@itc.no"]
["IT Consult AS ","H. Nettverk","Helse Midt-Norge","firmapost@itc.no"]
["IT Consult AS ","H. Nettverk","Helse Vest","firmapost@itc.no"]
["KPMG AS ","A. Program- og prosjektgjennomføring","Helse Nord","helse@kpmg.no"]
["KPMG AS ","A. Program- og prosjektgjennomføring","Helse Sør-Øst","helse@kpmg.no"]
["KPMG AS ","A. Program- og prosjektgjennomføring","Helse Midt-Norge","helse@kpmg.no"]
["KPMG AS ","A. Program- og prosjektgjennomføring","Helse Vest","helse@kpmg.no"]
["KPMG AS ","B. Strategiplanlegging, rådgivning og innovasjon","Helse Nord","helse@kpmg.no"]
["KPMG AS ","B. Strategiplanlegging, rådgivning og innovasjon","Helse Sør-Øst","helse@kpmg.no"]
["KPMG AS ","B. Strategiplanlegging, rådgivning og innovasjon","Helse Midt-Norge","helse@kpmg.no"]
["KPMG AS ","B. Strategiplanlegging, rådgivning og innovasjon","Helse Vest","helse@kpmg.no"]
["KPMG AS ","C. Arkitektur","Helse Nord","helse@kpmg.no"]
["KPMG AS ","C. Arkitektur","Helse Sør-Øst","helse@kpmg.no"]
["KPMG AS ","C. Arkitektur","Helse Midt-Norge","helse@kpmg.no"]
["KPMG AS ","C. Arkitektur","Helse Vest","helse@kpmg.no"]
["KPMG AS ","D. Informasjonssikkerhet og ROS-analyser","Helse Nord","helse@kpmg.no"]
["KPMG AS ","D. Informasjonssikkerhet og ROS-analyser","Helse Sør-Øst","helse@kpmg.no"]
["KPMG AS ","D. Informasjonssikkerhet og ROS-analyser","Helse Midt-Norge","helse@kpmg.no"]
["KPMG AS ","D. Informasjonssikkerhet og ROS-analyser","Helse Vest","helse@kpmg.no"]
["KPMG AS ","F. Systemutvikling","Helse Nord","helse@kpmg.no"]
["KPMG AS ","F. Systemutvikling","Helse Sør-Øst","helse@kpmg.no"]
["KPMG AS ","F. Systemutvikling","Helse Midt-Norge","helse@kpmg.no"]
["KPMG AS ","F. Systemutvikling","Helse Vest","helse@kpmg.no"]
["Metier AS ","A. Program- og prosjektgjennomføring","Helse Nord","firmapost@metier.no"]
["Metier AS ","A. Program- og prosjektgjennomføring","Helse Sør-Øst","firmapost@metier.no"]
["Metier AS ","A. Program- og prosjektgjennomføring","Helse Midt-Norge","firmapost@metier.no"]
["Metier AS ","A. Program- og prosjektgjennomføring","Helse Vest","firmapost@metier.no"]
["Metier AS ","B. Strategiplanlegging, rådgivning og innovasjon","Helse Nord","firmapost@metier.no"]
["Metier AS ","B. Strategiplanlegging, rådgivning og innovasjon","Helse Sør-Øst","firmapost@metier.no"]
["Metier AS ","B. Strategiplanlegging, rådgivning og innovasjon","Helse Midt-Norge","firmapost@metier.no"]
["Metier AS ","B. Strategiplanlegging, rådgivning og innovasjon","Helse Vest","firmapost@metier.no"]
["Move AS","D. Informasjonssikkerhet og ROS-analyser","Helse Vest","konsulentledelse@move.no"]
["Move AS","G. Applikasjonsforvaltning, drift og forvaltning av IT-systemer og plattformer","Helse Midt-Norge","konsulentledelse@move.no"]
["Move AS","G. Applikasjonsforvaltning, drift og forvaltning av IT-systemer og plattformer","Helse Nord","konsulentledelse@move.no"]
["Move AS","G. Applikasjonsforvaltning, drift og forvaltning av IT-systemer og plattformer","Helse Vest","konsulentledelse@move.no"]
["Move AS","H. Nettverk","Helse Midt-Norge","konsulentledelse@move.no"]
["Move AS","H. Nettverk","Helse Nord","konsulentledelse@move.no"]
["Move AS","H. Nettverk","Helse Vest","konsulentledelse@move.no"]
["Netcompany AS ","A. Program- og prosjektgjennomføring","Helse Nord","anbud.no@netcompany.com "]
["Netcompany AS ","A. Program- og prosjektgjennomføring","Helse Sør-Øst","anbud.no@netcompany.com "]
["Netcompany AS ","A. Program- og prosjektgjennomføring","Helse Midt-Norge","anbud.no@netcompany.com "]
["Netcompany AS ","A. Program- og prosjektgjennomføring","Helse Vest","anbud.no@netcompany.com "]
["Netcompany AS ","C. Arkitektur","Helse Nord","anbud.no@netcompany.com "]
["Netcompany AS ","C. Arkitektur","Helse Sør-Øst","anbud.no@netcompany.com "]
["Netcompany AS ","C. Arkitektur","Helse Midt-Norge","anbud.no@netcompany.com "]
["Netcompany AS ","C. Arkitektur","Helse Vest","anbud.no@netcompany.com "]
["Netcompany AS ","E. Test og release","Helse Nord","anbud.no@netcompany.com "]
["Netcompany AS ","E. Test og release","Helse Sør-Øst","anbud.no@netcompany.com "]
["Netcompany AS ","E. Test og release","Helse Midt-Norge","anbud.no@netcompany.com "]
["Netcompany AS ","E. Test og release","Helse Vest","anbud.no@netcompany.com "]
["Netcompany AS ","F. Systemutvikling","Helse Nord","anbud.no@netcompany.com "]
["Netcompany AS ","F. Systemutvikling","Helse Sør-Øst","anbud.no@netcompany.com "]
["Netcompany AS ","F. Systemutvikling","Helse Midt-Norge","anbud.no@netcompany.com "]
["Netcompany AS ","F. Systemutvikling","Helse Vest","anbud.no@netcompany.com "]
["Netcompany AS ","G. Applikasjonsforvaltning, drift og forvaltning av IT-systemer og plattformer","Helse Nord","anbud.no@netcompany.com "]
["Netcompany AS ","G. Applikasjonsforvaltning, drift og forvaltning av IT-systemer og plattformer","Helse Sør-Øst","anbud.no@netcompany.com "]
["Netcompany AS ","G. Applikasjonsforvaltning, drift og forvaltning av IT-systemer og plattformer","Helse Midt-Norge","anbud.no@netcompany.com "]
["Netcompany AS ","G. Applikasjonsforvaltning, drift og forvaltning av IT-systemer og plattformer","Helse Vest","anbud.no@netcompany.com "]
["Netcompany AS ","J. Tverrfaglige team","Helse Nord","anbud.no@netcompany.com "]
["Netcompany AS ","J. Tverrfaglige team","Helse Sør-Øst","anbud.no@netcompany.com "]
["Netcompany AS ","J. Tverrfaglige team","Helse Midt-Norge","anbud.no@netcompany.com "]
["Netcompany AS ","J. Tverrfaglige team","Helse Vest","anbud.no@netcompany.com "]
["NetNordic Norway AS ","F. Systemutvikling","Helse Vest","salg@netnordic.no"]
["NetNordic Norway AS ","H. Nettverk","Helse Nord","salg@netnordic.no"]
["NetNordic Norway AS ","H. Nettverk","Helse Sør-Øst","salg@netnordic.no"]
["NetNordic Norway AS ","H. Nettverk","Helse Midt-Norge","salg@netnordic.no"]
["NetNordic Norway AS ","H. Nettverk","Helse Vest","salg@netnordic.no"]
["NetNordic Norway AS ","I. Telekommunikasjon","Helse Nord","salg@netnordic.no"]
["NetNordic Norway AS ","I. Telekommunikasjon","Helse Sør-Øst","salg@netnordic.no"]
["NetNordic Norway AS ","I. Telekommunikasjon","Helse Midt-Norge","salg@netnordic.no"]
["NetNordic Norway AS ","I. Telekommunikasjon","Helse Vest","salg@netnordic.no"]
["Nordlo Grenland AS","A. Program- og prosjektgjennomføring","Helse Nord","firmapost.grenland@nordlo.com"]
["Nordlo Grenland AS","A. Program- og prosjektgjennomføring","Helse Vest","firmapost.grenland@nordlo.com"]
["Nordlo Grenland AS","C. Arkitektur","Helse Vest","firmapost.grenland@nordlo.com"]
["Nordlo Grenland AS","E. Test og release","Helse Vest","firmapost.grenland@nordlo.com"]
["Nordlo Grenland AS","G. Applikasjonsforvaltning, drift og forvaltning av IT-systemer og plattformer","Helse Midt-Norge","firmapost.grenland@nordlo.com"]
["Nordlo Grenland AS","G. Applikasjonsforvaltning, drift og forvaltning av IT-systemer og plattformer","Helse Nord","firmapost.grenland@nordlo.com"]
["Nordlo Grenland AS","G. Applikasjonsforvaltning, drift og forvaltning av IT-systemer og plattformer","Helse Vest","firmapost.grenland@nordlo.com"]
["Nordlo Grenland AS","H. Nettverk","Helse Midt-Norge","firmapost.grenland@nordlo.com"]
["Nordlo Grenland AS","H. Nettverk","Helse Nord","firmapost.grenland@nordlo.com"]
["Nordlo Grenland AS","H. Nettverk","Helse Vest","firmapost.grenland@nordlo.com"]
["Nimtech Consult AS ","C. Arkitektur","Helse Vest","oppdrag@nimtech.no"]
["PricewaterhouseCoopers AS ","A. Program- og prosjektgjennomføring","Helse Nord","no_resepsjon.oslo@pwc.com"]
["PricewaterhouseCoopers AS ","A. Program- og prosjektgjennomføring","Helse Sør-Øst","no_resepsjon.oslo@pwc.com"]
["PricewaterhouseCoopers AS ","A. Program- og prosjektgjennomføring","Helse Midt-Norge","no_resepsjon.oslo@pwc.com"]
["PricewaterhouseCoopers AS ","A. Program- og prosjektgjennomføring","Helse Vest","no_resepsjon.oslo@pwc.com"]
["PricewaterhouseCoopers AS ","B. Strategiplanlegging, rådgivning og innovasjon","Helse Nord","no_resepsjon.oslo@pwc.com"]
["PricewaterhouseCoopers AS ","B. Strategiplanlegging, rådgivning og innovasjon","Helse Sør-Øst","no_resepsjon.oslo@pwc.com"]
["PricewaterhouseCoopers AS ","B. Strategiplanlegging, rådgivning og innovasjon","Helse Midt-Norge","no_resepsjon.oslo@pwc.com"]
["PricewaterhouseCoopers AS ","B. Strategiplanlegging, rådgivning og innovasjon","Helse Vest","no_resepsjon.oslo@pwc.com"]
["PricewaterhouseCoopers AS ","C. Arkitektur","Helse Nord","no_resepsjon.oslo@pwc.com"]
["PricewaterhouseCoopers AS ","C. Arkitektur","Helse Sør-Øst","no_resepsjon.oslo@pwc.com"]
["PricewaterhouseCoopers AS ","C. Arkitektur","Helse Midt-Norge","no_resepsjon.oslo@pwc.com"]
["PricewaterhouseCoopers AS ","C. Arkitektur","Helse Vest","no_resepsjon.oslo@pwc.com"]
["PricewaterhouseCoopers AS ","D. Informasjonssikkerhet og ROS-analyser","Helse Nord","no_resepsjon.oslo@pwc.com"]
["PricewaterhouseCoopers AS ","D. Informasjonssikkerhet og ROS-analyser","Helse Sør-Øst","no_resepsjon.oslo@pwc.com"]
["PricewaterhouseCoopers AS ","D. Informasjonssikkerhet og ROS-analyser","Helse Midt-Norge","no_resepsjon.oslo@pwc.com"]
["PricewaterhouseCoopers AS ","D. Informasjonssikkerhet og ROS-analyser","Helse Vest","no_resepsjon.oslo@pwc.com"]
["PricewaterhouseCoopers AS ","E. Test og release","Helse Vest","no_resepsjon.oslo@pwc.com"]
["PricewaterhouseCoopers AS ","J. Tverrfaglige team","Helse Nord","no_resepsjon.oslo@pwc.com"]
["PricewaterhouseCoopers AS ","J. Tverrfaglige team","Helse Sør-Øst","no_resepsjon.oslo@pwc.com"]
["PricewaterhouseCoopers AS ","J. Tverrfaglige team","Helse Midt-Norge","no_resepsjon.oslo@pwc.com"]
["PricewaterhouseCoopers AS ","J. Tverrfaglige team","Helse Vest","no_resepsjon.oslo@pwc.com"]
["Proact IT Norge AS ","G. Applikasjonsforvaltning, drift og forvaltning av IT-systemer og plattformer","Helse Midt-Norge","bestilling@proact.no "]
["Proact IT Norge AS ","G. Applikasjonsforvaltning, drift og forvaltning av IT-systemer og plattformer","Helse Nord","bestilling@proact.no "]
["Proact IT Norge AS ","G. Applikasjonsforvaltning, drift og forvaltning av IT-systemer og plattformer","Helse Vest","bestilling@proact.no "]
["Solea AS (tidl Rainfall AS )","A. Program- og prosjektgjennomføring","Helse Nord","avrop@solea.no"]
["Solea AS (tidl Rainfall AS )","A. Program- og prosjektgjennomføring","Helse Vest","avrop@solea.no"]
["Solea AS (tidl Rainfall AS )","C. Arkitektur","Helse Vest","avrop@solea.no"]
["Solea AS (tidl Rainfall AS )","E. Test og release","Helse Vest","avrop@solea.no"]
["Solea AS (tidl Rainfall AS )","F. Systemutvikling","Helse Vest","avrop@solea.no"]
["Solea AS (tidl Rainfall AS )","J. Tverrfaglige team","Helse Nord","avrop@solea.no"]
["Solea AS (tidl Rainfall AS )","J. Tverrfaglige team","Helse Vest","avrop@solea.no"]
["SOCO Norge AS ","E. Test og release","Helse Nord","post@soco.no"]
["SOCO Norge AS ","E. Test og release","Helse Sør-Øst","post@soco.no"]
["SOCO Norge AS ","E. Test og release","Helse Midt-Norge","post@soco.no"]
["SOCO Norge AS ","E. Test og release","Helse Vest","post@soco.no"]
["Sopra Steria AS ","A. Program- og prosjektgjennomføring","Helse Nord","helse@soprasteria.com"]
["Sopra Steria AS ","A. Program- og prosjektgjennomføring","Helse Sør-Øst","helse@soprasteria.com"]
["Sopra Steria AS ","A. Program- og prosjektgjennomføring","Helse Midt-Norge","helse@soprasteria.com"]
["Sopra Steria AS ","A. Program- og prosjektgjennomføring","Helse Vest","helse@soprasteria.com"]
["Sopra Steria AS ","B. Strategiplanlegging, rådgivning og innovasjon","Helse Nord","helse@soprasteria.com"]
["Sopra Steria AS ","B. Strategiplanlegging, rådgivning og innovasjon","Helse Sør-Øst","helse@soprasteria.com"]
["Sopra Steria AS ","B. Strategiplanlegging, rådgivning og innovasjon","Helse Midt-Norge","helse@soprasteria.com"]
["Sopra Steria AS ","B. Strategiplanlegging, rådgivning og innovasjon","Helse Vest","helse@soprasteria.com"]
["Sopra Steria AS ","C. Arkitektur","Helse Nord","helse@soprasteria.com"]
["Sopra Steria AS ","C. Arkitektur","Helse Sør-Øst","helse@soprasteria.com"]
["Sopra Steria AS ","C. Arkitektur","Helse Midt-Norge","helse@soprasteria.com"]
["Sopra Steria AS ","C. Arkitektur","Helse Vest","helse@soprasteria.com"]
["Sopra Steria AS ","D. Informasjonssikkerhet og ROS-analyser","Helse Nord","helse@soprasteria.com"]
["Sopra Steria AS ","D. Informasjonssikkerhet og ROS-analyser","Helse Sør-Øst","helse@soprasteria.com"]
["Sopra Steria AS ","D. Informasjonssikkerhet og ROS-analyser","Helse Midt-Norge","helse@soprasteria.com"]
["Sopra Steria AS ","D. Informasjonssikkerhet og ROS-analyser","Helse Vest","helse@soprasteria.com"]
["Sopra Steria AS ","E. Test og release","Helse Nord","helse@soprasteria.com"]
["Sopra Steria AS ","E. Test og release","Helse Sør-Øst","helse@soprasteria.com"]
["Sopra Steria AS ","E. Test og release","Helse Midt-Norge","helse@soprasteria.com"]
["Sopra Steria AS ","E. Test og release","Helse Vest","helse@soprasteria.com"]
["Sopra Steria AS ","F. Systemutvikling","Helse Nord","helse@soprasteria.com"]
["Sopra Steria AS ","F. Systemutvikling","Helse Sør-Øst","helse@soprasteria.com"]
["Sopra Steria AS ","F. Systemutvikling","Helse Midt-Norge","helse@soprasteria.com"]
["Sopra Steria AS ","F. Systemutvikling","Helse Vest","helse@soprasteria.com"]
["Sopra Steria AS ","G. Applikasjonsforvaltning, drift og forvaltning av IT-systemer og plattformer","Helse Nord","helse@soprasteria.com"]
["Sopra Steria AS ","G. Applikasjonsforvaltning, drift og forvaltning av IT-systemer og plattformer","Helse Sør-Øst","helse@soprasteria.com"]
["Sopra Steria AS ","G. Applikasjonsforvaltning, drift og forvaltning av IT-systemer og plattformer","Helse Midt-Norge","helse@soprasteria.com"]
["Sopra Steria AS ","G. Applikasjonsforvaltning, drift og forvaltning av IT-systemer og plattformer","Helse Vest","helse@soprasteria.com"]
["Sopra Steria AS ","H. Nettverk","Helse Nord","helse@soprasteria.com"]
["Sopra Steria AS ","H. Nettverk","Helse Sør-Øst","helse@soprasteria.com"]
["Sopra Steria AS ","H. Nettverk","Helse Midt-Norge","helse@soprasteria.com"]
["Sopra Steria AS ","H. Nettverk","Helse Vest","helse@soprasteria.com"]
["Sopra Steria AS ","J. Tverrfaglige team","Helse Nord","helse@soprasteria.com"]
["Sopra Steria AS ","J. Tverrfaglige team","Helse Sør-Øst","helse@soprasteria.com"]
["Sopra Steria AS ","J. Tverrfaglige team","Helse Midt-Norge","helse@soprasteria.com"]
["Sopra Steria AS ","J. Tverrfaglige team","Helse Vest","helse@soprasteria.com"]
["The Boston Consulting Group Nordic AB ","A. Program- og prosjektgjennomføring","Helse Nord","anbud@bcg.com"]
["The Boston Consulting Group Nordic AB ","A. Program- og prosjektgjennomføring","Helse Sør-Øst","anbud@bcg.com"]
["The Boston Consulting Group Nordic AB ","A. Program- og prosjektgjennomføring","Helse Midt-Norge","anbud@bcg.com"]
["The Boston Consulting Group Nordic AB ","A. Program- og prosjektgjennomføring","Helse Vest","anbud@bcg.com"]
["The Boston Consulting Group Nordic AB ","B. Strategiplanlegging, rådgivning og innovasjon","Helse Nord","anbud@bcg.com"]
["The Boston Consulting Group Nordic AB ","B. Strategiplanlegging, rådgivning og innovasjon","Helse Sør-Øst","anbud@bcg.com"]
["The Boston Consulting Group Nordic AB ","B. Strategiplanlegging, rådgivning og innovasjon","Helse Midt-Norge","anbud@bcg.com"]
["The Boston Consulting Group Nordic AB ","B. Strategiplanlegging, rådgivning og innovasjon","Helse Vest","anbud@bcg.com"]
["The Boston Consulting Group Nordic AB ","C. Arkitektur","Helse Nord","anbud@bcg.com"]
["The Boston Consulting Group Nordic AB ","C. Arkitektur","Helse Sør-Øst","anbud@bcg.com"]
["The Boston Consulting Group Nordic AB ","C. Arkitektur","Helse Midt-Norge","anbud@bcg.com"]
["The Boston Consulting Group Nordic AB ","C. Arkitektur","Helse Vest","anbud@bcg.com"]
["Advisense AS","B. Strategiplanlegging, rådgivning og innovasjon","Helse Nord","offentlig@transcendentgroup.com "]
["Advisense AS","B. Strategiplanlegging, rådgivning og innovasjon","Helse Sør-Øst","offentlig@transcendentgroup.com "]
["Advisense AS","B. Strategiplanlegging, rådgivning og innovasjon","Helse Midt-Norge","offentlig@transcendentgroup.com "]
["Advisense AS","B. Strategiplanlegging, rådgivning og innovasjon","Helse Vest","offentlig@transcendentgroup.com "]
["Advisense AS","D. Informasjonssikkerhet og ROS-analyser","Helse Nord","offentlig@transcendentgroup.com "]
["Advisense AS","D. Informasjonssikkerhet og ROS-analyser","Helse Sør-Øst","offentlig@transcendentgroup.com "]
["Advisense AS","D. Informasjonssikkerhet og ROS-analyser","Helse Midt-Norge","offentlig@transcendentgroup.com "]
["Advisense AS","D. Informasjonssikkerhet og ROS-analyser","Helse Vest","offentlig@transcendentgroup.com "]
["Twoday Conceptos AS ","F. Systemutvikling","Helse Nord","salg.conceptos@twoday.com"]
["Twoday Conceptos AS ","F. Systemutvikling","Helse Sør-Øst","salg.conceptos@twoday.com"]
["Twoday Conceptos AS ","F. Systemutvikling","Helse Midt-Norge","salg.conceptos@twoday.com"]
["Twoday Conceptos AS ","F. Systemutvikling","Helse Vest","salg.conceptos@twoday.com"]

{"sheet":"Lister","index":3,"n_rows":49,"n_cols":11,"rows_kept":49,"cut":false,"hidden":true,"merged":[]}
[null,null,"Område","Kolonne1","Delområde",null,null,null,null,null,"Leverandør"]
[null,null,"1 - Velg område fra rullegardinen her","Velg_omr","2 - Velg delområde fra rullegardinen her"]
[null,null,"Nord RHF","Nord ","A: Program og Prosjektgjennomføring"]
[null,null,"Midt-Norge RHF","Midt_Norge ","B: Strategiplanlegging, rådgivning og innovasjon"]
[null,null,"Vest RHF","Vest ","C: Arkitektur"]
[null,null,"Sør-Øst RHF","Sør_Øst","D: Informasjonssikkerhet og ROS-analyser"]
[null,null,null,null,"E: Test og release"]
[null,null,null,null,"F: Systemutvikling"]
[null,null,null,null,"G: Applikasjonsforvaltning, drift og forvaltning av IT-systemer og plattformer"]
[null,null,null,null,"H: Nettverk"]
[null,null,null,null,"I: Telekommunikasjon"]
[null,null,null,null,"J: Tverrfaglige team"]
[]
[]
[]
[]
[]
[]
[]
[]
[]
[]
[]
[]
[]
[]
[]
[]
[]
[]
[]
[]
[]
[]
[]
[]
[]
["Velg_omr",null,"Nord",null,"Midt_Norge","Vest","Sør_Øst"]
["2 - Velg delområde fra rullegardinen her",null,"2 - Velg delområde fra rullegardinen her",null,"2 - Velg delområde fra rullegardinen her","2 - Velg delområde fra rullegardinen her","2 - Velg delområde fra rullegardinen her"]
[null,null,"A: Program og Prosjektgjennomføring",null,"A: Program og Prosjektgjennomføring","A: Program og Prosjektgjennomføring","A: Program og Prosjektgjennomføring"]
[null,null,"B: Strategiplanlegging, rådgivning og innovasjon",null,"B: Strategiplanlegging, rådgivning og innovasjon","B: Strategiplanlegging, rådgivning og innovasjon","B: Strategiplanlegging, rådgivning og innovasjon"]
[null,null,"C: Arkitektur",null,"C: Arkitektur","C: Arkitektur","C: Arkitektur"]
[null,null,"D: Informasjonssikkerhet og ROS-analyser",null,"D: Informasjonssikkerhet og ROS-analyser","D: Informasjonssikkerhet og ROS-analyser","D: Informasjonssikkerhet og ROS-analyser"]
[null,null,"E: Test og release",null,"E: Test og release","E: Test og release","E: Test og release"]
[null,null,"F: Systemutvikling",null,"F: Systemutvikling","F: Systemutvikling","F: Systemutvikling"]
[null,null,"G: Applikasjonsforvaltning, drift og forvaltning av IT-systemer og plattformer",null,"G: Applikasjonsforvaltning, drift og forvaltning av IT-systemer og plattformer","G: Applikasjonsforvaltning, drift og forvaltning av IT-systemer og plattformer","G: Applikasjonsforvaltning, drift og forvaltning av IT-systemer og plattformer"]
[null,null,"H: Nettverk",null,"H: Nettverk","H: Nettverk","H: Nettverk"]
[null,null,"I: Telekommunikasjon",null,"I: Telekommunikasjon","I: Telekommunikasjon","I: Telekommunikasjon"]
[null,null,"J: Tverrfaglige team",null,"J: Tverrfaglige team","J: Tverrfaglige team","J: Tverrfaglige team"]