{"text_format":"1","workbook":"xlsx","n_sheets":4,"sheets":["Bestillingsskjema","Database","Lister","Rangering"],"not_rendered":{"charts":0,"images":2,"macros":1,"external_links":0,"defined_names":8,"comments":0,"pivot_tables":0},"unopened":[],"bounds":{"document_bytes":16777216,"sheet_cells":100000,"rows_first":2000,"rows_last":500,"rows_between":2000,"halvings":0,"cell_chars":16384,"cell_head_chars":4096},"cells_cut":0,"cells_raw":0,"read":"whole","date_system":"1900"}

{"sheet":"Bestillingsskjema","index":0,"n_rows":28,"n_cols":17,"rows_kept":28,"cut":false,"hidden":false,"merged":[[7,2,7,5],[9,2,9,5],[11,2,11,5]]}
[]
[null,null,null,null,null,null,null,null,null,null,null,null,null,{"$f":"VLOOKUP(C8,Lister!$C$2:$D$6,1,FALSE)","v":"1 - Velg område fra rullegardinen her"}]
[]
[]
[null,null,"Bestillingsskjema for Konsulenttjenester strategi- og lederutvikling",null,null,null,null,null,null,null,null,null,null,{"$f":"VLOOKUP(C8,FINN_OMRÅDE,2,FALSE)","v":"Velg_omr"}]
[null,null,null,null,null,null,null,null,null,null,null,null,null,{"$f":"VLOOKUP(C10,Lister!$E$2:$E$8,1,FALSE)","v":"2 - Velg delområde fra rullegardinen her"}]
[]
[null,null,"1 - Velg område fra rullegardinen her",null,null,null,null,"Veiledning til bestillingsskjema"]
[]
[null,null,"2 - Velg delområde fra rullegardinen her"]
[null,null,null,null,null,null,null,"Dette bestillingsskjemaet gjelder for Konsulenttjenster strategi- og lederutvikling."]
[null,null,null,null,null,null,null,"Bestiller skal avrope ved minikonkurranse på alle oppdrag. \nLikelydene om konsulent(er) skal sendes til alle avtaleleverandørene."]
[]
[null,null,null,{"$f":"\"Avtaleleverandører i alfabetisk rekkefølge - \"&C10","v":"Avtaleleverandører i alfabetisk rekkefølge - 2 - Velg delområde fra rullegardinen her"},null,null,null,"I dette bestillingskjemaet ligger kontaktinformasjonen til alle leverandørene. Ved å bruke dette skjemaet genereres det automatisk e-post til alle leverandørene for valgt region og delområde.",null,null,null,null,{"$f":"IF(D14>0,\"\",\"x\")","v":""}]
[]
[null,null,"Antall","Leverandør","E-post","Telefon",null,"Hvordan benytte bestillingskjemaet:",null,null,null,null,{"$f":"IF(D16>0,\"\",\"x\")","v":""}]
[null,null,1,{"$f":"VLOOKUP($N17,Database!$A$2:$R$1463,5,FALSE)","v":0},{"$f":"VLOOKUP($N17,Database!$A$2:$R$1463,6,FALSE)","v":0},{"$f":"VLOOKUP($N17,Database!$A$2:$R$1463,7,FALSE)","v":0},null,"1. Velgditt regionale helseforeta til rullegardin",null,null,null,null,"x",{"$f":"$N$2&$N$6&$C$17","v":"1 - Velg område fra rullegardinen her2 - Velg delområde fra rullegardinen her1"},null,{"$f":"IF(D17>0,E17,\"\")","v":""}]
[null,null,2,{"$f":"VLOOKUP($N18,Database!$A$2:$R$1463,5,FALSE)","v":0},{"$f":"VLOOKUP($N18,Database!$A$2:$R$1463,6,FALSE)","v":0},{"$f":"VLOOKUP($N18,Database!$A$2:$R$1463,7,FALSE)","v":0},null,"2. Velg konsulentspesialitet (delområde)-",null,null,null,null,"x",{"$f":"$N$2&$N$6&$C$18","v":"1 - Velg område fra rullegardinen her2 - Velg delområde fra rullegardinen her2"},null,""]
[null,null,3,{"$f":"VLOOKUP($N19,Database!$A$2:$R$1463,5,FALSE)","v":0},{"$f":"VLOOKUP($N19,Database!$A$2:$R$1463,6,FALSE)","v":0},{"$f":"VLOOKUP($N19,Database!$A$2:$R$1463,7,FALSE)","v":0},null,"3. Klikk for å sende en e-post til alle avtaleleverandører",null,null,null,null,"x",{"$f":"$N$2&$N$6&$C$19","v":"1 - Velg område fra rullegardinen her2 - Velg delområde fra rullegardinen her3"},null,""]
[null,null,4,{"$f":"VLOOKUP($N20,Database!$A$2:$R$1463,5,FALSE)","v":0},{"$f":"VLOOKUP($N20,Database!$A$2:$R$1463,6,FALSE)","v":0},{"$f":"VLOOKUP($N20,Database!$A$2:$R$1463,7,FALSE)","v":0},null,"4. Legg oppdragsbeskrivelsen som et vedlegg i denne e-posten",null,null,null,null,"x",{"$f":"$N$2&$N$6&$C$20","v":"1 - Velg område fra rullegardinen her2 - Velg delområde fra rullegardinen her4"},null,""]
[null,null,5,{"$f":"VLOOKUP($N21,Database!$A$2:$R$1463,5,FALSE)","v":0},{"$f":"VLOOKUP($N21,Database!$A$2:$R$1463,6,FALSE)","v":0},{"$f":"VLOOKUP($N21,Database!$A$2:$R$1463,7,FALSE)","v":0},null,"5. Send",null,null,null,null,"x",{"$f":"$N$2&$N$6&$C$21","v":"1 - Velg område fra rullegardinen her2 - Velg delområde fra rullegardinen her5"},null,""]
[null,null,6,{"$f":"VLOOKUP($N22,Database!$A$2:$R$1463,5,FALSE)","v":0},{"$f":"VLOOKUP($N22,Database!$A$2:$R$1463,6,FALSE)","v":0},{"$f":"VLOOKUP($N22,Database!$A$2:$R$1463,7,FALSE)","v":0},null,null,null,null,null,null,"x",{"$f":"$N$2&$N$6&$C$22","v":"1 - Velg område fra rullegardinen her2 - Velg delområde fra rullegardinen her6"},null,""]
[null,null,7,{"$f":"VLOOKUP($N23,Database!$A$2:$R$1463,5,FALSE)","v":0},{"$f":"VLOOKUP($N23,Database!$A$2:$R$1463,6,FALSE)","v":0},{"$f":"VLOOKUP($N23,Database!$A$2:$R$1463,7,FALSE)","v":0},null,null,null,null,null,null,"x",{"$f":"$N$2&$N$6&$C$23","v":"1 - Velg område fra rullegardinen her2 - Velg delområde fra rullegardinen her7"},null,""]
[null,null,8,{"$f":"VLOOKUP($N24,Database!$A$2:$R$1463,5,FALSE)","v":0},{"$f":"VLOOKUP($N24,Database!$A$2:$R$1463,6,FALSE)","v":0},{"$f":"VLOOKUP($N24,Database!$A$2:$R$1463,7,FALSE)","v":0},null,null,null,null,null,null,"x",{"$f":"$N$2&$N$6&$C$24","v":"1 - Velg område fra rullegardinen her2 - Velg delområde fra rullegardinen her8"},null,""]
[null,null,9,{"$f":"VLOOKUP($N25,Database!$A$2:$R$1463,5,FALSE)","v":0},{"$f":"VLOOKUP($N25,Database!$A$2:$R$1463,6,FALSE)","v":0},{"$f":"VLOOKUP($N25,Database!$A$2:$R$1463,7,FALSE)","v":0},null,null,null,null,null,null,"x",{"$f":"$N$2&$N$6&$C$25","v":"1 - Velg område fra rullegardinen her2 - Velg delområde fra rullegardinen her9"},null,""]
[null,null,10,{"$f":"VLOOKUP($N26,Database!$A$2:$R$1463,5,FALSE)","v":0},{"$f":"VLOOKUP($N26,Database!$A$2:$R$1463,6,FALSE)","v":0},{"$f":"VLOOKUP($N26,Database!$A$2:$R$1463,7,FALSE)","v":0},null,null,null,null,null,null,"x",{"$f":"$N$2&$N$6&$C$26","v":"1 - Velg område fra rullegardinen her2 - Velg delområde fra rullegardinen her10"},null,""]
[]
[null,null,null,null,null,null,null,null,null,null,null,null,null,null,null,null,{"$f":"P17&\";\"&P18&\";\"&P19&\";\"&P20&\";\"&P21&\";\"&P22&\";\"&P23&\";\"&P24&\";\"&P25&\";\"&P26","v":";;;;;;;;;"}]

{"sheet":"Database","index":1,"n_rows":1463,"n_cols":18,"rows_kept":1463,"cut":false,"hidden":true,"merged":[]}
["Kode","Område","Delområde","Rangering","Leverandør","E-post","Telefon","Kolonne3","Kolonne4","Kolonne5","Kolonne6","Kolonne7","Kolonne8","Kolonne9","Kolonne10","Kolonne11","Kolonne12","Kolonne13"]
[{"$f":"Database!$B2&Database!$C2&Database!$D2","v":"Nord RHFDelkontrakt A: Strategi - og organisasjonsutvikling - Alle RHF1"},"Nord RHF","Delkontrakt A: Strategi - og organisasjonsutvikling - Alle RHF",1,"Advansia AS","advansia@advansia.no",40639194]
[{"$f":"Database!$B3&Database!$C3&Database!$D3","v":"Nord RHFDelkontrakt A: Strategi - og organisasjonsutvikling - Alle RHF2"},"Nord RHF","Delkontrakt A: Strategi - og organisasjonsutvikling - Alle RHF",2,"Azets Consulting AS","anbud@azetsconsulting.no",95260687]
[{"$f":"Database!$B4&Database!$C4&Database!$D4","v":"Nord RHFDelkontrakt A: Strategi - og organisasjonsutvikling - Alle RHF3"},"Nord RHF","Delkontrakt A: Strategi - og organisasjonsutvikling - Alle RHF",3,"Bouvet Norge AS","Sykehusinnkjop2024strategi@bouvet.no",91361889]
[{"$f":"Database!$B5&Database!$C5&Database!$D5","v":"Nord RHFDelkontrakt A: Strategi - og organisasjonsutvikling - Alle RHF4"},"Nord RHF","Delkontrakt A: Strategi - og organisasjonsutvikling - Alle RHF",4,"Capgemini AS","cginvent.tilbud.no@capgemini.com",41521570]
[{"$f":"Database!$B6&Database!$C6&Database!$D6","v":"Nord RHFDelkontrakt A: Strategi - og organisasjonsutvikling - Alle RHF5"},"Nord RHF","Delkontrakt A: Strategi - og organisasjonsutvikling - Alle RHF",5,"Deloitte AS","noanbud@deloitte.no",90791885]
[{"$f":"Database!$B7&Database!$C7&Database!$D7","v":"Nord RHFDelkontrakt A: Strategi - og organisasjonsutvikling - Alle RHF6"},"Nord RHF","Delkontrakt A: Strategi - og organisasjonsutvikling - Alle RHF",6,"Ernst & Young AS","offentlige.anskaffelser@no.ey.com",90195907]
[{"$f":"Database!$B8&Database!$C8&Database!$D8","v":"Nord RHFDelkontrakt A: Strategi - og organisasjonsutvikling - Alle RHF7"},"Nord RHF","Delkontrakt A: Strategi - og organisasjonsutvikling - Alle RHF",7,"KPMG AS","helse@kpmg.no",40637814]
[{"$f":"Database!$B9&Database!$C9&Database!$D9","v":"Nord RHFDelkontrakt A: Strategi - og organisasjonsutvikling - Alle RHF8"},"Nord RHF","Delkontrakt A: Strategi - og organisasjonsutvikling - Alle RHF",8,"PA Consulting Group AS","grete.kvernland-berg@paconsulting.com",99250356]
[{"$f":"Database!$B10&Database!$C10&Database!$D10","v":"Nord RHFDelkontrakt A: Strategi - og organisasjonsutvikling - Alle RHF9"},"Nord RHF","Delkontrakt A: Strategi - og organisasjonsutvikling - Alle RHF",9,"PricewaterhouseCoopers AS","no_admin.helse@pwc.com",95261303]
[{"$f":"Database!$B11&Database!$C11&Database!$D11","v":"Nord RHFDelkontrakt A: Strategi - og organisasjonsutvikling - Alle RHF10"},"Nord RHF","Delkontrakt A: Strategi - og organisasjonsutvikling - Alle RHF",10,"Sopra Steria AS","helse@soprasteria.com",93428425]
[{"$f":"Database!$B12&Database!$C12&Database!$D12","v":""}]
[{"$f":"Database!$B13&Database!$C13&Database!$D13","v":"Nord RHFDelkontrakt B1: Leder - og ledelsesutvikling - Helse Nord RHF1"},"Nord RHF","Delkontrakt B1: Leder - og ledelsesutvikling - Helse Nord RHF",1,"A-2 Norge AS","utlysninger@a-2.no",90986467]
[{"$f":"Database!$B14&Database!$C14&Database!$D14","v":"Nord RHFDelkontrakt B1: Leder - og ledelsesutvikling - Helse Nord RHF2"},"Nord RHF","Delkontrakt B1: Leder - og ledelsesutvikling - Helse Nord RHF",2,"Advansia AS","advansia@advansia.no",40639194]
[{"$f":"Database!$B15&Database!$C15&Database!$D15","v":"Nord RHFDelkontrakt B1: Leder - og ledelsesutvikling - Helse Nord RHF3"},"Nord RHF","Delkontrakt B1: Leder - og ledelsesutvikling - Helse Nord RHF",3,"AFF-Stiftelsen administrativt forskningsfond","Firmapost@aff.no",99553187]
[{"$f":"Database!$B16&Database!$C16&Database!$D16","v":"Nord RHFDelkontrakt B1: Leder - og ledelsesutvikling - Helse Nord RHF4"},"Nord RHF","Delkontrakt B1: Leder - og ledelsesutvikling - Helse Nord RHF",4,"Arvadus AS","post@arvadus.no",92674447]
[{"$f":"Database!$B17&Database!$C17&Database!$D17","v":"Nord RHFDelkontrakt B1: Leder - og ledelsesutvikling - Helse Nord RHF5"},"Nord RHF","Delkontrakt B1: Leder - og ledelsesutvikling - Helse Nord RHF",5,"Assessit AS","sentralbord@assessit.no",95480649]
[{"$f":"Database!$B18&Database!$C18&Database!$D18","v":"Nord RHFDelkontrakt B1: Leder - og ledelsesutvikling - Helse Nord RHF6"},"Nord RHF","Delkontrakt B1: Leder - og ledelsesutvikling - Helse Nord RHF",6,"Azets Consulting AS","anbud@azetsconsulting.no",95260687]
[{"$f":"Database!$B19&Database!$C19&Database!$D19","v":"Nord RHFDelkontrakt B1: Leder - og ledelsesutvikling - Helse Nord RHF7"},"Nord RHF","Delkontrakt B1: Leder - og ledelsesutvikling - Helse Nord RHF",7,"Ernst & Young AS","offentlige.anskaffelser@no.ey.com",90195907]
[{"$f":"Database!$B20&Database!$C20&Database!$D20","v":"Nord RHFDelkontrakt B1: Leder - og ledelsesutvikling - Helse Nord RHF8"},"Nord RHF","Delkontrakt B1: Leder - og ledelsesutvikling - Helse Nord RHF",8,"Moment organisasjon og ledelse","post@moment.consulting",91689161]
[{"$f":"Database!$B21&Database!$C21&Database!$D21","v":"Nord RHFDelkontrakt B1: Leder - og ledelsesutvikling - Helse Nord RHF9"},"Nord RHF","Delkontrakt B1: Leder - og ledelsesutvikling - Helse Nord RHF",9,"PricewaterhouseCoopers AS","no_admin.helse@pwc.com",95261303]
[{"$f":"Database!$B22&Database!$C22&Database!$D22","v":"Nord RHFDelkontrakt B1: Leder - og ledelsesutvikling - Helse Nord RHF10"},"Nord RHF","Delkontrakt B1: Leder - og ledelsesutvikling - Helse Nord RHF",10,"Sirius Act AS","christian@siriusact.no",99098647]
[{"$f":"Database!$B23&Database!$C23&Database!$D23","v":""}]
[{"$f":"Database!$B24&Database!$C24&Database!$D24","v":""}]
[{"$f":"Database!$B25&Database!$C25&Database!$D25","v":""}]
[{"$f":"Database!$B26&Database!$C26&Database!$D26","v":"Midt-Norge RHFDelkontrakt A: Strategi - og organisasjonsutvikling - Alle RHF1"},"Midt-Norge RHF","Delkontrakt A: Strategi - og organisasjonsutvikling - Alle RHF",1,"Advansia AS","advansia@advansia.no"]
[{"$f":"Database!$B27&Database!$C27&Database!$D27","v":"Midt-Norge RHFDelkontrakt A: Strategi - og organisasjonsutvikling - Alle RHF2"},"Midt-Norge RHF","Delkontrakt A: Strategi - og organisasjonsutvikling - Alle RHF",2,"Azets Consulting AS","anbud@azetsconsulting.no"]
[{"$f":"Database!$B28&Database!$C28&Database!$D28","v":"Midt-Norge RHFDelkontrakt A: Strategi - og organisasjonsutvikling - Alle RHF3"},"Midt-Norge RHF","Delkontrakt A: Strategi - og organisasjonsutvikling - Alle RHF",3,"Bouvet Norge AS","Sykehusinnkjop2024strategi@bouvet.no"]
[{"$f":"Database!$B29&Database!$C29&Database!$D29","v":"Midt-Norge RHFDelkontrakt A: Strategi - og organisasjonsutvikling - Alle RHF4"},"Midt-Norge RHF","Delkontrakt A: Strategi - og organisasjonsutvikling - Alle RHF",4,"Capgemini AS","cginvent.tilbud.no@capgemini.com"]
[{"$f":"Database!$B30&Database!$C30&Database!$D30","v":"Midt-Norge RHFDelkontrakt A: Strategi - og organisasjonsutvikling - Alle RHF5"},"Midt-Norge RHF","Delkontrakt A: Strategi - og organisasjonsutvikling - Alle RHF",5,"Deloitte AS","noanbud@deloitte.no"]
[{"$f":"Database!$B31&Database!$C31&Database!$D31","v":"Midt-Norge RHFDelkontrakt A: Strategi - og organisasjonsutvikling - Alle RHF6"},"Midt-Norge RHF","Delkontrakt A: Strategi - og organisasjonsutvikling - Alle RHF",6,"Ernst & Young AS","offentlige.anskaffelser@no.ey.com"]
[{"$f":"Database!$B32&Database!$C32&Database!$D32","v":"Midt-Norge RHFDelkontrakt A: Strategi - og organisasjonsutvikling - Alle RHF7"},"Midt-Norge RHF","Delkontrakt A: Strategi - og organisasjonsutvikling - Alle RHF",7,"KPMG AS","helse@kpmg.no"]
[{"$f":"Database!$B33&Database!$C33&Database!$D33","v":"Midt-Norge RHFDelkontrakt A: Strategi - og organisasjonsutvikling - Alle RHF8"},"Midt-Norge RHF","Delkontrakt A: Strategi - og organisasjonsutvikling - Alle RHF",8,"PA Consulting Group AS","grete.kvernland-berg@paconsulting.com"]
[{"$f":"Database!$B34&Database!$C34&Database!$D34","v":"Midt-Norge RHFDelkontrakt A: Strategi - og organisasjonsutvikling - Alle RHF9"},"Midt-Norge RHF","Delkontrakt A: Strategi - og organisasjonsutvikling - Alle RHF",9,"PricewaterhouseCoopers AS","no_admin.helse@pwc.com"]
[{"$f":"Database!$B35&Database!$C35&Database!$D35","v":"Midt-Norge RHFDelkontrakt A: Strategi - og organisasjonsutvikling - Alle RHF10"},"Midt-Norge RHF","Delkontrakt A: Strategi - og organisasjonsutvikling - Alle RHF",10,"Sopra Steria AS","helse@soprasteria.com"]
[{"$f":"Database!$B36&Database!$C36&Database!$D36","v":""}]
[{"$f":"Database!$B37&Database!$C37&Database!$D37","v":"Midt-Norge RHFDelkontrakt B2: Leder - og ledelsesutvikling - Helse Midt-Norge RHF1"},"Midt-Norge RHF","Delkontrakt B2: Leder - og ledelsesutvikling - Helse Midt-Norge RHF",1,"AFF-Stiftelsen administrativt forskningsfond","Firmapost@aff.no",99553187]
[{"$f":"Database!$B38&Database!$C38&Database!$D38","v":"Midt-Norge RHFDelkontrakt B2: Leder - og ledelsesutvikling - Helse Midt-Norge RHF2"},"Midt-Norge RHF","Delkontrakt B2: Leder - og ledelsesutvikling - Helse Midt-Norge RHF",2,"Assessit AS","sentralbord@assessit.no",95480649]
[{"$f":"Database!$B39&Database!$C39&Database!$D39","v":"Midt-Norge RHFDelkontrakt B2: Leder - og ledelsesutvikling - Helse Midt-Norge RHF3"},"Midt-Norge RHF","Delkontrakt B2: Leder - og ledelsesutvikling - Helse Midt-Norge RHF",3,"Azets Consulting AS","anbud@azetsconsulting.no",95260687]
[{"$f":"Database!$B40&Database!$C40&Database!$D40","v":"Midt-Norge RHFDelkontrakt B2: Leder - og ledelsesutvikling - Helse Midt-Norge RHF4"},"Midt-Norge RHF","Delkontrakt B2: Leder - og ledelsesutvikling - Helse Midt-Norge RHF",4,"Ernst & Young AS","offentlige.anskaffelser@no.ey.com",90195907]
{"$rows_left_out":1424}
{"sheet":"Lister","index":2,"n_rows":41,"n_cols":11,"rows_kept":41,"cut":false,"hidden":true,"merged":[]}
[null,null,"Område","Kolonne1","Delområde",null,null,null,null,null,"Leverandør"]
[null,null,"1 - Velg område fra rullegardinen her","Velg_omr","2 - Velg delområde fra rullegardinen her"]
[null,null,"Nord RHF","Nord ","Delkontrakt A: Strategi - og organisasjonsutvikling - Alle RHF"]
[null,null,"Midt-Norge RHF","Midt_Norge ","Delkontrakt B1: Leder - og ledelsesutvikling - Helse Nord RHF"]
[null,null,"Vest RHF","Vest ","Delkontrakt B2: Leder - og ledelsesutvikling - Helse Midt-Norge RHF"]
[null,null,"Sør-Øst RHF","Sør_Øst","Delkontrakt B3: Leder - og ledelsesutvikling - Helse Vest RHF"]
[null,null,null,null,"Delkontrakt B4: Leder - og ledelsesutvikling - Helse Sør-Øst RHF"]
[]
[]
[]
[]
[]
[]
[]
[]
[]
[]
[]
[]
[]
[]
[]
[]
[]
[]
[]
[]
[]
[]
[]
[]
[]
[]
[]
[]
[]
[]
["Velg_omr",null,"Nord",null,"Midt_Norge","Vest","Sør_Øst"]
["2 - Velg delområde fra rullegardinen her",null,"2 - Velg delområde fra rullegardinen her",null,"2 - Velg delområde fra rullegardinen her","2 - Velg delområde fra rullegardinen her","2 - Velg delområde fra rullegardinen her"]
[null,null,"Delkontrakt A: Strategi - og organisasjonsutvikling - Alle RHF",null,"Delkontrakt A: Strategi - og organisasjonsutvikling - Alle RHF","Delkontrakt A: Strategi - og organisasjonsutvikling - Alle RHF","Delkontrakt A: Strategi - og organisasjonsutvikling - Alle RHF"]
{"$rows_left_out":2}
{"sheet":"Rangering","index":3,"n_rows":71,"n_cols":31,"rows_kept":71,"cut":false,"hidden":true,"merged":[]}
[]
[]
[]
[]
[]
[]
[null,"Program og Prosjektgjennomføring",null,null,null,null,"Strategiplanlegging, rådgivning og innovasjon",null,null,null,null,"Arkitektur",null,null,null,null,"Informasjonssikkerhet",null,null,null,null,"Testledelse og Release-gjennomføring"]
[null,"Rangering","Helse Nord RHF","Helse Midt-Norge RHF","Helse Vest RHF","Helse Sør-Øst RHF","Rangering","Helse Nord RHF","Helse Midt-Norge RHF","Helse Vest RHF","Helse Sør-Øst RHF","Rangering","Helse Nord RHF","Helse Midt-Norge RHF","Helse Vest RHF","Helse Sør-Øst RHF","Rangering","Helse Nord RHF","Helse Midt-Norge RHF","Helse Vest RHF","Helse Sør-Øst RHF","Rangering","Helse Nord RHF","Helse Midt-Norge RHF","Helse Vest RHF","Helse Sør-Øst RHF"]
[null,1,"A-2 Norge","Atea AS","A-2 Norge","Accenture AS",1,"A-2 Norge","A-2 Norge","A-2 Norge","A-2 Norge",1,"A-2 Norge","Acando AS","A-2 Norge","A-2 Norge",1,"Acando AS","Acando AS","Acando AS","Bouvet Norge AS",1,"Acando AS","Acando AS","Acando AS","Acando AS"]
[null,2,"Accenture AS","Atkins Norge AS","Accenture AS","Atkins Norge AS",2,"Accenture AS","Atkins Norge AS","Accenture AS","Accenture AS",2,"Acando AS","Atkins Norge AS","Acando AS","Acando AS",2,"Accenture AS","Bouvet Norge AS","Accenture AS","Ernst & Young AS",2,"Atkins Norge AS","Atkins Norge AS","Accenture AS","Atkins Norge AS"]
[null,3,"Atea AS","Bouvet Norge AS","Arthur D. Little","Bouvet Norge AS",3,"Atkins Norge AS","Bouvet Norge AS","Arthur D. Little","Arthur D. Little",3,"Accenture AS","Bouvet Norge AS","Accenture AS","Atkins Norge AS",3,"Bouvet Norge AS","Ernst & Young AS","Bouvet Norge AS","mnemonic AS",3,"Bouvet Norge AS","Bouvet Norge AS","Atkins Norge AS","Capgemini Norge AS"]
[null,4,"Bouvet Norge AS","Datametrix","Atea AS","Datametrix",4,"BearingPoint Norway AS","Experis AS","Atkins Norge AS","Atkins Norge AS",4,"Atkins Norge AS","Ernst & Young AS","Atkins Norge AS","Bouvet Norge AS",4,"Deloitte AS","EVRY Norge AS","Capgemini Norge AS","Norconsult AS",4,"Experis AS","Experis AS","Bouvet Norge AS","Experis AS"]
[null,5,"Datametrix","Ernst & Young AS","Atkins Norge AS","Deloitte AS",5,"Bouvet Norge AS","Metier AS","BearingPoint Norway AS","BearingPoint Norway AS",5,"Bouvet Norge AS","EVRY Norge AS","BearingPoint Norway AS","Capra Consulting",5,"Ernst & Young AS","KPMG AS","Cisco Systems Norway AS","Sopra Steria AS",5,"Fornebu Consulting AS","SOCO Norge AS","Capgemini Norge AS","Fornebu Consulting AS"]
[null,6,"Deloitte AS","EVERY Norge AS","BearingPoint Norway AS","Ernst & Young AS",6,"Datametrix","Sopra Steria AS","Bouvet Norge AS","Bouvet Norge AS",6,"Ernst & Young AS","Experis AS","Bouvet Norge AS","Ernst & Young AS",6,"EVRY Norge AS",null,"Deloitte AS","Transcendent Group",6,"SOCO Norge AS","Sopra Steria AS","CSC Norge AS","Inmeta Consulting AS"]
[null,7,"Ernst & Young AS","Experis AS","Bouvet Norge AS","EVRY Norge AS",7,"Deloitte AS",null,"Cisco Systems Norway AS","Cisco Systems Norway AS",7,"Experis AS","Fornebu Consulting AS","Capgemini Norge AS","Experis AS",7,"Experis AS",null,"DNV GL Business Assurance Norway AS",null,7,"Sopra Steria AS",null,"EBS Consulting AS","SOCO Norge AS"]
[null,8,"EVERY Norge AS","Metier AS","Capgemini Norge AS","Experis AS",8,"Ernst & Young AS",null,"CSC Norge AS","CSC Norge AS",8,"Fornebu Consulting AS","Sopra Steria AS","CSC Norge AS","Fornebu Consulting AS",8,"Fornebu Consulting AS",null,"Ernst & Young AS",null,8,null,null,"Experis AS","Sopra Steria AS"]
[null,9,"Experis AS","Sopra Steria AS","CSC Norge AS","Fornebu Consulting AS",9,"Experis AS",null,"Datametrix","Datametrix",9,"Netsense AS",null,"Ernst & Young AS","International Business Machines AS",9,"KPMG AS",null,"EVRY Norge AS",null,9,null,null,"Fornebu Consulting AS","Visma Consulting AS"]
[null,10,"Fornebu Consulting AS",null,"Datametrix","Holte Consulting AS",10,"Fornebu Consulting AS",null,"Deloitte AS","Deloitte AS",10,"PwC AS",null,"EVRY Norge AS","Netsense AS",10,"PwC AS",null,"Experis AS",null,10,null,null,"HiQ Göteborg AB"]
[null,11,"KPMG AS",null,"Deloitte AS","Inmeta Consulting AS",11,"HiQ Göteborg AB",null,"DNV GL Business Assurance Norway AS","DNV GL Business Assurance Norway AS",11,"Qualisoft AS",null,"Experis AS","PwC AS",11,"Sopra Steria AS",null,"Fornebu Consulting AS",null,11,null,null,"International Business Machines AS"]
[null,12,"Metier AS",null,"EBS Consulting AS","International Business Machines AS",12,"International Business Machines AS",null,"Ernst & Young AS","Ernst & Young AS",12,"Sopra Steria AS",null,"Fornebu Consulting AS","Sopra Steria AS",12,"Transcendent Group",null,"KPMG AS",null,12,null,null,"KPMG AS"]
[null,13,"PA Consulting Group AS",null,"Ernst & Young AS","Metier AS",13,"Karabin AS",null,"Experis AS","Experis AS",13,null,null,"HiQ Göteborg AB","Visma Consulting AS",13,null,null,"Profitbase AS",null,13,null,null,"Omega AS"]
[null,14,"PwC AS",null,"EVRY Norge AS","Sopra Steria AS",14,"KPMG AS",null,"Fornebu Consulting AS","Fornebu Consulting AS",14,null,null,"International Business Machines AS",null,14,null,null,"PwC AS",null,14,null,null,"SOCO Norge AS"]
[null,15,"Sopra Steria AS",null,"Experis AS","Visma Consulting AS",15,"Metier AS",null,"HiQ Göteborg AB","HiQ Göteborg AB",15,null,null,"KPMG AS",null,15,null,null,"Sopra Steria AS",null,15,null,null,"Sopra Steria AS"]
[null,16,null,null,"Fornebu Consulting AS",null,16,"PA Consulting Group AS",null,"International Business Machines AS","International Business Machines AS",16,null,null,"mnemonic AS",null,16,null,null,"Transcendent Group"]
[null,17,null,null,"HiQ Göteborg AB",null,17,"PwC AS",null,"Karabin AS","Karabin AS",17,null,null,"Netsense AS"]
[null,18,null,null,"Holte Consulting AS",null,18,"Qualisoft AS",null,"KPMG AS","KPMG AS",18,null,null,"Omega AS"]
[null,19,null,null,"International Business Machines AS",null,19,"Sopra Steria AS",null,"McKinsey & Company ","McKinsey & Company ",19,null,null,"PwC AS"]
[null,20,null,null,"Karabin AS",null,20,"The Boston Consulting Group",null,"Metier AS","Metier AS",20,null,null,"Qualisoft AS"]
[null,21,null,null,"KPMG AS",null,21,null,null,"PA Consulting Group AS","PA Consulting Group AS",21,null,null,"Sopra Steria AS"]
[null,22,null,null,"McKinsey & Company ",null,22,null,null,"Profitbase AS","Profitbase AS"]
[null,23,null,null,"Metier AS",null,23,null,null,"PwC AS","PwC AS"]
[null,24,null,null,"Omega AS",null,24,null,null,"Qualisoft AS","Qualisoft AS"]
[null,25,null,null,"PA Consulting Group AS",null,25,null,null,"Sopra Steria AS","Sopra Steria AS"]
[null,26,null,null,"Profitbase AS",null,26,null,null,"The Boston Consulting Group","Sprint Consulting AS"]
[null,27,null,null,"PwC AS",null,27,null,null,null,"The Boston Consulting Group"]
[null,28,null,null,"Qualisoft AS"]
[null,29,null,null,"Sopra Steria AS"]
[null,30,null,null,"The Boston Consulting Group"]
[]
[]
{"$rows_left_out":31}